{
  "$schema": "https://docs.renovatebot.com/renovate-schema.json",
  "extends": [
    "config:recommended",
    "docker:enableMajor",
    ":separateMultipleMajorReleases",
    ":prHourlyLimitNone"
  ],
  "branchPrefix": "chore/renovabot-",
  "branchNameStrict": true,
  "commitMessagePrefix": "chore(renovabot): ",
  "commitMessageAction": "update",
  "commitMessageLowerCase": "auto",
  "lockFileMaintenance": {
    "enabled": true,
    "automerge": true
  },
  "packageRules": [
    {
      "matchDepTypes": ["devDependencies"],
      "matchPackagePatterns": ["lint", "prettier"],
      "automerge": true
    },
    {
      "matchUpdateTypes": ["minor", "patch"],
      "matchCurrentVersion": "!/^0/",
      "automerge": true
    }
  ]
}
