Refract
{
	$envmap 				env_cubemap
	$model 					"1"
	$refracttinttexture 	"spacecombat2\ltbrandon\crystals\crystal_01_defuse"
	$refracttint			"[1 0 0]"
	$normalmap				"spacecombat2\ltbrandon\crystals\crystal_01_normal"
	$surfaceprop			"metal"
	$refractamount 			.06
	$bluramount 			2
}