VertexLitGeneric
{
	$model 					"1"
	$basetexture		 	"spacecombat2\ltbrandon\crystals\crystal_01_defuse"
	$bumpmap				"spacecombat2\ltbrandon\crystals\crystal_01_normal"
	$envmap 				env_cubemap
	$envmaptint				"[0.5 0.12 0.12]"
	$color2					"[4 0.3 0]"
	$surfaceprop			"metal"
	$phong 1
	$halflambert 1
}