; SPDX-FileCopyrightText: 2021 Freifunk Chemnitz e.V.
; SPDX-License-Identifier: Unlicense
;
$ORIGIN mittweida.freifunk.net.
$TTL 604800
@ IN SOA ns1.chemnitz.freifunk.net. postmaster.chemnitz.freifunk.net. (
     2023042202  ; Serial
     14400       ; Refresh
     1800        ; Retry
     604800      ; Expire
     86400  )    ; Minimum
;
;A
*	IN	A	78.46.48.196
@   IN  A   78.46.48.196
;
;AAAA
*	IN	AAAA	2a01:4f8:110:1405::1
@   IN  AAAA    2a01:4f8:110:1405::1
;
;NS
@	IN	NS	ns1.chemnitz.freifunk.net.
@   IN	NS	ns2.chemnitz.freifunk.net.
