******************************************
     Fox Sports Interactive Golf 99 (c)  
     Type: Sports golf
******************************************

It is all in the name. a Great Gold sim.

Just run setup.exe
minium install

don't del the install dir foxgolf99\FSGOLF.TMP