#1

#2
ORN32FTP.ZIP@32Bit FTP p9.11.01
B-CK12.ZIP@Code Keeper v1.20 for Win9xNT
CODEGALM.ZIP@codename eagle all missions enabler
CR-AF10K.ZIP@AUDIOFILTER 1.0 *KEYMAKER*
CR-CSD10.ZIP@CF COOLSTRIP DESIGNER 1.0 *INCL. KEYMAKER*
CR-DKD10.ZIP@CF DUALINK DESIGNER 1.0 *INCL. KEYMAKER*
CR-EVD10.ZIP@CF ELEVATOR DESIGNER 1.0 *INCL. KEYMAKER*
CR-HAPD1.ZIP@CF HYPERA.MENU+ DESIGN. 1.0 *INCL. KEYMAKER
CR-HSPD1.ZIP@CF HOTSTRIP PRO DESIGN. 1.0 *INCL. KEYMAKER
CR-TVPD1.ZIP@CF TREEVIEW PRO DESIGN. 1.0 *INCL. KEYMAKER
DSIGW111.ZIP@GoldWave 4.11 keymaker only
DSIMOD21.ZIP@Mouse Odometer 2.0
DSIOM021.ZIP@Ordix Mpack 2.02
DSISW212.ZIP@SmartWhoIs 2.1.2 (c) TamoSoft Inc.
DSITVC11.ZIP@TVirtComp v.1.3 for Delphi
DSIVZI21.ZIP@VCLZip v.2.18 for Delphi
DSIWR260.ZIP@WinRAR 2.60 FINAL incl. KeyFile Generator!
ECL-AN2C.ZIP@AceNotes v2000c Win9xNT *Keygen*
ECLCP210.ZIP@Color Pilot Plugin v2.10 For Adobe Photoshop
ECLOM202.ZIP@Ordix Mpack v2.02 Win9xNT *Keygen*
ECLTAR13.ZIP@Tag And Rename 1.3 *kEyGeN*
F-EP14D5.ZIP@ExtraPack Library 1.4 for Delphi 5 (c) Evgesoft
FLGB12EK.ZIP@Logbook 1.2 (c) Wido Software
FLNAGO22.ZIP@Advanced GIF Optimizer 2.2
FLNAM15.ZIP@AutoMail 1.5
FLNDSK2K.ZIP@PACT DeskTOP 2000
FLNJPR2K.ZIP@PACT JumpReg 2000
FLNNP2K.ZIP@PACT NotePad 2000
FLNPC2K.ZIP@PACT ProfileCopy  2000
FLNPW2K.ZIP@PACT PactWash 2000
FLNPZ2K.ZIP@PACT PactZip  2000
FLNQS2K.ZIP@PACT QuickStart 2000
FLNRIF2K.ZIP@PACT ReplaceInfiles 2000
FLNSDN2K.ZIP@PACT ShutDown 2000
FLNSFD2K.ZIP@PACT SetFileData 2000
FLNSL2K.ZIP@PACT SaveLayout 2000
FLNST2K.ZIP@PACT ShowTime 2000
FLNSTC2K.ZIP@PACT SetTextColor 2000
FLNSX2K.ZIP@PACT ShellX 2000
FLNTIM2K.ZIP@PACT Timer 2000
FLNWCN2K.ZIP@PACT WinControl 2000
G-CDSP36.ZIP@CD Spectrum Pro 3.6
HLMSVC21.ZIP@SuperVision Cam 2.02 (c) Peter Kirst
INTMS22.ZIP@Metz Scheduler 2.20 (c) Metz Software
INTPB307.ZIP@Power Boot 3.0.7 (c) Blue Sky Innovations
IPANCH35.ZIP@NetIntellGames Net Chess 3.5
KACHOS55.ZIP@HaoSite Time 5.5a (c) Puyuan Group Inc.                 
K-GW410.ZIP@GoldWave Version 4.10 (c) Chris S. Craig
KNO-KM2.ZIP@Kukumap 1.0 for 3DStudio MAX 2.x
MFD-SUP1.ZIP@SuperBot 1.0
MULTITXT.ZIP@MultiTabbed Texteditor
NSCAG101.ZIP@ArtGem 1.02 (C) rlvision
NSCKTB21.ZIP@kezzaToolBox.v2.01.0042-NSC (c) kezzaWare
O-GWA411.ZIP@Goldwave 4.11
A-CTLS21.ZIP@Hot Door CADtools 2.1
ORNAN2KC.ZIP@AceNotes 2000
ORNBW406.ZIP@BlackWidow 4.06
ORNPS301.ZIP@Paste and Save 3.01
ORNST123.ZIP@Slow Speed CD Transcriber 1.23
PDMNOCTR.ZIP@Noctorne Trainer Plus 2
PDMOMTR.ZIP@Omikron: The nomad soul *Trainer*
PGCGL1.ZIP@GIFLine  1.1
PHS-PHIM.ZIP@Phi-Mail v1.1 Win9x/NT
SCRHABCC.ZIP@Nerf ArenaBlast Cheat Codes
SHKCWMP3.ZIP@CakeWalk Home MP3 Encoder 1.0
SHKIQLV1.ZIP@iQLinux v1.0 (c) QSound Labs Inc.
SHKQMP3D.ZIP@Qmp3D v1.0 (c) QSound Labs Inc.
TAGREN13.ZIP@Tag And Rename 1.3
3DSMPLGN.ZIP@3D Studio Plugins
MDPLUG01.ZIP@Macromedia Director Plugins (1)
MDPLUG02.ZIP@Macromedia Director Plugins (2)
CLSTDCHT.ZIP@Test_Drive_Off_Road_3_Cheats
TMGFW3FX.ZIP@Macromedia Fireworks 3.0 (FIX)
DSI-TG43.ZIP@TextToGif 4.43