[Various Disc 1]

CLSADTRN.ZIP - Adrenix +3 *TRAINER*   
ARMCOMUP.ZIP - Armor Command *UPDATE-ENABLER*
DNG-CDDA.ZIP - CD-DA Extractor v1.12 Cracked
UCFCDA21.ZIP - CDaudio Plus v2.1.003_kEYREGGED [dEV/UCF]
PDMF108.ZIP  - F1 RACiNG SiM v1.08  3DFX(2) CRACK
DVNSKIUP.ZIP - FPS Ski Racing Update Patch v1.11 -+-
DNGFTC13.ZIP - Fast Text ClipBoard V1.3
WARZERO.ZIP  - Fighting Force *TRAINER +2*
FROGPAT3.ZIP - Frogger *UPDATE PATCH 3 CRACKED*
HC-GH41A.ZIP - Ghost ver4.1a [01/01]
EPIDHSDX.ZIP - HYPERSNAP DX PRO 3.10.01
CR-HD01K.ZIP - HyperSnap DX Pro v3.10.01 *KEYMAKER*
CLSIC468.ZIP - I.R.C. v4.68 Update Patch *CRACKED*
PDMJSFUP.ZIP - Joint Strike Fighter 1.12 - Voodoo2 Update
EXPPDV11.ZIP - Print Direct 1.1
DNGQ2314.ZIP - QUAKE 2 V3.14 FIX
FR_Q2ALL.ZIP - Quake 2 All Versions patch 
CLSSWTRN.ZIP - SWARM +4 *TRAINER*
RA-ICD12.ZIP - Saw Ignition CDR 32bit v1.2
SMGPAT3C.ZIP - Sid Meier's Gettysburg PATCH 3 CRACKED
WARSOTRN.ZIP - Spec Ops *TRAINER +6*
RZRSCTRN.ZIP - Starcraft +4 Trainer
STARHELP.ZIP - Startcraft help & Quick reference cards
WST1.ZIP     - Swarm Trainers
CR-TG100.ZIP - TARGETS V1.00 *REGGED*
CR-TR201.ZIP - TRAYRUN v2.01 *KEYMAKERY*
D3DTWEEK.ZIP - Tweek for 3dfx
HV98VRN2.ZIP - Vern v 2.0 (virtual screen manager)
WING.ZIP     - WinG
N98-WP01.ZIP - WinPop Version 1.1 FINAL


[Various Disc 2]

CR-ASM14.ZIP - AUTO START MANAGER V1.4 *REGGED*
A14UP.ZIP    - AutoCAD R14 update
RZRBZTRN.ZIP - BattleZone +6 Trainer
CHTPCK11.ZIP - ChEaTeR PaCk No. 11 (c)
CR-CSP63.ZIP - Cross Stitch Pro Publ. Ed. v6.03 *REGGED*
UCFEPP10.ZIP - EFFECTS PROCESSOR v1.0 *rEGGED*
PDMF107F.ZIP - F1 RACiNG SiM v1.07 UPDATE CRACK
FIFAD.ZIP    - Fifa Teams/Uniform Addon + Trainer/Cheats
TRPSGT31.ZIP - GETRIGHT 3.1 FINAL FOR WIN95
CR-HK103.ZIP - HOTKEY V1.0.365 *REGGED*
I763DFIX.ZIP - Interstate76.Gold.Nitro.Pack.3D.Fix
DVNPX213.ZIP - Pax Imperia 2 v1.3 update (Cracked) -+-
RA-PCD23.ZIP - Point CD audio 32bit v2.3
CR-RP305.ZIP - READY TO PRINT ORGANIZER *REGGED*
CR-S326A.ZIP - Socket Spy 32 v6.A00 *INCL. KEYMAKER*
PDMSWRTR.ZIP - Star Wars Rebellion Trainer +2
TANEWUNT.ZIP - Total Annihilation *DECRYPTED UNITS*
TA2B1.ZIP    - Total Annihilation v2.0b1 *CRACKED*
TWDUN2.ZIP   - TweakDUN v2.0 (c) Patterson Design Systems
CR-3221H.ZIP - VISUAL LABELS v2.1H 32 BIT *iNCL.KEYGEN*
UCFVLT11.ZIP - VooDoo Lights 3dFX ScrnSaver
DNGWXGP1.ZIP - WxGrep V1.0
XTBG.ZIP     - XvT Game Builder v1.1.4


