[Various Disc 2]

MFDROB14.ZIP - A Rob Fantastic MP3 Networked
KFKAP2TR.ZIP - ARCADE POOL 2 TRAINER +3
CLSAOTS.ZIP  - Attack Of The Saucermen Trainer
B-AI331.ZIP  - Autoinsult v3.31 for win9XNT
FLNBS502.ZIP - Bootmanager BOOTSTAR 5.02
GWCDR37E.ZIP - CDRWIN V3.7E *REGGED* "Repack"
PCYCC226.ZIP - CPUCool v2.2.6
TNO-C130.ZIP - Concat-Split v3.1.3.0
TNO-EXP6.ZIP - ExpPrint v1.4.1.6
TSFAT32.ZIP  - Fat32 for Windows NT v1.06
TNO-F356.ZIP - FinePrint v3.56 Win9x Incl *KeyGen*
ORNGWZ32.ZIP - GameWiz32 v1.1e              
PGCGUR3D.ZIP - Guru-3D.Converter.v1.1.Incl.Keygen-PGC
HNDCHETS.ZIP - Hidden and Dangerous Cheat Codes
OGNHAD11.ZIP - Hidden and Dangerous PATCH 1.1
CLSHDTRN.ZIP - Hidden and Dangerous Trainer (c) Take 2
CLSHD11T.ZIP - Hidden and Dangerous v.1.1 Trainer
ECL-I214.ZIP - ICU        Incl *KEYGEN*
DVNJA2TR.ZIP - Jagged Alliance 2 Money Trainer
CLSJA2TN.ZIP - Jagged Alliance 2 Trainer (c) TalonSoft
NTSKCW.ZIP   - KINGPIN FULL CHEAT CODES AND WALKTHROUGH
PDMKPL11.ZIP - Kingpin : Life of Crime v1.1 (c) Xatrix Entertainment
RLCKPCH.ZIP  - Kingpin Cheats
PDM-M115.ZIP - MACHINES V 1.15 *MULITILANGUAGE* UPD
DVNMDTRN.ZIP - MAYDAY +2 TRAINER
KFKMW311.ZIP - MECH WARRIOR 3 UPDATE 1.1 100% WORKING
RZRMW311.ZIP - MECHWARRIOR III v1.1
HTGMCM11.ZIP - MP3 CD Maker v1.11
VRS-SWF2.ZIP - Macromedia Flash SWF-Unprotect v2.0
MFD-RM81.ZIP - Mail REDirect 1.0.7.81
CVMCOM33.ZIP - Minicom v3.3
ECL-ME10.ZIP - Mouse Edit        Cracked
CSTMC701.ZIP - Multi Clipboard v9.07.01  (c)  Electrasoft
RBS-NAT.ZIP  - NAT32 Win98/NT V6.4.5 Build 1066
MFD-NIN.ZIP  - NinjaSwitcher Ver. 2.53
PDMOF1R2.ZIP - Official Formula 1 Racing Update #2 (c) Eidos
CR-PT102.ZIP - PERFORMANCE TUNER V1.00.02 *Incl. Keymaker*
DVNPRP3T.ZIP - POLARiS REBELLiON +3 TRAINER [1/1]
HLMPH180.ZIP - Popup Hunter v1.80
RA-QFX1.ZIP  - Quartz DX Plugin Pack 1
RA-QFX2.ZIP  - Quartz DX Plugin Pack 2
RA-QFX3.ZIP  - Quartz DX Plugin Pack 3
PDMRSTRN.ZIP - RESPECT INC. +4 Trainer          [xx/01]
RZRRT153.ZIP - RT 2 - The Second Century v1.53 Update
CLSRPTRN.ZIP - Roswell Pinball Trainer (c) GT Value
OGNAC40.ZIP  - SID MEIERS ALPHA CENTAURI PATCH 4.0
PHS-SW11.ZIP - SUWin 1.1 Cracked
RZRSC311.ZIP - Sim City 3000 *Working* v1.1 Patch
CSTSKN10.ZIP - Skinner v1.01  (c)  Gautama Ajie
HTGSNS21.ZIP - Sort and Slice v2.1
RA-CDA4J.ZIP - SoundForge CD Architect v4.0f (july)
PDMRS12U.ZIP - Star Wars Rogue Squadron 3D Update v1.2 (c) Lucasarts
RZR-ST16.ZIP - Starsiege Tribes v1.6 Patch (c) Sierra
RA-DECLk.ZIP - Steinberg DeClicker v1.21 working
PDMSWTR.ZIP  - Street Wars - Trainer
PDMSWTRF.ZIP - Street Wars - Trainer *fixed* (c) Infogrames
DVNTTCP1.ZIP - TOCA2 TOURING CARS Patch 1
RZRTR3P2.ZIP - Tomb Raider 3 Patch #2 *Cracked* (c) Eidos
RS-TSM.ZIP   - Top Secret Messenger for ICQ (C) Encryption Software XX/01
RA-FUNK1.ZIP - UltraFunk Sonitus FX pack v1.0
PDMWZCRK.ZIP - Warzone 2100 Update V1.06 & generic crack
CST-WSO1.ZIP - WebSpeed Optimizer 1.01   (c)  xat.com Ltd
HLM-WZ10.ZIP - Winzap v1.0


