[Various Disc 2]

AIRAXE21.ZIP - A.X.E.--Andvanced heX Editor v2.1
RA-RNR10.ZIP - Arboretum Restoration-NR v1.02
DMNAS26A.ZIP - AutoShutdown v2.6a *cracked*         
NKAT104.ZIP  - AweToy32 1.04
G-COM18A.ZIP - Beyond Compare v1.8a (c) Scooter Software
B-CTTS11.ZIP - CLR Tabs To Spaces v1.10 for win9xNT
PGCLR104.ZIP - Colorer v1.04 (c) ACRAT
CR-DPR24.ZIP - DIRECTORY PRINTER v2.4 *REGiSTERED*     
PCYDFS11.ZIP - Desktop Frames 1.01
HV-DXRSZ.ZIP - DlgXRSizer v3.2.8                                            
FLNEC10.ZIP  - EURO Converter v1.0
HVFFLD23.ZIP - Fast Folders v2.3                                            
B-FLM201.ZIP - Fileman v2.01 by Khansith Boupha
AIRFR101.ZIP - FlexRestart v1.01
HV-HOTKY.ZIP - Hot Keyboard v1.1                                             
PDMI2UP1.ZIP - IMPERIALISM II: Update v1.02
ITRLUNCD.ZIP - Lunar.Calendar.v1.0
MFDMP323.ZIP - MP3 Explorer 2.3 INCL KEYGEN
PCY-MOE1.ZIP - MetaProducts Offline Explorer 1.0
FLNMT157.ZIP - Mocha W32 Telnet v1.5.7
PHS-MT31.ZIP - MouseTool v3.1  CRACKED Win9xNT
PHS-NNAK.ZIP - NoiseNak 1.1.5 Cracked
TNO-N262.ZIP - Notpad v2.62 Incl *KeyGen*
RA-PAM21.ZIP - Pinguin Audio Meter V2.1
ITRPE103.ZIP - PurgeIE.v1.03
MFDQP107.ZIP - QACP 1.0.7
PDMRP3.ZIP   - RECOIL FULL +3 Trainer (c) Jog
CLSRCTTN.ZIP - ROLLER COASTER TYCOON +2 TRAINER
BVHRDLTR.ZIP - Redline +8 trainer
RDLINETR.ZIP - Redline Plus Three Trainer
RCT7TRN.ZIP  - Roller Coaster Tycoon +7 Trainer
PDMRCTT.ZIP  - RollerCoaster Tycoon *MONEY TRAINER*
DSIRX716.ZIP - RxDOS.v7.1.6.Cracked-DSi
2KSUB401.ZIP - Serv-U v2.5b4 32bit
OGNST105.ZIP - Starcraft Patch v1.05
STARSTRN.ZIP - Starsiege Plus Three Trainer
OGNTTC11.ZIP - TOCA Touring Car Championship v1.1a Cracked Patch
PDMTRCHT.ZIP - TankRacer *All Tracks and Leagues Cheat*
TRUBB531.ZIP - Ultimate Bulletin Board 5.31
CR-VS203.ZIP - VIRTUAL STOPWATCH v2.03 *REGGED*      
WRP00904.ZIP - WinAmp.v2.10.Keymaker.fixed.for.PI.and.PIII-Warp
FLNWH823.ZIP - WinHex 8.23 Regged 
WIN98KB.ZIP  - Windows98 Installation and Configuration Knowledgebase


