Tabnotes v3.06 
Tabnotes is a notepad. But with many features.It divided              
in categories-notes for every category- subnotes for every note!       
I have do it for me and I have drop all that pieces of paper           
around my computer. Try it. You will see that it will be transformed   
in your hands. (All notes are stored in text files.)" -author          
                                                                       
BTW, I personally think this is a very hand util ideal for recording   
all sorts of shit eg emails, crack requests, whatever, and easily      
driven from an intuitive interface.                                    

I include the C source code with my keygens, for educational purposes  
to help other crackers learning the trade.  The source may not be used 
to compile this keygen and rip it off as your own work.                

copy to your HD and run it 

name: PROPHECY [tNO]                                      
registration code: Q[PVKHK^!]xORi   

                                  