#1


#2
----------Development----------
00000001.ZIP@RegEasy ActiveX 1.0
00000002.ZIP@CaptureIT ActiveX 1.0
00000003.ZIP@VSD FilePanel 1.0
00000004.ZIP@iNTray ActiveX 1.0
00000005.ZIP@EMS QuickExport Suite 1.92 For Delphi
00000006.ZIP@Disabler ActiveX 1.0
00000008.ZIP@AnyShapeImage ActiveX 1.0
00000009.ZIP@SmartPictureBox ActiveX 1.0
00000010.ZIP@Encrypt ActiveX 4.0
00000011.ZIP@AnyShape ActiveX 1.0
----------Internet----------
00000012.ZIP@Magic Text Scroll Java Applet Commercial Version 1.0
00000013.ZIP@ForwardMail 2.81
00000014.ZIP@NewsTicker Java Applet Comm
----------Keygens----------
00000013.ZIP@Email Collector and Sender 2.0
00000016.ZIP@GPS Utility 4.0
00000017.ZIP@Image Arithmatic 2.3
00000018.ZIP@Email Collector and Sender 2.0
00000019.ZIP@Compass 2.8
----------Mobile----------
00000020.ZIP@SAMSUNG I MEI CHANGER 1.0
----------Trainers----------
00000021.ZIP@The Nations Trainer
00000022.ZIP@Conflict Zone 1.2 *Plus 2 TRAINER*
00000023.ZIP@Operation Flashpoint *+2 Trainer*
00000024.ZIP@Black Beetle Plus 2 Trainer
00000025.ZIP@Egypt Trader 1.0 Plus 2 Trainer
00000026.ZIP@Hopmon 1.1 *Plus 1 Trainer*
00000027.ZIP@Half-Life: Counter-Strike *LAN Cheats*
00000028.ZIP@Panzer Campaigns Kharkov '42 Update 1.02
00000029.ZIP@Technomage Trainer
00000030.ZIP@Startrek Domion Wars Trainer
00000031.ZIP@Half-Life: Counter-Strike *Internet Cheats*
00000032.ZIP@Half-Life: Counter-Strike *Weapons Cheat*
00000033.ZIP@Heroes Chronicles: The Final Chapters *Cheats*
00000034.ZIP@Snood 2.4 Plus 2 *Trainer*
00000035.ZIP@Emperor: Battle for Dune cheats
00000036.ZIP@UEFA Challenge Plus 3 Trainer
00000037.ZIP@Half-Life: Counter-Strike *Internet Cheats*
00000038.ZIP@Half-Life: Counter-Strike *Weapons Cheat*
00000039.ZIP@Startrek Domion Wars Trainer
00000040.ZIP@Egypt Trader 1.0 Plus 2 Trainer
00000041.ZIP@Half-Life: Counter-Strike *LAN Cheats*
00000042.ZIP@Independence War 2 - Edge of Chaos *Cheats*
00000043.ZIP@The Domanation 2.3 Plus 3 Trainer
00000044.ZIP@Vietnam 2 Special Assignment Cheat
00000045.ZIP@Vietnam 2 Special Assignment Cheat
00000046.ZIP@Hacknoid Plus 3 Trainer
00000047.ZIP@Sega Bass Fishing *TRAINER*
00000048.ZIP@??
00000049.ZIP@Technomage Trainer
00000050.ZIP@Worm2000 1.12 *Plus 4 Trainer*
----------Utilities----------
00000051.ZIP@Cubase 5 R5 VST/32 DUMMY EMU ONLY
00000052.ZIP@MP3 Navigator 2.42
00000053.ZIP@Image Arithmetic 2.3
00000054.ZIP@Discreet 3ds Max 4.2 Crack *FIX*
00000055.ZIP@Audiosynth 0.07
00000056.ZIP@MP3 Wave Maker 1.50
00000057.ZIP@VRS RECORDING SYSTEM 2.0
00000058.ZIP@Big Crocodile 2.3
00000059.ZIP@HiAppKiller 1.0
00000060.ZIP@CodeWiz 1.5
00000061.ZIP@HEXtreme 1.0
00000062.ZIP@Audio Time 2.0
00000063.ZIP@TrayIcon Menu 1.1
00000064.ZIP@RBC Voice Tweaker Pro DX 3.0