#1


#2

00000000.ZIP@------- Development ------
00000001.ZIP@BarcodeX Control 2.8
00000002.ZIP@HiMetric 1.3
00000003.ZIP@InstallConstruct 4.0
00000004.ZIP@Promise FastTrak Utility 2.0
00000000.ZIP@------- Games ------
00000005.ZIP@Diablo II Lord of Destruction Character Editor
00000006.ZIP@Emperor Battle for Dune All Level Saves
00000008.ZIP@Extreme GhostBusters Trainer
00000009.ZIP@Tropico Editor 1.0
00000010.ZIP@Tropico Scenarios Addon
00000011.ZIP@Dogfight Plus Trainer
00000000.ZIP@------- Internet ------
00000013.ZIP@BannerZapper 2.2 
00000014.ZIP@Headline Viewer
00000015.ZIP@RipEm WinALL
00000016.ZIP@VisualRoute
00000017.ZIP@WhereIsIP 2.0 
00000000.ZIP@------- Keygenerator ------
00000019.ZIP@Amazing Slow Downer
00000020.ZIP@Dynamic Submission 6 
00000021.ZIP@EMailing List Pro
00000022.ZIP@Quick Install Maker 3.0
00000000.ZIP@------- Mobile ------
00000024.ZIP@Nokia LogoManager
00000025.ZIP@PhoneMate PalmOS
00000026.ZIP@SIEMENS C30 TOOL
00000000.ZIP@------- Utilities ------
00000028.ZIP@Absolute Time Corrector
00000029.ZIP@Broken Cross Disk Manager 2.0
00000030.ZIP@PicturesToExe 3.0


