MailAlert.v2.02.19.WIN95NT

MailAlert is great when you have multi-email accounts       
- Whether you check one e-mail account or a                 
dozenMailAlert is a convenient utility for Microsoft        
Windows 95/98 and Windows NT operating systems that         
notifies you when you have received electronic mail.        
it works with most e-mail programs, and has the             
advantage of taking up very little memory when in           
use.                                                        
 
install it
copy patch.com from the cd in to the Dir you have install it.
and Run it.
