/home/ico/dvl/wrk/git/vending-machine/vendingmachne/src/test/java/com/example/vendingmachine/ProductControllerWebMvcTests.java
/home/ico/dvl/wrk/git/vending-machine/vendingmachne/src/test/java/com/example/vendingmachine/ProductServiceJUnit5Tests.java
/home/ico/dvl/wrk/git/vending-machine/vendingmachne/src/test/java/com/example/vendingmachine/VirtualVendingMachineJUnit5Tests.java
/home/ico/dvl/wrk/git/vending-machine/vendingmachne/src/test/java/com/example/vendingmachine/UserActionControllerSpringBootTests.java
/home/ico/dvl/wrk/git/vending-machine/vendingmachne/src/test/java/com/example/vendingmachine/ProductControllerSpringBootTests.java
