<svg width="24" height="24" viewBox="0 0 24 24" fill="none" xmlns="http://www.w3.org/2000/svg">
<path d="M12 16.875C14.0711 16.875 15.75 15.1961 15.75 13.125C15.75 11.0539 14.0711 9.375 12 9.375C9.92893 9.375 8.25 11.0539 8.25 13.125C8.25 15.1961 9.92893 16.875 12 16.875Z" stroke="#224922" stroke-width="1.5" stroke-linecap="round" stroke-linejoin="round"/>
<path d="M18.375 10.875C19.2485 10.8735 20.1103 11.0762 20.8916 11.4669C21.6729 11.8575 22.3521 12.4253 22.875 13.125" stroke="#224922" stroke-width="1.5" stroke-linecap="round" stroke-linejoin="round"/>
<path d="M1.125 13.125C1.64794 12.4253 2.32714 11.8575 3.10843 11.4669C3.88972 11.0762 4.75149 10.8735 5.625 10.875" stroke="#224922" stroke-width="1.5" stroke-linecap="round" stroke-linejoin="round"/>
<path d="M6.59961 20.25C7.09351 19.2386 7.86156 18.3861 8.81628 17.7899C9.77099 17.1936 10.874 16.8774 11.9996 16.8774C13.1252 16.8774 14.2282 17.1936 15.1829 17.7899C16.1377 18.3861 16.9057 19.2386 17.3996 20.25" stroke="#224922" stroke-width="1.5" stroke-linecap="round" stroke-linejoin="round"/>
<path d="M5.62512 10.875C5.05572 10.8756 4.49791 10.7141 4.01688 10.4094C3.53585 10.1048 3.15145 9.6695 2.9086 9.15449C2.66576 8.63947 2.57449 8.06598 2.64547 7.50102C2.71645 6.93607 2.94675 6.40298 3.30945 5.96404C3.67215 5.52511 4.15227 5.19845 4.69372 5.02225C5.23517 4.84605 5.81558 4.82758 6.36714 4.96899C6.9187 5.11041 7.41862 5.40587 7.8085 5.82085C8.19838 6.23583 8.4621 6.7532 8.56887 7.3125" stroke="#101828" stroke-width="1.5" stroke-linecap="round" stroke-linejoin="round"/>
<path d="M15.4316 7.3125C15.5384 6.7532 15.8021 6.23583 16.192 5.82085C16.5819 5.40587 17.0818 5.11041 17.6334 4.96899C18.1849 4.82758 18.7653 4.84605 19.3068 5.02225C19.8482 5.19845 20.3284 5.52511 20.6911 5.96404C21.0538 6.40298 21.2841 6.93607 21.355 7.50102C21.426 8.06598 21.3347 8.63947 21.0919 9.15449C20.8491 9.6695 20.4647 10.1048 19.9836 10.4094C19.5026 10.7141 18.9448 10.8756 18.3754 10.875" stroke="#101828" stroke-width="1.5" stroke-linecap="round" stroke-linejoin="round"/>
</svg>
