<svg width="24" height="24" viewBox="0 0 24 24" fill="none" xmlns="http://www.w3.org/2000/svg">
<path d="M16.5 3V12L13.5 9.75L10.5 12V3" stroke="#224922" stroke-width="1.5" stroke-linecap="round" stroke-linejoin="round"/>
<path d="M4.50002 20.25C4.49878 19.9542 4.55613 19.6611 4.66876 19.3875C4.7814 19.114 4.94708 18.8654 5.15626 18.6563C5.36544 18.4471 5.61397 18.2814 5.88752 18.1688C6.16106 18.0561 6.4542 17.9988 6.75002 18H19.5V3.00002H6.75002C6.4542 2.99878 6.16106 3.05613 5.88752 3.16876C5.61397 3.2814 5.36544 3.44708 5.15626 3.65626C4.94708 3.86544 4.7814 4.11397 4.66876 4.38752C4.55613 4.66106 4.49878 4.9542 4.50002 5.25002V20.25Z" stroke="#224922" stroke-width="1.5" stroke-linecap="round" stroke-linejoin="round"/>
<path d="M4.5 20.25V21H18" stroke="#224922" stroke-width="1.5" stroke-linecap="round" stroke-linejoin="round"/>
</svg>
