%YAML 1.1
%TAG !u! tag:unity3d.com,2011:
--- !u!21 &2100000
Material:
  serializedVersion: 6
  m_ObjectHideFlags: 0
  m_CorrespondingSourceObject: {fileID: 0}
  m_PrefabInstance: {fileID: 0}
  m_PrefabAsset: {fileID: 0}
  m_Name: M_ring20
  m_Shader: {fileID: 4800000, guid: 9bf9379aa7438774bb36610bd0b59568, type: 3}
  m_ShaderKeywords: _USECUSTOMDATA_ON _USEFRESNEL_ON
  m_LightmapFlags: 4
  m_EnableInstancingVariants: 0
  m_DoubleSidedGI: 0
  m_CustomRenderQueue: -1
  stringTagMap: {}
  disabledShaderPasses: []
  m_SavedProperties:
    serializedVersion: 3
    m_TexEnvs:
    - _BumpMap:
        m_Texture: {fileID: 0}
        m_Scale: {x: 1, y: 1}
        m_Offset: {x: 0, y: 0}
    - _DetailAlbedoMap:
        m_Texture: {fileID: 0}
        m_Scale: {x: 1, y: 1}
        m_Offset: {x: 0, y: 0}
    - _DetailMask:
        m_Texture: {fileID: 0}
        m_Scale: {x: 1, y: 1}
        m_Offset: {x: 0, y: 0}
    - _DetailNormalMap:
        m_Texture: {fileID: 0}
        m_Scale: {x: 1, y: 1}
        m_Offset: {x: 0, y: 0}
    - _Dissolve:
        m_Texture: {fileID: 2800000, guid: e4d8889429fa18140af69e1494cbd887, type: 3}
        m_Scale: {x: 1, y: 1}
        m_Offset: {x: 0, y: 0}
    - _EmissionMap:
        m_Texture: {fileID: 0}
        m_Scale: {x: 1, y: 1}
        m_Offset: {x: 0, y: 0}
    - _MainTex:
        m_Texture: {fileID: 2800000, guid: 3c45a9332a6a7a14f90ad1110d4bde9a, type: 3}
        m_Scale: {x: 1, y: 1}
        m_Offset: {x: 0, y: 0}
    - _Mask:
        m_Texture: {fileID: 2800000, guid: d49a858e9b2bccf4cb391082ee06f87a, type: 3}
        m_Scale: {x: 1, y: 1}
        m_Offset: {x: 0, y: 0}
    - _MetallicGlossMap:
        m_Texture: {fileID: 0}
        m_Scale: {x: 1, y: 1}
        m_Offset: {x: 0, y: 0}
    - _Noise:
        m_Texture: {fileID: 2800000, guid: 74b7ddaf84cf88c4e8fa469e79b7b1fa, type: 3}
        m_Scale: {x: 1, y: 1}
        m_Offset: {x: 0, y: 0}
    - _NoiseTex:
        m_Texture: {fileID: 2800000, guid: b88adbb1d232f9e449eabf68993fdae3, type: 3}
        m_Scale: {x: 1, y: 1}
        m_Offset: {x: 0, y: 0}
    - _OcclusionMap:
        m_Texture: {fileID: 0}
        m_Scale: {x: 1, y: 1}
        m_Offset: {x: 0, y: 0}
    - _ParallaxMap:
        m_Texture: {fileID: 0}
        m_Scale: {x: 1, y: 1}
        m_Offset: {x: 0, y: 0}
    - _tex4coord:
        m_Texture: {fileID: 0}
        m_Scale: {x: 1, y: 1}
        m_Offset: {x: 0, y: 0}
    - _texcoord:
        m_Texture: {fileID: 0}
        m_Scale: {x: 1, y: 1}
        m_Offset: {x: 0, y: 0}
    m_Floats:
    - _BumpScale: 1
    - _ColorPosition: 0.271
    - _Cutoff: 0.35
    - _DetailNormalMapScale: 1
    - _DissolveScale: -0.18
    - _DissolveSoftness: 1.009
    - _DstBlend: 0
    - _Duration: 1
    - _EmissStrength: 1
    - _Emission: 0.78
    - _Fireemission: 2
    - _Fresnel: 1
    - _FresnelEmission: 1
    - _Gloss: 0.8
    - _GlossMapScale: 1
    - _Glossiness: 0.5
    - _GlossyReflections: 1
    - _Invert: 0
    - _Metallic: 0
    - _Mode: 0
    - _Mul: 1
    - _NoiseSpeed: 1
    - _OcclusionStrength: 1
    - _Parallax: 0.02
    - _Power: 1
    - _Scale: 1
    - _SmoothnessTextureChannel: 0
    - _SpecularHighlights: 1
    - _SrcBlend: 1
    - _TimeOffs: 0
    - _UVSec: 0
    - _UseCustomData: 1
    - _UseFresnel: 1
    - _Vertexoffset: 0.13
    - _ZWrite: 1
    - __dirty: 1
    m_Colors:
    - _BackFacesColor: {r: 0.6886792, g: 0.6886792, b: 0.6886792, a: 1}
    - _Color: {r: 0.6338116, g: 0.35294116, b: 1, a: 1}
    - _DownColor: {r: 0.097035065, g: 0, b: 0.16981131, a: 1}
    - _EmissionColor: {r: 0, g: 0, b: 0, a: 1}
    - _FXColor: {r: 1, g: 1, b: 1, a: 0}
    - _FresnelColor: {r: 1, g: 1, b: 1, a: 1}
    - _FrontFacesColor: {r: 0.9716981, g: 0.9716981, b: 0.9716981, a: 1}
    - _MainColor: {r: 1, g: 1, b: 1, a: 1}
    - _SpeedMainTexUVNoiseZW: {r: 0, g: 0, b: 0, a: 0.37}
    - _UpColor: {r: 0.49509263, g: 0.012949424, b: 0.9150943, a: 1}
