%YAML 1.1
%TAG !u! tag:unity3d.com,2011:
--- !u!21 &2100000
Material:
  serializedVersion: 6
  m_ObjectHideFlags: 0
  m_CorrespondingSourceObject: {fileID: 0}
  m_PrefabInstance: {fileID: 0}
  m_PrefabAsset: {fileID: 0}
  m_Name: M_magic3
  m_Shader: {fileID: 4800000, guid: d58bbd8801b824721984ae74367d7a5d, type: 3}
  m_ShaderKeywords: _USECUSTOMDATA_ON _USEFRESNEL_ON
  m_LightmapFlags: 4
  m_EnableInstancingVariants: 0
  m_DoubleSidedGI: 0
  m_CustomRenderQueue: 3107
  stringTagMap: {}
  disabledShaderPasses: []
  m_SavedProperties:
    serializedVersion: 3
    m_TexEnvs:
    - _BumpMap:
        m_Texture: {fileID: 0}
        m_Scale: {x: 1, y: 1}
        m_Offset: {x: 0, y: 0}
    - _DetailAlbedoMap:
        m_Texture: {fileID: 0}
        m_Scale: {x: 1, y: 1}
        m_Offset: {x: 0, y: 0}
    - _DetailMask:
        m_Texture: {fileID: 0}
        m_Scale: {x: 1, y: 1}
        m_Offset: {x: 0, y: 0}
    - _DetailNormalMap:
        m_Texture: {fileID: 0}
        m_Scale: {x: 1, y: 1}
        m_Offset: {x: 0, y: 0}
    - _Dissolve:
        m_Texture: {fileID: 2800000, guid: e4d8889429fa18140af69e1494cbd887, type: 3}
        m_Scale: {x: 1, y: 1}
        m_Offset: {x: 0, y: 0}
    - _EmissionMap:
        m_Texture: {fileID: 0}
        m_Scale: {x: 1, y: 1}
        m_Offset: {x: 0, y: 0}
    - _Flow:
        m_Texture: {fileID: 0}
        m_Scale: {x: 1, y: 1}
        m_Offset: {x: 0, y: 0}
    - _MainTex:
        m_Texture: {fileID: 2800000, guid: e625195907d8ca347a603fbe1e0a5ede, type: 3}
        m_Scale: {x: 1, y: 1}
        m_Offset: {x: 0, y: 0}
    - _Mask:
        m_Texture: {fileID: 0}
        m_Scale: {x: 1, y: 1}
        m_Offset: {x: 0, y: 0}
    - _MetallicGlossMap:
        m_Texture: {fileID: 0}
        m_Scale: {x: 1, y: 1}
        m_Offset: {x: 0, y: 0}
    - _Noise:
        m_Texture: {fileID: 2800000, guid: 1fdca5d067fdeb049a7f4080c5fb5684, type: 3}
        m_Scale: {x: 1, y: 0.8}
        m_Offset: {x: 0, y: 0}
    - _OcclusionMap:
        m_Texture: {fileID: 0}
        m_Scale: {x: 1, y: 1}
        m_Offset: {x: 0, y: 0}
    - _ParallaxMap:
        m_Texture: {fileID: 0}
        m_Scale: {x: 1, y: 1}
        m_Offset: {x: 0, y: 0}
    - _tex4coord:
        m_Texture: {fileID: 0}
        m_Scale: {x: 1, y: 1}
        m_Offset: {x: 0, y: 0}
    - _texcoord:
        m_Texture: {fileID: 0}
        m_Scale: {x: 1, y: 1}
        m_Offset: {x: 0, y: 0}
    m_Floats:
    - _Blend2: 1
    - _BumpScale: 1
    - _ColorPosition: 0.271
    - _CullMode: 0
    - _Cutoff: 0.33
    - _Depthpower: 1
    - _DetailNormalMapScale: 1
    - _DstBlend: 0
    - _EmissStrength: 1
    - _Emission: 1
    - _Fireemission: 2
    - _Fresnel: 1
    - _FresnelEmission: 1
    - _Gloss: 0.8
    - _GlossMapScale: 1
    - _Glossiness: 0.5
    - _GlossyReflections: 1
    - _Metallic: 0
    - _Mode: 0
    - _NoiseSpeed: 1
    - _OcclusionStrength: 1
    - _Parallax: 0.02
    - _Power: 1
    - _Scale: 1
    - _SmoothnessTextureChannel: 0
    - _SpecularHighlights: 1
    - _SrcBlend: 1
    - _UVSec: 0
    - _UseCustomData: 1
    - _UseFresnel: 1
    - _Usecenterglow: 0
    - _Usedepth: 0
    - _Vertexoffset: 0.13
    - _ZWrite: 1
    - __dirty: 1
    m_Colors:
    - _BackFacesColor: {r: 0.20754719, g: 0.20054542, b: 0.18307228, a: 1}
    - _Color: {r: 0.6338116, g: 0.35294116, b: 1, a: 1}
    - _DistortionSpeedXYPowerZ: {r: 0, g: 0, b: 0, a: 0}
    - _DownColor: {r: 0.097035065, g: 0, b: 0.16981131, a: 1}
    - _EmissionColor: {r: 0, g: 0, b: 0, a: 1}
    - _FresnelColor: {r: 1, g: 1, b: 1, a: 1}
    - _FrontFacesColor: {r: 0.5471698, g: 0.5251023, b: 0.498131, a: 1}
    - _MainColor: {r: 1, g: 1, b: 1, a: 1}
    - _SpeedMainTexUVNoiseZW: {r: 0, g: 0.71, b: 0, a: 0}
    - _TintColor: {r: 0.5, g: 0.5, b: 0.5, a: 1}
    - _UpColor: {r: 0.49509263, g: 0.012949424, b: 0.9150943, a: 1}
