<?xml version="1.0" encoding="utf-8"?>
<svg xmlns="http://www.w3.org/2000/svg" xmlns:xlink="http://www.w3.org/1999/xlink" style="margin: auto; background: none; display: block; shape-rendering: auto;" width="125px" height="125px" viewBox="0 0 100 100" preserveAspectRatio="xMidYMid">
<g transform="translate(66,50)">
<g transform="rotate(0)">
<circle cx="0" cy="0" r="2" fill="#0c0506" fill-opacity="1" transform="scale(1.3433 1.3433)">
  <animateTransform attributeName="transform" type="scale" begin="-0.875s" values="1.5 1.5;1 1" keyTimes="0;1" dur="1s" repeatCount="indefinite"></animateTransform>
  <animate attributeName="fill-opacity" keyTimes="0;1" dur="1s" repeatCount="indefinite" values="1;0" begin="-0.875s"></animate>
</circle>
</g>
</g><g transform="translate(61.31370849898476,61.31370849898476)">
<g transform="rotate(45)">
<circle cx="0" cy="0" r="2" fill="#0c0506" fill-opacity="0.875" transform="scale(1.4058 1.4058)">
  <animateTransform attributeName="transform" type="scale" begin="-0.75s" values="1.5 1.5;1 1" keyTimes="0;1" dur="1s" repeatCount="indefinite"></animateTransform>
  <animate attributeName="fill-opacity" keyTimes="0;1" dur="1s" repeatCount="indefinite" values="1;0" begin="-0.75s"></animate>
</circle>
</g>
</g><g transform="translate(50,66)">
<g transform="rotate(90)">
<circle cx="0" cy="0" r="2" fill="#0c0506" fill-opacity="0.75" transform="scale(1.4683 1.4683)">
  <animateTransform attributeName="transform" type="scale" begin="-0.625s" values="1.5 1.5;1 1" keyTimes="0;1" dur="1s" repeatCount="indefinite"></animateTransform>
  <animate attributeName="fill-opacity" keyTimes="0;1" dur="1s" repeatCount="indefinite" values="1;0" begin="-0.625s"></animate>
</circle>
</g>
</g><g transform="translate(38.68629150101524,61.31370849898476)">
<g transform="rotate(135)">
<circle cx="0" cy="0" r="2" fill="#0c0506" fill-opacity="0.625" transform="scale(1.0308 1.0308)">
  <animateTransform attributeName="transform" type="scale" begin="-0.5s" values="1.5 1.5;1 1" keyTimes="0;1" dur="1s" repeatCount="indefinite"></animateTransform>
  <animate attributeName="fill-opacity" keyTimes="0;1" dur="1s" repeatCount="indefinite" values="1;0" begin="-0.5s"></animate>
</circle>
</g>
</g><g transform="translate(34,50)">
<g transform="rotate(180)">
<circle cx="0" cy="0" r="2" fill="#0c0506" fill-opacity="0.5" transform="scale(1.0933 1.0933)">
  <animateTransform attributeName="transform" type="scale" begin="-0.375s" values="1.5 1.5;1 1" keyTimes="0;1" dur="1s" repeatCount="indefinite"></animateTransform>
  <animate attributeName="fill-opacity" keyTimes="0;1" dur="1s" repeatCount="indefinite" values="1;0" begin="-0.375s"></animate>
</circle>
</g>
</g><g transform="translate(38.68629150101523,38.68629150101524)">
<g transform="rotate(225)">
<circle cx="0" cy="0" r="2" fill="#0c0506" fill-opacity="0.375" transform="scale(1.1558 1.1558)">
  <animateTransform attributeName="transform" type="scale" begin="-0.25s" values="1.5 1.5;1 1" keyTimes="0;1" dur="1s" repeatCount="indefinite"></animateTransform>
  <animate attributeName="fill-opacity" keyTimes="0;1" dur="1s" repeatCount="indefinite" values="1;0" begin="-0.25s"></animate>
</circle>
</g>
</g><g transform="translate(50,34)">
<g transform="rotate(270)">
<circle cx="0" cy="0" r="2" fill="#0c0506" fill-opacity="0.25" transform="scale(1.2183 1.2183)">
  <animateTransform attributeName="transform" type="scale" begin="-0.125s" values="1.5 1.5;1 1" keyTimes="0;1" dur="1s" repeatCount="indefinite"></animateTransform>
  <animate attributeName="fill-opacity" keyTimes="0;1" dur="1s" repeatCount="indefinite" values="1;0" begin="-0.125s"></animate>
</circle>
</g>
</g><g transform="translate(61.31370849898476,38.68629150101523)">
<g transform="rotate(315)">
<circle cx="0" cy="0" r="2" fill="#0c0506" fill-opacity="0.125" transform="scale(1.2808 1.2808)">
  <animateTransform attributeName="transform" type="scale" begin="0s" values="1.5 1.5;1 1" keyTimes="0;1" dur="1s" repeatCount="indefinite"></animateTransform>
  <animate attributeName="fill-opacity" keyTimes="0;1" dur="1s" repeatCount="indefinite" values="1;0" begin="0s"></animate>
</circle>
</g>
</g>
<!-- [ldio] generated by https://loading.io/ --></svg>