{
	"info": {
		"_postman_id": "1c5b214e-7719-4bb7-a3e7-32fdc02e978a",
		"name": "S33",
		"schema": "https://schema.getpostman.com/json/collection/v2.1.0/collection.json"
	},
	"item": [
		{
			"name": "S33 ACTIVITY",
			"item": [
				{
					"name": "Get to do list",
					"request": {
						"method": "GET",
						"header": []
					},
					"response": []
				},
				{
					"name": "Get one to do list",
					"request": {
						"method": "GET",
						"header": []
					},
					"response": []
				},
				{
					"name": "Post one to do list",
					"request": {
						"method": "POST",
						"header": []
					},
					"response": []
				},
				{
					"name": "Update to do list",
					"request": {
						"method": "PUT",
						"header": []
					},
					"response": []
				},
				{
					"name": "Update specific to do list",
					"request": {
						"method": "PATCH",
						"header": [],
						"body": {
							"mode": "raw",
							"raw": "{\r\n     \"title\": \"This is the updated post\",\r\n    \r\n}\r\n   ",
							"options": {
								"raw": {
									"language": "json"
								}
							}
						}
					},
					"response": []
				},
				{
					"name": "Delete to do list",
					"request": {
						"method": "DELETE",
						"header": [],
						"body": {
							"mode": "raw",
							"raw": "",
							"options": {
								"raw": {
									"language": "json"
								}
							}
						},
						"url": {
							"raw": "https://jsonplaceholder.typicode.com/todos/1",
							"protocol": "https",
							"host": [
								"jsonplaceholder",
								"typicode",
								"com"
							],
							"path": [
								"todos",
								"1"
							]
						}
					},
					"response": []
				}
			]
		},
		{
			"name": "GET ALL POST",
			"request": {
				"method": "GET",
				"header": []
			},
			"response": []
		},
		{
			"name": "GET SPECIFIC POST",
			"request": {
				"method": "GET",
				"header": []
			},
			"response": []
		},
		{
			"name": "ADD NEW POST",
			"request": {
				"method": "POST",
				"header": []
			},
			"response": []
		},
		{
			"name": "UPDATE POST",
			"request": {
				"method": "PUT",
				"header": []
			},
			"response": []
		},
		{
			"name": "UPDATE POST(PATCH)",
			"request": {
				"method": "PATCH",
				"header": []
			},
			"response": []
		},
		{
			"name": "DELETE A POST",
			"request": {
				"method": "DELETE",
				"header": []
			},
			"response": []
		}
	]
}