{
	"info": {
		"_postman_id": "959b22da-ed88-4784-84d6-0a746ea5a4ac",
		"name": "s42-45 CAPSTONE",
		"schema": "https://schema.getpostman.com/json/collection/v2.1.0/collection.json"
	},
	"item": [
		{
			"name": "User Registration",
			"request": {
				"method": "POST",
				"header": [],
				"body": {
					"mode": "raw",
					"raw": "{\r\n    \"firstName\" :\"Jane\",\r\n    \"lastName\" : \"Moore\",\r\n    \"address\" : \"Seattle\",\r\n    \"email\" : \"jmoore@gmail.com\",\r\n    \"mobileNo\" : \"091234567\",\r\n    \"password\" : \"pass1234\"\r\n}",
					"options": {
						"raw": {
							"language": "json"
						}
					}
				},
				"url": {
					"raw": "http://localhost:4020/users/register",
					"protocol": "http",
					"host": [
						"localhost"
					],
					"port": "4020",
					"path": [
						"users",
						"register"
					]
				}
			},
			"response": []
		},
		{
			"name": "User Login",
			"request": {
				"auth": {
					"type": "bearer",
					"bearer": [
						{
							"key": "token",
							"value": "",
							"type": "string"
						}
					]
				},
				"method": "POST",
				"header": [],
				"body": {
					"mode": "raw",
					"raw": "{\r\n    \"email\" : \"jmoore@gmail.com\",\r\n    \"password\" : \"pass1234\"\r\n}",
					"options": {
						"raw": {
							"language": "json"
						}
					}
				},
				"url": {
					"raw": "http://localhost:4020/users/login",
					"protocol": "http",
					"host": [
						"localhost"
					],
					"port": "4020",
					"path": [
						"users",
						"login"
					]
				}
			},
			"response": []
		},
		{
			"name": "Get User Info",
			"request": {
				"auth": {
					"type": "bearer",
					"bearer": [
						{
							"key": "token",
							"value": "eyJhbGciOiJIUzI1NiIsInR5cCI6IkpXVCJ9.eyJpZCI6IjYzY2RjNDY5MjM1MjlhNDA5OTE1MzQ2OCIsImVtYWlsIjoiZ3NtaXRoQGdtYWlsLmNvbSIsImlzQWRtaW4iOmZhbHNlLCJpYXQiOjE2NzQ1MTYzNTJ9.vrMyipXvcu9yZkT7GJiON9HfBki1xGgqntvtofUGjAs",
							"type": "string"
						}
					]
				},
				"method": "POST",
				"header": [],
				"body": {
					"mode": "raw",
					"raw": "{\r\n    \"id\" : \"63ca48326be6f6902093cb43\"\r\n}",
					"options": {
						"raw": {
							"language": "json"
						}
					}
				},
				"url": {
					"raw": "http://localhost:4020/users/details",
					"protocol": "http",
					"host": [
						"localhost"
					],
					"port": "4020",
					"path": [
						"users",
						"details"
					]
				}
			},
			"response": []
		},
		{
			"name": "Set User Admin",
			"request": {
				"auth": {
					"type": "bearer",
					"bearer": [
						{
							"key": "token",
							"value": "eyJhbGciOiJIUzI1NiIsInR5cCI6IkpXVCJ9.eyJpZCI6IjYzY2QxOGE2NWM5MjA5NjllNDNkNGUzMCIsImVtYWlsIjoicmp0dXJpbmdhbjA2QGdtYWlsLmNvbSIsImlzQWRtaW4iOnRydWUsImlhdCI6MTY3NDQzMTQxM30.VNxwBwFPXQR89O_qKIG70vxwsG2cxlFx8-gxpP4YMEs",
							"type": "string"
						}
					]
				},
				"method": "PUT",
				"header": [],
				"body": {
					"mode": "raw",
					"raw": "{\r\n    \"isAdmin\" : true\r\n}",
					"options": {
						"raw": {
							"language": "json"
						}
					}
				},
				"url": {
					"raw": "http://localhost:4020/users/63cdc46923529a4099153468/admin",
					"protocol": "http",
					"host": [
						"localhost"
					],
					"port": "4020",
					"path": [
						"users",
						"63cdc46923529a4099153468",
						"admin"
					]
				}
			},
			"response": []
		},
		{
			"name": "Remove Admin",
			"request": {
				"auth": {
					"type": "bearer",
					"bearer": [
						{
							"key": "token",
							"value": "eyJhbGciOiJIUzI1NiIsInR5cCI6IkpXVCJ9.eyJpZCI6IjYzY2QxOGE2NWM5MjA5NjllNDNkNGUzMCIsImVtYWlsIjoicmp0dXJpbmdhbjA2QGdtYWlsLmNvbSIsImlzQWRtaW4iOnRydWUsImlhdCI6MTY3NDQzMTQxM30.VNxwBwFPXQR89O_qKIG70vxwsG2cxlFx8-gxpP4YMEs",
							"type": "string"
						}
					]
				},
				"method": "PUT",
				"header": [],
				"body": {
					"mode": "raw",
					"raw": "{\r\n    \"isAdmin\" : false\r\n}",
					"options": {
						"raw": {
							"language": "json"
						}
					}
				},
				"url": {
					"raw": "http://localhost:4020/users/63cdc46923529a4099153468/client",
					"protocol": "http",
					"host": [
						"localhost"
					],
					"port": "4020",
					"path": [
						"users",
						"63cdc46923529a4099153468",
						"client"
					]
				}
			},
			"response": []
		},
		{
			"name": "New Product",
			"request": {
				"auth": {
					"type": "bearer",
					"bearer": [
						{
							"key": "token",
							"value": "eyJhbGciOiJIUzI1NiIsInR5cCI6IkpXVCJ9.eyJpZCI6IjYzY2QxOGE2NWM5MjA5NjllNDNkNGUzMCIsImVtYWlsIjoicmp0dXJpbmdhbjA2QGdtYWlsLmNvbSIsImlzQWRtaW4iOnRydWUsImlhdCI6MTY3NDQ0NDY2Nn0.sHoqQJ5ZM21cl3ybs4D49XlvDj26nRZd4xm2QyMdMe8",
							"type": "string"
						}
					]
				},
				"method": "POST",
				"header": [],
				"body": {
					"mode": "raw",
					"raw": "{\r\n    \"name\" : \"6 pcs chicken wings\",\r\n    \"description\" : \"Chicken wings fried to perfection. Choose from 3 type of sauces\",\r\n    \"price\" : 500\r\n}",
					"options": {
						"raw": {
							"language": "json"
						}
					}
				},
				"url": {
					"raw": "http://localhost:4020/products/new",
					"protocol": "http",
					"host": [
						"localhost"
					],
					"port": "4020",
					"path": [
						"products",
						"new"
					]
				}
			},
			"response": []
		},
		{
			"name": "Available Products",
			"request": {
				"method": "GET",
				"header": [],
				"url": {
					"raw": "http://localhost:4020/products/available",
					"protocol": "http",
					"host": [
						"localhost"
					],
					"port": "4020",
					"path": [
						"products",
						"available"
					]
				}
			},
			"response": []
		},
		{
			"name": "Look for Product",
			"protocolProfileBehavior": {
				"disableBodyPruning": true
			},
			"request": {
				"method": "GET",
				"header": [],
				"body": {
					"mode": "raw",
					"raw": "",
					"options": {
						"raw": {
							"language": "json"
						}
					}
				},
				"url": {
					"raw": "http://localhost:4020/products/63cdc40f23529a4099153466",
					"protocol": "http",
					"host": [
						"localhost"
					],
					"port": "4020",
					"path": [
						"products",
						"63cdc40f23529a4099153466"
					]
				}
			},
			"response": []
		},
		{
			"name": "Update Product",
			"request": {
				"auth": {
					"type": "bearer",
					"bearer": [
						{
							"key": "token",
							"value": "eyJhbGciOiJIUzI1NiIsInR5cCI6IkpXVCJ9.eyJpZCI6IjYzY2QxOGE2NWM5MjA5NjllNDNkNGUzMCIsImVtYWlsIjoicmp0dXJpbmdhbjA2QGdtYWlsLmNvbSIsImlzQWRtaW4iOnRydWUsImlhdCI6MTY3NDQzMTQxM30.VNxwBwFPXQR89O_qKIG70vxwsG2cxlFx8-gxpP4YMEs",
							"type": "string"
						}
					]
				},
				"method": "PUT",
				"header": [],
				"body": {
					"mode": "raw",
					"raw": "{\r\n    \"price\" : 200\r\n}",
					"options": {
						"raw": {
							"language": "json"
						}
					}
				},
				"url": {
					"raw": "http://localhost:4020/products/63cdff8af71211226daa4441/update",
					"protocol": "http",
					"host": [
						"localhost"
					],
					"port": "4020",
					"path": [
						"products",
						"63cdff8af71211226daa4441",
						"update"
					]
				}
			},
			"response": []
		},
		{
			"name": "Archive Product",
			"request": {
				"auth": {
					"type": "bearer",
					"bearer": [
						{
							"key": "token",
							"value": "eyJhbGciOiJIUzI1NiIsInR5cCI6IkpXVCJ9.eyJpZCI6IjYzY2QxOGE2NWM5MjA5NjllNDNkNGUzMCIsImVtYWlsIjoicmp0dXJpbmdhbjA2QGdtYWlsLmNvbSIsImlzQWRtaW4iOnRydWUsImlhdCI6MTY3NDQzMDY1Mn0.uHBDuYvnNxZqX7x310mgRaZRcpIYKhQHtU6EkuSPtjU",
							"type": "string"
						}
					]
				},
				"method": "PUT",
				"header": [],
				"body": {
					"mode": "raw",
					"raw": "{\r\n    \"isActive\" : false\r\n}",
					"options": {
						"raw": {
							"language": "json"
						}
					}
				},
				"url": {
					"raw": "http://localhost:4020/products/63cd270d43217b7bba1ea994/archive",
					"protocol": "http",
					"host": [
						"localhost"
					],
					"port": "4020",
					"path": [
						"products",
						"63cd270d43217b7bba1ea994",
						"archive"
					]
				}
			},
			"response": []
		},
		{
			"name": "Returning Product",
			"request": {
				"auth": {
					"type": "bearer",
					"bearer": [
						{
							"key": "token",
							"value": "eyJhbGciOiJIUzI1NiIsInR5cCI6IkpXVCJ9.eyJpZCI6IjYzY2QxOGE2NWM5MjA5NjllNDNkNGUzMCIsImVtYWlsIjoicmp0dXJpbmdhbjA2QGdtYWlsLmNvbSIsImlzQWRtaW4iOnRydWUsImlhdCI6MTY3NDQzMTQxM30.VNxwBwFPXQR89O_qKIG70vxwsG2cxlFx8-gxpP4YMEs",
							"type": "string"
						}
					]
				},
				"method": "PUT",
				"header": [],
				"body": {
					"mode": "raw",
					"raw": "{\r\n    \"isActive\" : true\r\n}",
					"options": {
						"raw": {
							"language": "json"
						}
					}
				},
				"url": {
					"raw": "http://localhost:4020/products/63cd270d43217b7bba1ea994/avail",
					"protocol": "http",
					"host": [
						"localhost"
					],
					"port": "4020",
					"path": [
						"products",
						"63cd270d43217b7bba1ea994",
						"avail"
					]
				}
			},
			"response": []
		},
		{
			"name": "Create Order",
			"request": {
				"auth": {
					"type": "bearer",
					"bearer": [
						{
							"key": "token",
							"value": "eyJhbGciOiJIUzI1NiIsInR5cCI6IkpXVCJ9.eyJpZCI6IjYzY2Y3ZDk2MGU0ZDA1ODdjZjc0ZTFhYiIsImVtYWlsIjoiam1vb3JlQGdtYWlsLmNvbSIsImlzQWRtaW4iOmZhbHNlLCJpYXQiOjE2NzQ1NDI0OTZ9.f_bKJZ-3UD09o_mgjcAB5baOWjgs_TKripVZdmc0mKg",
							"type": "string"
						}
					]
				},
				"method": "POST",
				"header": [],
				"body": {
					"mode": "raw",
					"raw": "{\r\n    \"products\" : {\r\n        \"productId\" : \"63cdedc9d41c972ae7d47953\",\r\n        \"quantity\" : 2\r\n    }\r\n\r\n}",
					"options": {
						"raw": {
							"language": "json"
						}
					}
				},
				"url": {
					"raw": "http://localhost:4020/orders/createOrder",
					"protocol": "http",
					"host": [
						"localhost"
					],
					"port": "4020",
					"path": [
						"orders",
						"createOrder"
					]
				}
			},
			"response": []
		}
	]
}