<?xml version="1.0" encoding="UTF-8"?>
<svg width="20px" height="20px" viewBox="0 0 20 20" version="1.1" xmlns="http://www.w3.org/2000/svg" xmlns:xlink="http://www.w3.org/1999/xlink">
    <!-- Generator: Sketch 51.3 (57544) - http://www.bohemiancoding.com/sketch -->
    <title>ico_checked</title>
    <desc>Created with Sketch.</desc>
    <defs></defs>
    <g id="Page-2" stroke="none" stroke-width="1" fill="none" fill-rule="evenodd">
        <g id="ico_checked" stroke="#8CC73F">
            <rect id="Rectangle-35" fill="#FFFFFF" fill-rule="nonzero" x="0.5" y="0.5" width="19" height="19" rx="3"></rect>
            <polyline id="Path-8" stroke-width="1.5" points="5 9 9.5 14 16 7"></polyline>
        </g>
    </g>
</svg>