%YAML 1.1
%TAG !u! tag:unity3d.com,2011:
--- !u!21 &2100000
Material:
  serializedVersion: 6
  m_ObjectHideFlags: 0
  m_CorrespondingSourceObject: {fileID: 0}
  m_PrefabInstance: {fileID: 0}
  m_PrefabAsset: {fileID: 0}
  m_Name: MAT_Riddle
  m_Shader: {fileID: 4800000, guid: 6cff0bcfb0378d345b2b5444c9317994, type: 3}
  m_ShaderKeywords: 
  m_LightmapFlags: 4
  m_EnableInstancingVariants: 0
  m_DoubleSidedGI: 0
  m_CustomRenderQueue: -1
  stringTagMap: {}
  disabledShaderPasses: []
  m_SavedProperties:
    serializedVersion: 3
    m_TexEnvs:
    - _BumpMap:
        m_Texture: {fileID: 2800000, guid: d968e7cf8672bbd43a391ff2fded807d, type: 3}
        m_Scale: {x: 1, y: 1}
        m_Offset: {x: 0, y: 0}
    - _DissolveAnimTex:
        m_Texture: {fileID: 2800000, guid: e39cd444acc6d88448a515e0109c0769, type: 3}
        m_Scale: {x: 5, y: 5}
        m_Offset: {x: 0, y: 0}
    - _DissolveTex:
        m_Texture: {fileID: 2800000, guid: 9870266a901d9d94fb42ccf1ee368e86, type: 3}
        m_Scale: {x: 1, y: 1}
        m_Offset: {x: 0, y: 0}
    - _MainTex:
        m_Texture: {fileID: 2800000, guid: 17d5f200f8d84db44a7b40ab866c6457, type: 3}
        m_Scale: {x: 1, y: 1}
        m_Offset: {x: 0, y: 0}
    m_Floats:
    - _BumpScale: 1
    - _DissolveAnimSoftness: 0.3
    - _DissolveAnimThreshold: 0.65
    - _DissolveAnimTransparency: 0.5
    - _DissolveSoftness: 0.1
    - _DissolveThreshold: 1
    - _DissolveThreshold1: 0.4
    - _DissolveThreshold2: 0.6
    - _DissolveThreshold3: 1
    - _Glossiness: 0
    - _Light1Enabled: 1
    - _Light2Enabled: 1
    - _Light3Enabled: 1
    - _LightAngle: 30
    - _LightRange: 2
    - _LightStrength: 2.5
    - _Metallic: 0
    - _ScrollSpeedU: -8
    - _ScrollSpeedV: -8
    - _StrengthScalar: 100
    - _StrengthSoftness: 0
    m_Colors:
    - _Color: {r: 0.18867922, g: 0.18867922, b: 0.18867922, a: 1}
    - _Light1Direction: {r: 0, g: -1, b: 0, a: 0}
    - _Light1Position: {r: 0.12, g: 1, b: 0, a: 0}
    - _Light2Direction: {r: 0, g: -1, b: 0, a: 0}
    - _Light2Position: {r: 0.09, g: 1, b: 0, a: 0}
    - _Light3Direction: {r: 0, g: -1, b: 0, a: 0}
    - _Light3Position: {r: 0, g: 1, b: 0.26, a: 0}
    - _LightDirection: {r: 0, g: -1, b: 0, a: 0}
    - _LightPosition: {r: 0, g: 1, b: 0, a: 0}
