{
  "eClass" : "http://www.tmax.co.kr/proobject/message#//DocumentRoot",
  "id" : "msg_root",
  "type" : "dataobject-message-root",
  "children" : [ {
    "eClass" : "http://www.tmax.co.kr/proobject/message#//MessageType",
    "logicalName" : "OIVPINSR_OutputDtoMsgJson",
    "physicalName" : "OIVPINSR_OutputDtoMsgJson",
    "resourcePackage" : "com.tmax.openframe.dto",
    "resourcePath" : "com/tmax/openframe/dto",
    "resourceType" : "MESSAGE",
    "type" : "dataobject-message",
    "dataobjectName" : "OIVPINSR_OutputDto",
    "dataobjectPath" : "com/tmax/openframe/dto",
    "messageType" : "Json",
    "trimFlag" : "rtrim",
    "children" : [ {
      "eClass" : "http://www.tmax.co.kr/proobject/message#//MessageFieldType",
      "id" : "do_message_field",
      "type" : "dataobject-message-field",
      "array" : "0",
      "comments" : "",
      "decimal" : -1,
      "delegate" : false,
      "fieldType" : "string",
      "includeMessageName" : "MsgJson",
      "includeMessagePath" : "",
      "length" : "40",
      "logicalName" : "id",
      "maskingEndIndex" : 0,
      "maskingStartIndex" : 0,
      "metaId" : "",
      "physicalName" : "id",
      "referencedtoName" : "",
      "referenceId" : ""
    }, {
      "eClass" : "http://www.tmax.co.kr/proobject/message#//MessageFieldType",
      "id" : "do_message_field",
      "type" : "dataobject-message-field",
      "array" : "0",
      "comments" : "",
      "decimal" : -1,
      "delegate" : false,
      "fieldType" : "string",
      "includeMessageName" : "MsgJson",
      "includeMessagePath" : "",
      "length" : "128",
      "logicalName" : "tabId",
      "maskingEndIndex" : 0,
      "maskingStartIndex" : 0,
      "metaId" : "",
      "physicalName" : "tabId",
      "referencedtoName" : "",
      "referenceId" : ""
    }, {
      "eClass" : "http://www.tmax.co.kr/proobject/message#//MessageFieldType",
      "id" : "do_message_field",
      "type" : "dataobject-message-field",
      "array" : "0",
      "comments" : "",
      "decimal" : -1,
      "delegate" : false,
      "fieldType" : "string",
      "includeMessageName" : "MsgJson",
      "includeMessagePath" : "",
      "length" : "128",
      "logicalName" : "termId",
      "maskingEndIndex" : 0,
      "maskingStartIndex" : 0,
      "metaId" : "",
      "physicalName" : "termId",
      "referencedtoName" : "",
      "referenceId" : ""
    }, {
      "eClass" : "http://www.tmax.co.kr/proobject/message#//MessageFieldType",
      "id" : "do_message_field",
      "type" : "dataobject-message-field",
      "array" : "0",
      "comments" : "",
      "decimal" : -1,
      "delegate" : false,
      "fieldType" : "include",
      "includeMessageName" : "SystemDtoMsgJson",
      "includeMessagePath" : "com/tmax/openframe/dto",
      "length" : "40",
      "logicalName" : "systemDto",
      "maskingEndIndex" : 0,
      "maskingStartIndex" : 0,
      "metaId" : "",
      "physicalName" : "systemDto",
      "referencedtoName" : "SystemDto",
      "referenceId" : ""
    }, {
      "eClass" : "http://www.tmax.co.kr/proobject/message#//MessageFieldType",
      "id" : "do_message_field",
      "type" : "dataobject-message-field",
      "array" : "0",
      "comments" : "",
      "decimal" : -1,
      "delegate" : false,
      "fieldType" : "include",
      "includeMessageName" : "OIVPINSR_ScreenDtoMsgJson",
      "includeMessagePath" : "com/tmax/openframe/dto",
      "length" : "40",
      "logicalName" : "screenDto",
      "maskingEndIndex" : 0,
      "maskingStartIndex" : 0,
      "metaId" : "",
      "physicalName" : "screenDto",
      "referencedtoName" : "OIVPINSR_ScreenDto",
      "referenceId" : ""
    } ]
  } ]
}