{
  "eClass" : "http://www.tmax.co.kr/proobject/dataobject#//DocumentRoot",
  "id" : "do_root",
  "type" : "dataobject-root",
  "children" : [ {
    "eClass" : "http://www.tmax.co.kr/proobject/dataobject#//DataObjectType",
    "description" : "",
    "logicalName" : "OIVPINQR_InputDto",
    "physicalName" : "OIVPINQR_InputDto",
    "resourcePackage" : "com.tmax.openframe.dto",
    "resourcePath" : "com/tmax/openframe/dto",
    "resourceType" : "DATA_OBJECT",
    "children" : [ {
      "eClass" : "http://www.tmax.co.kr/proobject/dataobject#//DataObjectFieldType",
      "id" : "",
      "array" : "0",
      "columnName" : "",
      "comments" : "",
      "decimal" : -1,
      "defaultValue" : "",
      "delegate" : false,
      "encrypt" : false,
      "fieldType" : "String",
      "includeDataObjectName" : "",
      "includeDataObjectPath" : "",
      "key" : "NONE",
      "keyword" : "",
      "length" : "40",
      "logicalName" : "id",
      "maskingEndIndex" : 0,
      "maskingStartIndex" : 0,
      "metaId" : "",
      "nullable" : true,
      "physicalName" : "id",
      "referenceId" : "",
      "schemaName" : "",
      "tableName" : ""
    }, {
      "eClass" : "http://www.tmax.co.kr/proobject/dataobject#//DataObjectFieldType",
      "id" : "",
      "array" : "0",
      "columnName" : "",
      "comments" : "",
      "decimal" : -1,
      "defaultValue" : "",
      "delegate" : false,
      "encrypt" : false,
      "fieldType" : "String",
      "includeDataObjectName" : "",
      "includeDataObjectPath" : "",
      "key" : "NONE",
      "keyword" : "",
      "length" : "128",
      "logicalName" : "tabId",
      "maskingEndIndex" : 0,
      "maskingStartIndex" : 0,
      "metaId" : "",
      "nullable" : true,
      "physicalName" : "tabId",
      "referenceId" : "",
      "schemaName" : "",
      "tableName" : ""
    }, {
      "eClass" : "http://www.tmax.co.kr/proobject/dataobject#//DataObjectFieldType",
      "id" : "",
      "array" : "0",
      "columnName" : "",
      "comments" : "",
      "decimal" : -1,
      "defaultValue" : "",
      "delegate" : false,
      "encrypt" : false,
      "fieldType" : "String",
      "includeDataObjectName" : "",
      "includeDataObjectPath" : "",
      "key" : "NONE",
      "keyword" : "",
      "length" : "128",
      "logicalName" : "termId",
      "maskingEndIndex" : 0,
      "maskingStartIndex" : 0,
      "metaId" : "",
      "nullable" : true,
      "physicalName" : "termId",
      "referenceId" : "",
      "schemaName" : "",
      "tableName" : ""
    }, {
      "eClass" : "http://www.tmax.co.kr/proobject/dataobject#//DataObjectFieldType",
      "id" : "",
      "array" : "0",
      "columnName" : "",
      "comments" : "",
      "decimal" : -1,
      "defaultValue" : "",
      "delegate" : false,
      "encrypt" : false,
      "fieldType" : "include",
      "includeDataObjectName" : "SystemDto",
      "includeDataObjectPath" : "com/tmax/openframe/dto",
      "key" : "NONE",
      "keyword" : "",
      "length" : "40",
      "logicalName" : "systemDto",
      "maskingEndIndex" : 0,
      "maskingStartIndex" : 0,
      "metaId" : "",
      "nullable" : true,
      "physicalName" : "systemDto",
      "referenceId" : "",
      "schemaName" : "",
      "tableName" : ""
    }, {
      "eClass" : "http://www.tmax.co.kr/proobject/dataobject#//DataObjectFieldType",
      "id" : "",
      "array" : "0",
      "columnName" : "",
      "comments" : "",
      "decimal" : -1,
      "defaultValue" : "",
      "delegate" : false,
      "encrypt" : false,
      "fieldType" : "include",
      "includeDataObjectName" : "OIVPINQR_ScreenDto",
      "includeDataObjectPath" : "com/tmax/openframe/dto",
      "key" : "NONE",
      "keyword" : "",
      "length" : "40",
      "logicalName" : "screenDto",
      "maskingEndIndex" : 0,
      "maskingStartIndex" : 0,
      "metaId" : "",
      "nullable" : true,
      "physicalName" : "screenDto",
      "referenceId" : "",
      "schemaName" : "",
      "tableName" : ""
    } ]
  } ]
}