{
  "eClass" : "http://www.tmax.co.kr/proobject/message#//DocumentRoot",
  "id" : "msg_root",
  "type" : "dataobject-message-root",
  "children" : [ {
    "eClass" : "http://www.tmax.co.kr/proobject/message#//MessageType",
    "logicalName" : "OIVPM02_OIVPM02_dataMsgJson",
    "physicalName" : "OIVPM02_OIVPM02_dataMsgJson",
    "resourcePackage" : "com.tmax.openframe.dto",
    "resourcePath" : "com/tmax/openframe/dto",
    "resourceType" : "MESSAGE",
    "type" : "dataobject-message",
    "dataobjectName" : "OIVPM02_OIVPM02_data",
    "dataobjectPath" : "com/tmax/openframe/dto",
    "messageType" : "Json",
    "trimFlag" : "rtrim",
    "children" : [ {
      "eClass" : "http://www.tmax.co.kr/proobject/message#//MessageFieldType",
      "id" : "do_message_field",
      "type" : "dataobject-message-field",
      "array" : "0",
      "comments" : "",
      "decimal" : -1,
      "delegate" : false,
      "fieldType" : "string",
      "includeMessageName" : "MsgJson",
      "includeMessagePath" : "com.tmax.openframe.dto",
      "length" : "8",
      "logicalName" : "DATE",
      "maskingEndIndex" : 0,
      "maskingStartIndex" : 0,
      "metaId" : "",
      "physicalName" : "DATE",
      "referencedtoName" : "",
      "referenceId" : ""
    }, {
      "eClass" : "http://www.tmax.co.kr/proobject/message#//MessageFieldType",
      "id" : "do_message_field",
      "type" : "dataobject-message-field",
      "array" : "0",
      "comments" : "",
      "decimal" : -1,
      "delegate" : false,
      "fieldType" : "string",
      "includeMessageName" : "MsgJson",
      "includeMessagePath" : "com.tmax.openframe.dto",
      "length" : "4",
      "logicalName" : "TERM",
      "maskingEndIndex" : 0,
      "maskingStartIndex" : 0,
      "metaId" : "",
      "physicalName" : "TERM",
      "referencedtoName" : "",
      "referenceId" : ""
    }, {
      "eClass" : "http://www.tmax.co.kr/proobject/message#//MessageFieldType",
      "id" : "do_message_field",
      "type" : "dataobject-message-field",
      "array" : "0",
      "comments" : "",
      "decimal" : -1,
      "delegate" : false,
      "fieldType" : "string",
      "includeMessageName" : "MsgJson",
      "includeMessagePath" : "com.tmax.openframe.dto",
      "length" : "8",
      "logicalName" : "TIME",
      "maskingEndIndex" : 0,
      "maskingStartIndex" : 0,
      "metaId" : "",
      "physicalName" : "TIME",
      "referencedtoName" : "",
      "referenceId" : ""
    }, {
      "eClass" : "http://www.tmax.co.kr/proobject/message#//MessageFieldType",
      "id" : "do_message_field",
      "type" : "dataobject-message-field",
      "array" : "0",
      "comments" : "",
      "decimal" : -1,
      "delegate" : false,
      "fieldType" : "string",
      "includeMessageName" : "MsgJson",
      "includeMessagePath" : "com.tmax.openframe.dto",
      "length" : "8",
      "logicalName" : "IDEN1",
      "maskingEndIndex" : 0,
      "maskingStartIndex" : 0,
      "metaId" : "",
      "physicalName" : "IDEN1",
      "referencedtoName" : "",
      "referenceId" : ""
    }, {
      "eClass" : "http://www.tmax.co.kr/proobject/message#//MessageFieldType",
      "id" : "do_message_field",
      "type" : "dataobject-message-field",
      "array" : "0",
      "comments" : "",
      "decimal" : -1,
      "delegate" : false,
      "fieldType" : "string",
      "includeMessageName" : "MsgJson",
      "includeMessagePath" : "com.tmax.openframe.dto",
      "length" : "10",
      "logicalName" : "NAME1",
      "maskingEndIndex" : 0,
      "maskingStartIndex" : 0,
      "metaId" : "",
      "physicalName" : "NAME1",
      "referencedtoName" : "",
      "referenceId" : ""
    }, {
      "eClass" : "http://www.tmax.co.kr/proobject/message#//MessageFieldType",
      "id" : "do_message_field",
      "type" : "dataobject-message-field",
      "array" : "0",
      "comments" : "",
      "decimal" : -1,
      "delegate" : false,
      "fieldType" : "string",
      "includeMessageName" : "MsgJson",
      "includeMessagePath" : "com.tmax.openframe.dto",
      "length" : "15",
      "logicalName" : "DEPT1",
      "maskingEndIndex" : 0,
      "maskingStartIndex" : 0,
      "metaId" : "",
      "physicalName" : "DEPT1",
      "referencedtoName" : "",
      "referenceId" : ""
    }, {
      "eClass" : "http://www.tmax.co.kr/proobject/message#//MessageFieldType",
      "id" : "do_message_field",
      "type" : "dataobject-message-field",
      "array" : "0",
      "comments" : "",
      "decimal" : -1,
      "delegate" : false,
      "fieldType" : "string",
      "includeMessageName" : "MsgJson",
      "includeMessagePath" : "com.tmax.openframe.dto",
      "length" : "15",
      "logicalName" : "PHON1",
      "maskingEndIndex" : 0,
      "maskingStartIndex" : 0,
      "metaId" : "",
      "physicalName" : "PHON1",
      "referencedtoName" : "",
      "referenceId" : ""
    }, {
      "eClass" : "http://www.tmax.co.kr/proobject/message#//MessageFieldType",
      "id" : "do_message_field",
      "type" : "dataobject-message-field",
      "array" : "0",
      "comments" : "",
      "decimal" : -1,
      "delegate" : false,
      "fieldType" : "string",
      "includeMessageName" : "MsgJson",
      "includeMessagePath" : "com.tmax.openframe.dto",
      "length" : "8",
      "logicalName" : "IDEN2",
      "maskingEndIndex" : 0,
      "maskingStartIndex" : 0,
      "metaId" : "",
      "physicalName" : "IDEN2",
      "referencedtoName" : "",
      "referenceId" : ""
    }, {
      "eClass" : "http://www.tmax.co.kr/proobject/message#//MessageFieldType",
      "id" : "do_message_field",
      "type" : "dataobject-message-field",
      "array" : "0",
      "comments" : "",
      "decimal" : -1,
      "delegate" : false,
      "fieldType" : "string",
      "includeMessageName" : "MsgJson",
      "includeMessagePath" : "com.tmax.openframe.dto",
      "length" : "10",
      "logicalName" : "NAME2",
      "maskingEndIndex" : 0,
      "maskingStartIndex" : 0,
      "metaId" : "",
      "physicalName" : "NAME2",
      "referencedtoName" : "",
      "referenceId" : ""
    }, {
      "eClass" : "http://www.tmax.co.kr/proobject/message#//MessageFieldType",
      "id" : "do_message_field",
      "type" : "dataobject-message-field",
      "array" : "0",
      "comments" : "",
      "decimal" : -1,
      "delegate" : false,
      "fieldType" : "string",
      "includeMessageName" : "MsgJson",
      "includeMessagePath" : "com.tmax.openframe.dto",
      "length" : "15",
      "logicalName" : "DEPT2",
      "maskingEndIndex" : 0,
      "maskingStartIndex" : 0,
      "metaId" : "",
      "physicalName" : "DEPT2",
      "referencedtoName" : "",
      "referenceId" : ""
    }, {
      "eClass" : "http://www.tmax.co.kr/proobject/message#//MessageFieldType",
      "id" : "do_message_field",
      "type" : "dataobject-message-field",
      "array" : "0",
      "comments" : "",
      "decimal" : -1,
      "delegate" : false,
      "fieldType" : "string",
      "includeMessageName" : "MsgJson",
      "includeMessagePath" : "com.tmax.openframe.dto",
      "length" : "15",
      "logicalName" : "PHON2",
      "maskingEndIndex" : 0,
      "maskingStartIndex" : 0,
      "metaId" : "",
      "physicalName" : "PHON2",
      "referencedtoName" : "",
      "referenceId" : ""
    }, {
      "eClass" : "http://www.tmax.co.kr/proobject/message#//MessageFieldType",
      "id" : "do_message_field",
      "type" : "dataobject-message-field",
      "array" : "0",
      "comments" : "",
      "decimal" : -1,
      "delegate" : false,
      "fieldType" : "string",
      "includeMessageName" : "MsgJson",
      "includeMessagePath" : "com.tmax.openframe.dto",
      "length" : "8",
      "logicalName" : "IDEN3",
      "maskingEndIndex" : 0,
      "maskingStartIndex" : 0,
      "metaId" : "",
      "physicalName" : "IDEN3",
      "referencedtoName" : "",
      "referenceId" : ""
    }, {
      "eClass" : "http://www.tmax.co.kr/proobject/message#//MessageFieldType",
      "id" : "do_message_field",
      "type" : "dataobject-message-field",
      "array" : "0",
      "comments" : "",
      "decimal" : -1,
      "delegate" : false,
      "fieldType" : "string",
      "includeMessageName" : "MsgJson",
      "includeMessagePath" : "com.tmax.openframe.dto",
      "length" : "10",
      "logicalName" : "NAME3",
      "maskingEndIndex" : 0,
      "maskingStartIndex" : 0,
      "metaId" : "",
      "physicalName" : "NAME3",
      "referencedtoName" : "",
      "referenceId" : ""
    }, {
      "eClass" : "http://www.tmax.co.kr/proobject/message#//MessageFieldType",
      "id" : "do_message_field",
      "type" : "dataobject-message-field",
      "array" : "0",
      "comments" : "",
      "decimal" : -1,
      "delegate" : false,
      "fieldType" : "string",
      "includeMessageName" : "MsgJson",
      "includeMessagePath" : "com.tmax.openframe.dto",
      "length" : "15",
      "logicalName" : "DEPT3",
      "maskingEndIndex" : 0,
      "maskingStartIndex" : 0,
      "metaId" : "",
      "physicalName" : "DEPT3",
      "referencedtoName" : "",
      "referenceId" : ""
    }, {
      "eClass" : "http://www.tmax.co.kr/proobject/message#//MessageFieldType",
      "id" : "do_message_field",
      "type" : "dataobject-message-field",
      "array" : "0",
      "comments" : "",
      "decimal" : -1,
      "delegate" : false,
      "fieldType" : "string",
      "includeMessageName" : "MsgJson",
      "includeMessagePath" : "com.tmax.openframe.dto",
      "length" : "15",
      "logicalName" : "PHON3",
      "maskingEndIndex" : 0,
      "maskingStartIndex" : 0,
      "metaId" : "",
      "physicalName" : "PHON3",
      "referencedtoName" : "",
      "referenceId" : ""
    }, {
      "eClass" : "http://www.tmax.co.kr/proobject/message#//MessageFieldType",
      "id" : "do_message_field",
      "type" : "dataobject-message-field",
      "array" : "0",
      "comments" : "",
      "decimal" : -1,
      "delegate" : false,
      "fieldType" : "string",
      "includeMessageName" : "MsgJson",
      "includeMessagePath" : "com.tmax.openframe.dto",
      "length" : "8",
      "logicalName" : "IDEN4",
      "maskingEndIndex" : 0,
      "maskingStartIndex" : 0,
      "metaId" : "",
      "physicalName" : "IDEN4",
      "referencedtoName" : "",
      "referenceId" : ""
    }, {
      "eClass" : "http://www.tmax.co.kr/proobject/message#//MessageFieldType",
      "id" : "do_message_field",
      "type" : "dataobject-message-field",
      "array" : "0",
      "comments" : "",
      "decimal" : -1,
      "delegate" : false,
      "fieldType" : "string",
      "includeMessageName" : "MsgJson",
      "includeMessagePath" : "com.tmax.openframe.dto",
      "length" : "10",
      "logicalName" : "NAME4",
      "maskingEndIndex" : 0,
      "maskingStartIndex" : 0,
      "metaId" : "",
      "physicalName" : "NAME4",
      "referencedtoName" : "",
      "referenceId" : ""
    }, {
      "eClass" : "http://www.tmax.co.kr/proobject/message#//MessageFieldType",
      "id" : "do_message_field",
      "type" : "dataobject-message-field",
      "array" : "0",
      "comments" : "",
      "decimal" : -1,
      "delegate" : false,
      "fieldType" : "string",
      "includeMessageName" : "MsgJson",
      "includeMessagePath" : "com.tmax.openframe.dto",
      "length" : "15",
      "logicalName" : "DEPT4",
      "maskingEndIndex" : 0,
      "maskingStartIndex" : 0,
      "metaId" : "",
      "physicalName" : "DEPT4",
      "referencedtoName" : "",
      "referenceId" : ""
    }, {
      "eClass" : "http://www.tmax.co.kr/proobject/message#//MessageFieldType",
      "id" : "do_message_field",
      "type" : "dataobject-message-field",
      "array" : "0",
      "comments" : "",
      "decimal" : -1,
      "delegate" : false,
      "fieldType" : "string",
      "includeMessageName" : "MsgJson",
      "includeMessagePath" : "com.tmax.openframe.dto",
      "length" : "15",
      "logicalName" : "PHON4",
      "maskingEndIndex" : 0,
      "maskingStartIndex" : 0,
      "metaId" : "",
      "physicalName" : "PHON4",
      "referencedtoName" : "",
      "referenceId" : ""
    }, {
      "eClass" : "http://www.tmax.co.kr/proobject/message#//MessageFieldType",
      "id" : "do_message_field",
      "type" : "dataobject-message-field",
      "array" : "0",
      "comments" : "",
      "decimal" : -1,
      "delegate" : false,
      "fieldType" : "string",
      "includeMessageName" : "MsgJson",
      "includeMessagePath" : "com.tmax.openframe.dto",
      "length" : "8",
      "logicalName" : "IDEN5",
      "maskingEndIndex" : 0,
      "maskingStartIndex" : 0,
      "metaId" : "",
      "physicalName" : "IDEN5",
      "referencedtoName" : "",
      "referenceId" : ""
    }, {
      "eClass" : "http://www.tmax.co.kr/proobject/message#//MessageFieldType",
      "id" : "do_message_field",
      "type" : "dataobject-message-field",
      "array" : "0",
      "comments" : "",
      "decimal" : -1,
      "delegate" : false,
      "fieldType" : "string",
      "includeMessageName" : "MsgJson",
      "includeMessagePath" : "com.tmax.openframe.dto",
      "length" : "10",
      "logicalName" : "NAME5",
      "maskingEndIndex" : 0,
      "maskingStartIndex" : 0,
      "metaId" : "",
      "physicalName" : "NAME5",
      "referencedtoName" : "",
      "referenceId" : ""
    }, {
      "eClass" : "http://www.tmax.co.kr/proobject/message#//MessageFieldType",
      "id" : "do_message_field",
      "type" : "dataobject-message-field",
      "array" : "0",
      "comments" : "",
      "decimal" : -1,
      "delegate" : false,
      "fieldType" : "string",
      "includeMessageName" : "MsgJson",
      "includeMessagePath" : "com.tmax.openframe.dto",
      "length" : "15",
      "logicalName" : "DEPT5",
      "maskingEndIndex" : 0,
      "maskingStartIndex" : 0,
      "metaId" : "",
      "physicalName" : "DEPT5",
      "referencedtoName" : "",
      "referenceId" : ""
    }, {
      "eClass" : "http://www.tmax.co.kr/proobject/message#//MessageFieldType",
      "id" : "do_message_field",
      "type" : "dataobject-message-field",
      "array" : "0",
      "comments" : "",
      "decimal" : -1,
      "delegate" : false,
      "fieldType" : "string",
      "includeMessageName" : "MsgJson",
      "includeMessagePath" : "com.tmax.openframe.dto",
      "length" : "15",
      "logicalName" : "PHON5",
      "maskingEndIndex" : 0,
      "maskingStartIndex" : 0,
      "metaId" : "",
      "physicalName" : "PHON5",
      "referencedtoName" : "",
      "referenceId" : ""
    }, {
      "eClass" : "http://www.tmax.co.kr/proobject/message#//MessageFieldType",
      "id" : "do_message_field",
      "type" : "dataobject-message-field",
      "array" : "0",
      "comments" : "",
      "decimal" : -1,
      "delegate" : false,
      "fieldType" : "string",
      "includeMessageName" : "MsgJson",
      "includeMessagePath" : "com.tmax.openframe.dto",
      "length" : "8",
      "logicalName" : "BIDX",
      "maskingEndIndex" : 0,
      "maskingStartIndex" : 0,
      "metaId" : "",
      "physicalName" : "BIDX",
      "referencedtoName" : "",
      "referenceId" : ""
    }, {
      "eClass" : "http://www.tmax.co.kr/proobject/message#//MessageFieldType",
      "id" : "do_message_field",
      "type" : "dataobject-message-field",
      "array" : "0",
      "comments" : "",
      "decimal" : -1,
      "delegate" : false,
      "fieldType" : "string",
      "includeMessageName" : "MsgJson",
      "includeMessagePath" : "com.tmax.openframe.dto",
      "length" : "8",
      "logicalName" : "FIDX",
      "maskingEndIndex" : 0,
      "maskingStartIndex" : 0,
      "metaId" : "",
      "physicalName" : "FIDX",
      "referencedtoName" : "",
      "referenceId" : ""
    }, {
      "eClass" : "http://www.tmax.co.kr/proobject/message#//MessageFieldType",
      "id" : "do_message_field",
      "type" : "dataobject-message-field",
      "array" : "0",
      "comments" : "",
      "decimal" : -1,
      "delegate" : false,
      "fieldType" : "string",
      "includeMessageName" : "MsgJson",
      "includeMessagePath" : "com.tmax.openframe.dto",
      "length" : "76",
      "logicalName" : "MSG",
      "maskingEndIndex" : 0,
      "maskingStartIndex" : 0,
      "metaId" : "",
      "physicalName" : "MSG",
      "referencedtoName" : "",
      "referenceId" : ""
    } ]
  } ]
}