{
  "eClass" : "http://www.tmax.co.kr/proobject/message#//DocumentRoot",
  "id" : "msg_root",
  "type" : "dataobject-message-root",
  "children" : [ {
    "eClass" : "http://www.tmax.co.kr/proobject/message#//MessageType",
    "logicalName" : "OIVPM03_OIVPM03_dataMsgJson",
    "physicalName" : "OIVPM03_OIVPM03_dataMsgJson",
    "resourcePackage" : "com.tmax.openframe.dto",
    "resourcePath" : "com/tmax/openframe/dto",
    "resourceType" : "MESSAGE",
    "type" : "dataobject-message",
    "dataobjectName" : "OIVPM03_OIVPM03_data",
    "dataobjectPath" : "com/tmax/openframe/dto",
    "messageType" : "Json",
    "trimFlag" : "rtrim",
    "children" : [ {
      "eClass" : "http://www.tmax.co.kr/proobject/message#//MessageFieldType",
      "id" : "do_message_field",
      "type" : "dataobject-message-field",
      "array" : "0",
      "comments" : "",
      "decimal" : -1,
      "delegate" : false,
      "fieldType" : "string",
      "includeMessageName" : "MsgJson",
      "includeMessagePath" : "com.tmax.openframe.dto",
      "length" : "8",
      "logicalName" : "DATE",
      "maskingEndIndex" : 0,
      "maskingStartIndex" : 0,
      "metaId" : "",
      "physicalName" : "DATE",
      "referencedtoName" : "",
      "referenceId" : ""
    }, {
      "eClass" : "http://www.tmax.co.kr/proobject/message#//MessageFieldType",
      "id" : "do_message_field",
      "type" : "dataobject-message-field",
      "array" : "0",
      "comments" : "",
      "decimal" : -1,
      "delegate" : false,
      "fieldType" : "string",
      "includeMessageName" : "MsgJson",
      "includeMessagePath" : "com.tmax.openframe.dto",
      "length" : "4",
      "logicalName" : "TERM",
      "maskingEndIndex" : 0,
      "maskingStartIndex" : 0,
      "metaId" : "",
      "physicalName" : "TERM",
      "referencedtoName" : "",
      "referenceId" : ""
    }, {
      "eClass" : "http://www.tmax.co.kr/proobject/message#//MessageFieldType",
      "id" : "do_message_field",
      "type" : "dataobject-message-field",
      "array" : "0",
      "comments" : "",
      "decimal" : -1,
      "delegate" : false,
      "fieldType" : "string",
      "includeMessageName" : "MsgJson",
      "includeMessagePath" : "com.tmax.openframe.dto",
      "length" : "8",
      "logicalName" : "TIME",
      "maskingEndIndex" : 0,
      "maskingStartIndex" : 0,
      "metaId" : "",
      "physicalName" : "TIME",
      "referencedtoName" : "",
      "referenceId" : ""
    }, {
      "eClass" : "http://www.tmax.co.kr/proobject/message#//MessageFieldType",
      "id" : "do_message_field",
      "type" : "dataobject-message-field",
      "array" : "0",
      "comments" : "",
      "decimal" : -1,
      "delegate" : false,
      "fieldType" : "string",
      "includeMessageName" : "MsgJson",
      "includeMessagePath" : "com.tmax.openframe.dto",
      "length" : "8",
      "logicalName" : "IDEN",
      "maskingEndIndex" : 0,
      "maskingStartIndex" : 0,
      "metaId" : "",
      "physicalName" : "IDEN",
      "referencedtoName" : "",
      "referenceId" : ""
    }, {
      "eClass" : "http://www.tmax.co.kr/proobject/message#//MessageFieldType",
      "id" : "do_message_field",
      "type" : "dataobject-message-field",
      "array" : "0",
      "comments" : "",
      "decimal" : -1,
      "delegate" : false,
      "fieldType" : "string",
      "includeMessageName" : "MsgJson",
      "includeMessagePath" : "com.tmax.openframe.dto",
      "length" : "40",
      "logicalName" : "NAME",
      "maskingEndIndex" : 0,
      "maskingStartIndex" : 0,
      "metaId" : "",
      "physicalName" : "NAME",
      "referencedtoName" : "",
      "referenceId" : ""
    }, {
      "eClass" : "http://www.tmax.co.kr/proobject/message#//MessageFieldType",
      "id" : "do_message_field",
      "type" : "dataobject-message-field",
      "array" : "0",
      "comments" : "",
      "decimal" : -1,
      "delegate" : false,
      "fieldType" : "string",
      "includeMessageName" : "MsgJson",
      "includeMessagePath" : "com.tmax.openframe.dto",
      "length" : "40",
      "logicalName" : "DEPT",
      "maskingEndIndex" : 0,
      "maskingStartIndex" : 0,
      "metaId" : "",
      "physicalName" : "DEPT",
      "referencedtoName" : "",
      "referenceId" : ""
    }, {
      "eClass" : "http://www.tmax.co.kr/proobject/message#//MessageFieldType",
      "id" : "do_message_field",
      "type" : "dataobject-message-field",
      "array" : "0",
      "comments" : "",
      "decimal" : -1,
      "delegate" : false,
      "fieldType" : "string",
      "includeMessageName" : "MsgJson",
      "includeMessagePath" : "com.tmax.openframe.dto",
      "length" : "40",
      "logicalName" : "PHON",
      "maskingEndIndex" : 0,
      "maskingStartIndex" : 0,
      "metaId" : "",
      "physicalName" : "PHON",
      "referencedtoName" : "",
      "referenceId" : ""
    }, {
      "eClass" : "http://www.tmax.co.kr/proobject/message#//MessageFieldType",
      "id" : "do_message_field",
      "type" : "dataobject-message-field",
      "array" : "0",
      "comments" : "",
      "decimal" : -1,
      "delegate" : false,
      "fieldType" : "string",
      "includeMessageName" : "MsgJson",
      "includeMessagePath" : "com.tmax.openframe.dto",
      "length" : "40",
      "logicalName" : "EMAL",
      "maskingEndIndex" : 0,
      "maskingStartIndex" : 0,
      "metaId" : "",
      "physicalName" : "EMAL",
      "referencedtoName" : "",
      "referenceId" : ""
    }, {
      "eClass" : "http://www.tmax.co.kr/proobject/message#//MessageFieldType",
      "id" : "do_message_field",
      "type" : "dataobject-message-field",
      "array" : "0",
      "comments" : "",
      "decimal" : -1,
      "delegate" : false,
      "fieldType" : "string",
      "includeMessageName" : "MsgJson",
      "includeMessagePath" : "com.tmax.openframe.dto",
      "length" : "40",
      "logicalName" : "ADDR",
      "maskingEndIndex" : 0,
      "maskingStartIndex" : 0,
      "metaId" : "",
      "physicalName" : "ADDR",
      "referencedtoName" : "",
      "referenceId" : ""
    }, {
      "eClass" : "http://www.tmax.co.kr/proobject/message#//MessageFieldType",
      "id" : "do_message_field",
      "type" : "dataobject-message-field",
      "array" : "0",
      "comments" : "",
      "decimal" : -1,
      "delegate" : false,
      "fieldType" : "string",
      "includeMessageName" : "MsgJson",
      "includeMessagePath" : "com.tmax.openframe.dto",
      "length" : "76",
      "logicalName" : "MSG",
      "maskingEndIndex" : 0,
      "maskingStartIndex" : 0,
      "metaId" : "",
      "physicalName" : "MSG",
      "referencedtoName" : "",
      "referenceId" : ""
    } ]
  } ]
}