{
  "eClass" : "http://www.tmax.co.kr/proobject/message#//DocumentRoot",
  "id" : "msg_root",
  "type" : "dataobject-message-root",
  "children" : [ {
    "eClass" : "http://www.tmax.co.kr/proobject/message#//MessageType",
    "logicalName" : "OIVPM03_OIVPM03_metaMsgJson",
    "physicalName" : "OIVPM03_OIVPM03_metaMsgJson",
    "resourcePackage" : "com.tmax.openframe.dto",
    "resourcePath" : "com/tmax/openframe/dto",
    "resourceType" : "MESSAGE",
    "type" : "dataobject-message",
    "dataobjectName" : "OIVPM03_OIVPM03_meta",
    "dataobjectPath" : "com/tmax/openframe/dto",
    "messageType" : "Json",
    "trimFlag" : "rtrim",
    "children" : [ {
      "eClass" : "http://www.tmax.co.kr/proobject/message#//MessageFieldType",
      "id" : "do_message_field",
      "type" : "dataobject-message-field",
      "array" : "0",
      "comments" : "",
      "decimal" : -1,
      "delegate" : false,
      "fieldType" : "int",
      "includeMessageName" : "MsgJson",
      "includeMessagePath" : "com.tmax.openframe.dto",
      "length" : "5",
      "logicalName" : "DATE_length",
      "maskingEndIndex" : 0,
      "maskingStartIndex" : 0,
      "metaId" : "",
      "physicalName" : "DATE_length",
      "referencedtoName" : "",
      "referenceId" : ""
    }, {
      "eClass" : "http://www.tmax.co.kr/proobject/message#//MessageFieldType",
      "id" : "do_message_field",
      "type" : "dataobject-message-field",
      "array" : "0",
      "comments" : "",
      "decimal" : -1,
      "delegate" : false,
      "fieldType" : "string",
      "includeMessageName" : "MsgJson",
      "includeMessagePath" : "com.tmax.openframe.dto",
      "length" : "10",
      "logicalName" : "DATE_color",
      "maskingEndIndex" : 0,
      "maskingStartIndex" : 0,
      "metaId" : "",
      "physicalName" : "DATE_color",
      "referencedtoName" : "",
      "referenceId" : ""
    }, {
      "eClass" : "http://www.tmax.co.kr/proobject/message#//MessageFieldType",
      "id" : "do_message_field",
      "type" : "dataobject-message-field",
      "array" : "0",
      "comments" : "",
      "decimal" : -1,
      "delegate" : false,
      "fieldType" : "string",
      "includeMessageName" : "MsgJson",
      "includeMessagePath" : "com.tmax.openframe.dto",
      "length" : "10",
      "logicalName" : "DATE_hilight",
      "maskingEndIndex" : 0,
      "maskingStartIndex" : 0,
      "metaId" : "",
      "physicalName" : "DATE_hilight",
      "referencedtoName" : "",
      "referenceId" : ""
    }, {
      "eClass" : "http://www.tmax.co.kr/proobject/message#//MessageFieldType",
      "id" : "do_message_field",
      "type" : "dataobject-message-field",
      "array" : "0",
      "comments" : "",
      "decimal" : -1,
      "delegate" : false,
      "fieldType" : "string",
      "includeMessageName" : "MsgJson",
      "includeMessagePath" : "com.tmax.openframe.dto",
      "length" : "10",
      "logicalName" : "DATE_outline",
      "maskingEndIndex" : 0,
      "maskingStartIndex" : 0,
      "metaId" : "",
      "physicalName" : "DATE_outline",
      "referencedtoName" : "",
      "referenceId" : ""
    }, {
      "eClass" : "http://www.tmax.co.kr/proobject/message#//MessageFieldType",
      "id" : "do_message_field",
      "type" : "dataobject-message-field",
      "array" : "0",
      "comments" : "",
      "decimal" : -1,
      "delegate" : false,
      "fieldType" : "string",
      "includeMessageName" : "MsgJson",
      "includeMessagePath" : "com.tmax.openframe.dto",
      "length" : "10",
      "logicalName" : "DATE_transp",
      "maskingEndIndex" : 0,
      "maskingStartIndex" : 0,
      "metaId" : "",
      "physicalName" : "DATE_transp",
      "referencedtoName" : "",
      "referenceId" : ""
    }, {
      "eClass" : "http://www.tmax.co.kr/proobject/message#//MessageFieldType",
      "id" : "do_message_field",
      "type" : "dataobject-message-field",
      "array" : "0",
      "comments" : "",
      "decimal" : -1,
      "delegate" : false,
      "fieldType" : "string",
      "includeMessageName" : "MsgJson",
      "includeMessagePath" : "com.tmax.openframe.dto",
      "length" : "10",
      "logicalName" : "DATE_validn",
      "maskingEndIndex" : 0,
      "maskingStartIndex" : 0,
      "metaId" : "",
      "physicalName" : "DATE_validn",
      "referencedtoName" : "",
      "referenceId" : ""
    }, {
      "eClass" : "http://www.tmax.co.kr/proobject/message#//MessageFieldType",
      "id" : "do_message_field",
      "type" : "dataobject-message-field",
      "array" : "0",
      "comments" : "",
      "decimal" : -1,
      "delegate" : false,
      "fieldType" : "string",
      "includeMessageName" : "MsgJson",
      "includeMessagePath" : "com.tmax.openframe.dto",
      "length" : "10",
      "logicalName" : "DATE_sosi",
      "maskingEndIndex" : 0,
      "maskingStartIndex" : 0,
      "metaId" : "",
      "physicalName" : "DATE_sosi",
      "referencedtoName" : "",
      "referenceId" : ""
    }, {
      "eClass" : "http://www.tmax.co.kr/proobject/message#//MessageFieldType",
      "id" : "do_message_field",
      "type" : "dataobject-message-field",
      "array" : "0",
      "comments" : "",
      "decimal" : -1,
      "delegate" : false,
      "fieldType" : "string",
      "includeMessageName" : "MsgJson",
      "includeMessagePath" : "com.tmax.openframe.dto",
      "length" : "10",
      "logicalName" : "DATE_ps",
      "maskingEndIndex" : 0,
      "maskingStartIndex" : 0,
      "metaId" : "",
      "physicalName" : "DATE_ps",
      "referencedtoName" : "",
      "referenceId" : ""
    }, {
      "eClass" : "http://www.tmax.co.kr/proobject/message#//MessageFieldType",
      "id" : "do_message_field",
      "type" : "dataobject-message-field",
      "array" : "0",
      "comments" : "",
      "decimal" : -1,
      "delegate" : false,
      "fieldType" : "int",
      "includeMessageName" : "MsgJson",
      "includeMessagePath" : "com.tmax.openframe.dto",
      "length" : "5",
      "logicalName" : "TERM_length",
      "maskingEndIndex" : 0,
      "maskingStartIndex" : 0,
      "metaId" : "",
      "physicalName" : "TERM_length",
      "referencedtoName" : "",
      "referenceId" : ""
    }, {
      "eClass" : "http://www.tmax.co.kr/proobject/message#//MessageFieldType",
      "id" : "do_message_field",
      "type" : "dataobject-message-field",
      "array" : "0",
      "comments" : "",
      "decimal" : -1,
      "delegate" : false,
      "fieldType" : "string",
      "includeMessageName" : "MsgJson",
      "includeMessagePath" : "com.tmax.openframe.dto",
      "length" : "10",
      "logicalName" : "TERM_color",
      "maskingEndIndex" : 0,
      "maskingStartIndex" : 0,
      "metaId" : "",
      "physicalName" : "TERM_color",
      "referencedtoName" : "",
      "referenceId" : ""
    }, {
      "eClass" : "http://www.tmax.co.kr/proobject/message#//MessageFieldType",
      "id" : "do_message_field",
      "type" : "dataobject-message-field",
      "array" : "0",
      "comments" : "",
      "decimal" : -1,
      "delegate" : false,
      "fieldType" : "string",
      "includeMessageName" : "MsgJson",
      "includeMessagePath" : "com.tmax.openframe.dto",
      "length" : "10",
      "logicalName" : "TERM_hilight",
      "maskingEndIndex" : 0,
      "maskingStartIndex" : 0,
      "metaId" : "",
      "physicalName" : "TERM_hilight",
      "referencedtoName" : "",
      "referenceId" : ""
    }, {
      "eClass" : "http://www.tmax.co.kr/proobject/message#//MessageFieldType",
      "id" : "do_message_field",
      "type" : "dataobject-message-field",
      "array" : "0",
      "comments" : "",
      "decimal" : -1,
      "delegate" : false,
      "fieldType" : "string",
      "includeMessageName" : "MsgJson",
      "includeMessagePath" : "com.tmax.openframe.dto",
      "length" : "10",
      "logicalName" : "TERM_outline",
      "maskingEndIndex" : 0,
      "maskingStartIndex" : 0,
      "metaId" : "",
      "physicalName" : "TERM_outline",
      "referencedtoName" : "",
      "referenceId" : ""
    }, {
      "eClass" : "http://www.tmax.co.kr/proobject/message#//MessageFieldType",
      "id" : "do_message_field",
      "type" : "dataobject-message-field",
      "array" : "0",
      "comments" : "",
      "decimal" : -1,
      "delegate" : false,
      "fieldType" : "string",
      "includeMessageName" : "MsgJson",
      "includeMessagePath" : "com.tmax.openframe.dto",
      "length" : "10",
      "logicalName" : "TERM_transp",
      "maskingEndIndex" : 0,
      "maskingStartIndex" : 0,
      "metaId" : "",
      "physicalName" : "TERM_transp",
      "referencedtoName" : "",
      "referenceId" : ""
    }, {
      "eClass" : "http://www.tmax.co.kr/proobject/message#//MessageFieldType",
      "id" : "do_message_field",
      "type" : "dataobject-message-field",
      "array" : "0",
      "comments" : "",
      "decimal" : -1,
      "delegate" : false,
      "fieldType" : "string",
      "includeMessageName" : "MsgJson",
      "includeMessagePath" : "com.tmax.openframe.dto",
      "length" : "10",
      "logicalName" : "TERM_validn",
      "maskingEndIndex" : 0,
      "maskingStartIndex" : 0,
      "metaId" : "",
      "physicalName" : "TERM_validn",
      "referencedtoName" : "",
      "referenceId" : ""
    }, {
      "eClass" : "http://www.tmax.co.kr/proobject/message#//MessageFieldType",
      "id" : "do_message_field",
      "type" : "dataobject-message-field",
      "array" : "0",
      "comments" : "",
      "decimal" : -1,
      "delegate" : false,
      "fieldType" : "string",
      "includeMessageName" : "MsgJson",
      "includeMessagePath" : "com.tmax.openframe.dto",
      "length" : "10",
      "logicalName" : "TERM_sosi",
      "maskingEndIndex" : 0,
      "maskingStartIndex" : 0,
      "metaId" : "",
      "physicalName" : "TERM_sosi",
      "referencedtoName" : "",
      "referenceId" : ""
    }, {
      "eClass" : "http://www.tmax.co.kr/proobject/message#//MessageFieldType",
      "id" : "do_message_field",
      "type" : "dataobject-message-field",
      "array" : "0",
      "comments" : "",
      "decimal" : -1,
      "delegate" : false,
      "fieldType" : "string",
      "includeMessageName" : "MsgJson",
      "includeMessagePath" : "com.tmax.openframe.dto",
      "length" : "10",
      "logicalName" : "TERM_ps",
      "maskingEndIndex" : 0,
      "maskingStartIndex" : 0,
      "metaId" : "",
      "physicalName" : "TERM_ps",
      "referencedtoName" : "",
      "referenceId" : ""
    }, {
      "eClass" : "http://www.tmax.co.kr/proobject/message#//MessageFieldType",
      "id" : "do_message_field",
      "type" : "dataobject-message-field",
      "array" : "0",
      "comments" : "",
      "decimal" : -1,
      "delegate" : false,
      "fieldType" : "int",
      "includeMessageName" : "MsgJson",
      "includeMessagePath" : "com.tmax.openframe.dto",
      "length" : "5",
      "logicalName" : "TIME_length",
      "maskingEndIndex" : 0,
      "maskingStartIndex" : 0,
      "metaId" : "",
      "physicalName" : "TIME_length",
      "referencedtoName" : "",
      "referenceId" : ""
    }, {
      "eClass" : "http://www.tmax.co.kr/proobject/message#//MessageFieldType",
      "id" : "do_message_field",
      "type" : "dataobject-message-field",
      "array" : "0",
      "comments" : "",
      "decimal" : -1,
      "delegate" : false,
      "fieldType" : "string",
      "includeMessageName" : "MsgJson",
      "includeMessagePath" : "com.tmax.openframe.dto",
      "length" : "10",
      "logicalName" : "TIME_color",
      "maskingEndIndex" : 0,
      "maskingStartIndex" : 0,
      "metaId" : "",
      "physicalName" : "TIME_color",
      "referencedtoName" : "",
      "referenceId" : ""
    }, {
      "eClass" : "http://www.tmax.co.kr/proobject/message#//MessageFieldType",
      "id" : "do_message_field",
      "type" : "dataobject-message-field",
      "array" : "0",
      "comments" : "",
      "decimal" : -1,
      "delegate" : false,
      "fieldType" : "string",
      "includeMessageName" : "MsgJson",
      "includeMessagePath" : "com.tmax.openframe.dto",
      "length" : "10",
      "logicalName" : "TIME_hilight",
      "maskingEndIndex" : 0,
      "maskingStartIndex" : 0,
      "metaId" : "",
      "physicalName" : "TIME_hilight",
      "referencedtoName" : "",
      "referenceId" : ""
    }, {
      "eClass" : "http://www.tmax.co.kr/proobject/message#//MessageFieldType",
      "id" : "do_message_field",
      "type" : "dataobject-message-field",
      "array" : "0",
      "comments" : "",
      "decimal" : -1,
      "delegate" : false,
      "fieldType" : "string",
      "includeMessageName" : "MsgJson",
      "includeMessagePath" : "com.tmax.openframe.dto",
      "length" : "10",
      "logicalName" : "TIME_outline",
      "maskingEndIndex" : 0,
      "maskingStartIndex" : 0,
      "metaId" : "",
      "physicalName" : "TIME_outline",
      "referencedtoName" : "",
      "referenceId" : ""
    }, {
      "eClass" : "http://www.tmax.co.kr/proobject/message#//MessageFieldType",
      "id" : "do_message_field",
      "type" : "dataobject-message-field",
      "array" : "0",
      "comments" : "",
      "decimal" : -1,
      "delegate" : false,
      "fieldType" : "string",
      "includeMessageName" : "MsgJson",
      "includeMessagePath" : "com.tmax.openframe.dto",
      "length" : "10",
      "logicalName" : "TIME_transp",
      "maskingEndIndex" : 0,
      "maskingStartIndex" : 0,
      "metaId" : "",
      "physicalName" : "TIME_transp",
      "referencedtoName" : "",
      "referenceId" : ""
    }, {
      "eClass" : "http://www.tmax.co.kr/proobject/message#//MessageFieldType",
      "id" : "do_message_field",
      "type" : "dataobject-message-field",
      "array" : "0",
      "comments" : "",
      "decimal" : -1,
      "delegate" : false,
      "fieldType" : "string",
      "includeMessageName" : "MsgJson",
      "includeMessagePath" : "com.tmax.openframe.dto",
      "length" : "10",
      "logicalName" : "TIME_validn",
      "maskingEndIndex" : 0,
      "maskingStartIndex" : 0,
      "metaId" : "",
      "physicalName" : "TIME_validn",
      "referencedtoName" : "",
      "referenceId" : ""
    }, {
      "eClass" : "http://www.tmax.co.kr/proobject/message#//MessageFieldType",
      "id" : "do_message_field",
      "type" : "dataobject-message-field",
      "array" : "0",
      "comments" : "",
      "decimal" : -1,
      "delegate" : false,
      "fieldType" : "string",
      "includeMessageName" : "MsgJson",
      "includeMessagePath" : "com.tmax.openframe.dto",
      "length" : "10",
      "logicalName" : "TIME_sosi",
      "maskingEndIndex" : 0,
      "maskingStartIndex" : 0,
      "metaId" : "",
      "physicalName" : "TIME_sosi",
      "referencedtoName" : "",
      "referenceId" : ""
    }, {
      "eClass" : "http://www.tmax.co.kr/proobject/message#//MessageFieldType",
      "id" : "do_message_field",
      "type" : "dataobject-message-field",
      "array" : "0",
      "comments" : "",
      "decimal" : -1,
      "delegate" : false,
      "fieldType" : "string",
      "includeMessageName" : "MsgJson",
      "includeMessagePath" : "com.tmax.openframe.dto",
      "length" : "10",
      "logicalName" : "TIME_ps",
      "maskingEndIndex" : 0,
      "maskingStartIndex" : 0,
      "metaId" : "",
      "physicalName" : "TIME_ps",
      "referencedtoName" : "",
      "referenceId" : ""
    }, {
      "eClass" : "http://www.tmax.co.kr/proobject/message#//MessageFieldType",
      "id" : "do_message_field",
      "type" : "dataobject-message-field",
      "array" : "0",
      "comments" : "",
      "decimal" : -1,
      "delegate" : false,
      "fieldType" : "int",
      "includeMessageName" : "MsgJson",
      "includeMessagePath" : "com.tmax.openframe.dto",
      "length" : "5",
      "logicalName" : "IDEN_length",
      "maskingEndIndex" : 0,
      "maskingStartIndex" : 0,
      "metaId" : "",
      "physicalName" : "IDEN_length",
      "referencedtoName" : "",
      "referenceId" : ""
    }, {
      "eClass" : "http://www.tmax.co.kr/proobject/message#//MessageFieldType",
      "id" : "do_message_field",
      "type" : "dataobject-message-field",
      "array" : "0",
      "comments" : "",
      "decimal" : -1,
      "delegate" : false,
      "fieldType" : "string",
      "includeMessageName" : "MsgJson",
      "includeMessagePath" : "com.tmax.openframe.dto",
      "length" : "10",
      "logicalName" : "IDEN_color",
      "maskingEndIndex" : 0,
      "maskingStartIndex" : 0,
      "metaId" : "",
      "physicalName" : "IDEN_color",
      "referencedtoName" : "",
      "referenceId" : ""
    }, {
      "eClass" : "http://www.tmax.co.kr/proobject/message#//MessageFieldType",
      "id" : "do_message_field",
      "type" : "dataobject-message-field",
      "array" : "0",
      "comments" : "",
      "decimal" : -1,
      "delegate" : false,
      "fieldType" : "string",
      "includeMessageName" : "MsgJson",
      "includeMessagePath" : "com.tmax.openframe.dto",
      "length" : "10",
      "logicalName" : "IDEN_hilight",
      "maskingEndIndex" : 0,
      "maskingStartIndex" : 0,
      "metaId" : "",
      "physicalName" : "IDEN_hilight",
      "referencedtoName" : "",
      "referenceId" : ""
    }, {
      "eClass" : "http://www.tmax.co.kr/proobject/message#//MessageFieldType",
      "id" : "do_message_field",
      "type" : "dataobject-message-field",
      "array" : "0",
      "comments" : "",
      "decimal" : -1,
      "delegate" : false,
      "fieldType" : "string",
      "includeMessageName" : "MsgJson",
      "includeMessagePath" : "com.tmax.openframe.dto",
      "length" : "10",
      "logicalName" : "IDEN_outline",
      "maskingEndIndex" : 0,
      "maskingStartIndex" : 0,
      "metaId" : "",
      "physicalName" : "IDEN_outline",
      "referencedtoName" : "",
      "referenceId" : ""
    }, {
      "eClass" : "http://www.tmax.co.kr/proobject/message#//MessageFieldType",
      "id" : "do_message_field",
      "type" : "dataobject-message-field",
      "array" : "0",
      "comments" : "",
      "decimal" : -1,
      "delegate" : false,
      "fieldType" : "string",
      "includeMessageName" : "MsgJson",
      "includeMessagePath" : "com.tmax.openframe.dto",
      "length" : "10",
      "logicalName" : "IDEN_transp",
      "maskingEndIndex" : 0,
      "maskingStartIndex" : 0,
      "metaId" : "",
      "physicalName" : "IDEN_transp",
      "referencedtoName" : "",
      "referenceId" : ""
    }, {
      "eClass" : "http://www.tmax.co.kr/proobject/message#//MessageFieldType",
      "id" : "do_message_field",
      "type" : "dataobject-message-field",
      "array" : "0",
      "comments" : "",
      "decimal" : -1,
      "delegate" : false,
      "fieldType" : "string",
      "includeMessageName" : "MsgJson",
      "includeMessagePath" : "com.tmax.openframe.dto",
      "length" : "10",
      "logicalName" : "IDEN_validn",
      "maskingEndIndex" : 0,
      "maskingStartIndex" : 0,
      "metaId" : "",
      "physicalName" : "IDEN_validn",
      "referencedtoName" : "",
      "referenceId" : ""
    }, {
      "eClass" : "http://www.tmax.co.kr/proobject/message#//MessageFieldType",
      "id" : "do_message_field",
      "type" : "dataobject-message-field",
      "array" : "0",
      "comments" : "",
      "decimal" : -1,
      "delegate" : false,
      "fieldType" : "string",
      "includeMessageName" : "MsgJson",
      "includeMessagePath" : "com.tmax.openframe.dto",
      "length" : "10",
      "logicalName" : "IDEN_sosi",
      "maskingEndIndex" : 0,
      "maskingStartIndex" : 0,
      "metaId" : "",
      "physicalName" : "IDEN_sosi",
      "referencedtoName" : "",
      "referenceId" : ""
    }, {
      "eClass" : "http://www.tmax.co.kr/proobject/message#//MessageFieldType",
      "id" : "do_message_field",
      "type" : "dataobject-message-field",
      "array" : "0",
      "comments" : "",
      "decimal" : -1,
      "delegate" : false,
      "fieldType" : "string",
      "includeMessageName" : "MsgJson",
      "includeMessagePath" : "com.tmax.openframe.dto",
      "length" : "10",
      "logicalName" : "IDEN_ps",
      "maskingEndIndex" : 0,
      "maskingStartIndex" : 0,
      "metaId" : "",
      "physicalName" : "IDEN_ps",
      "referencedtoName" : "",
      "referenceId" : ""
    }, {
      "eClass" : "http://www.tmax.co.kr/proobject/message#//MessageFieldType",
      "id" : "do_message_field",
      "type" : "dataobject-message-field",
      "array" : "0",
      "comments" : "",
      "decimal" : -1,
      "delegate" : false,
      "fieldType" : "int",
      "includeMessageName" : "MsgJson",
      "includeMessagePath" : "com.tmax.openframe.dto",
      "length" : "5",
      "logicalName" : "NAME_length",
      "maskingEndIndex" : 0,
      "maskingStartIndex" : 0,
      "metaId" : "",
      "physicalName" : "NAME_length",
      "referencedtoName" : "",
      "referenceId" : ""
    }, {
      "eClass" : "http://www.tmax.co.kr/proobject/message#//MessageFieldType",
      "id" : "do_message_field",
      "type" : "dataobject-message-field",
      "array" : "0",
      "comments" : "",
      "decimal" : -1,
      "delegate" : false,
      "fieldType" : "string",
      "includeMessageName" : "MsgJson",
      "includeMessagePath" : "com.tmax.openframe.dto",
      "length" : "10",
      "logicalName" : "NAME_color",
      "maskingEndIndex" : 0,
      "maskingStartIndex" : 0,
      "metaId" : "",
      "physicalName" : "NAME_color",
      "referencedtoName" : "",
      "referenceId" : ""
    }, {
      "eClass" : "http://www.tmax.co.kr/proobject/message#//MessageFieldType",
      "id" : "do_message_field",
      "type" : "dataobject-message-field",
      "array" : "0",
      "comments" : "",
      "decimal" : -1,
      "delegate" : false,
      "fieldType" : "string",
      "includeMessageName" : "MsgJson",
      "includeMessagePath" : "com.tmax.openframe.dto",
      "length" : "10",
      "logicalName" : "NAME_hilight",
      "maskingEndIndex" : 0,
      "maskingStartIndex" : 0,
      "metaId" : "",
      "physicalName" : "NAME_hilight",
      "referencedtoName" : "",
      "referenceId" : ""
    }, {
      "eClass" : "http://www.tmax.co.kr/proobject/message#//MessageFieldType",
      "id" : "do_message_field",
      "type" : "dataobject-message-field",
      "array" : "0",
      "comments" : "",
      "decimal" : -1,
      "delegate" : false,
      "fieldType" : "string",
      "includeMessageName" : "MsgJson",
      "includeMessagePath" : "com.tmax.openframe.dto",
      "length" : "10",
      "logicalName" : "NAME_outline",
      "maskingEndIndex" : 0,
      "maskingStartIndex" : 0,
      "metaId" : "",
      "physicalName" : "NAME_outline",
      "referencedtoName" : "",
      "referenceId" : ""
    }, {
      "eClass" : "http://www.tmax.co.kr/proobject/message#//MessageFieldType",
      "id" : "do_message_field",
      "type" : "dataobject-message-field",
      "array" : "0",
      "comments" : "",
      "decimal" : -1,
      "delegate" : false,
      "fieldType" : "string",
      "includeMessageName" : "MsgJson",
      "includeMessagePath" : "com.tmax.openframe.dto",
      "length" : "10",
      "logicalName" : "NAME_transp",
      "maskingEndIndex" : 0,
      "maskingStartIndex" : 0,
      "metaId" : "",
      "physicalName" : "NAME_transp",
      "referencedtoName" : "",
      "referenceId" : ""
    }, {
      "eClass" : "http://www.tmax.co.kr/proobject/message#//MessageFieldType",
      "id" : "do_message_field",
      "type" : "dataobject-message-field",
      "array" : "0",
      "comments" : "",
      "decimal" : -1,
      "delegate" : false,
      "fieldType" : "string",
      "includeMessageName" : "MsgJson",
      "includeMessagePath" : "com.tmax.openframe.dto",
      "length" : "10",
      "logicalName" : "NAME_validn",
      "maskingEndIndex" : 0,
      "maskingStartIndex" : 0,
      "metaId" : "",
      "physicalName" : "NAME_validn",
      "referencedtoName" : "",
      "referenceId" : ""
    }, {
      "eClass" : "http://www.tmax.co.kr/proobject/message#//MessageFieldType",
      "id" : "do_message_field",
      "type" : "dataobject-message-field",
      "array" : "0",
      "comments" : "",
      "decimal" : -1,
      "delegate" : false,
      "fieldType" : "string",
      "includeMessageName" : "MsgJson",
      "includeMessagePath" : "com.tmax.openframe.dto",
      "length" : "10",
      "logicalName" : "NAME_sosi",
      "maskingEndIndex" : 0,
      "maskingStartIndex" : 0,
      "metaId" : "",
      "physicalName" : "NAME_sosi",
      "referencedtoName" : "",
      "referenceId" : ""
    }, {
      "eClass" : "http://www.tmax.co.kr/proobject/message#//MessageFieldType",
      "id" : "do_message_field",
      "type" : "dataobject-message-field",
      "array" : "0",
      "comments" : "",
      "decimal" : -1,
      "delegate" : false,
      "fieldType" : "string",
      "includeMessageName" : "MsgJson",
      "includeMessagePath" : "com.tmax.openframe.dto",
      "length" : "10",
      "logicalName" : "NAME_ps",
      "maskingEndIndex" : 0,
      "maskingStartIndex" : 0,
      "metaId" : "",
      "physicalName" : "NAME_ps",
      "referencedtoName" : "",
      "referenceId" : ""
    }, {
      "eClass" : "http://www.tmax.co.kr/proobject/message#//MessageFieldType",
      "id" : "do_message_field",
      "type" : "dataobject-message-field",
      "array" : "0",
      "comments" : "",
      "decimal" : -1,
      "delegate" : false,
      "fieldType" : "int",
      "includeMessageName" : "MsgJson",
      "includeMessagePath" : "com.tmax.openframe.dto",
      "length" : "5",
      "logicalName" : "DEPT_length",
      "maskingEndIndex" : 0,
      "maskingStartIndex" : 0,
      "metaId" : "",
      "physicalName" : "DEPT_length",
      "referencedtoName" : "",
      "referenceId" : ""
    }, {
      "eClass" : "http://www.tmax.co.kr/proobject/message#//MessageFieldType",
      "id" : "do_message_field",
      "type" : "dataobject-message-field",
      "array" : "0",
      "comments" : "",
      "decimal" : -1,
      "delegate" : false,
      "fieldType" : "string",
      "includeMessageName" : "MsgJson",
      "includeMessagePath" : "com.tmax.openframe.dto",
      "length" : "10",
      "logicalName" : "DEPT_color",
      "maskingEndIndex" : 0,
      "maskingStartIndex" : 0,
      "metaId" : "",
      "physicalName" : "DEPT_color",
      "referencedtoName" : "",
      "referenceId" : ""
    }, {
      "eClass" : "http://www.tmax.co.kr/proobject/message#//MessageFieldType",
      "id" : "do_message_field",
      "type" : "dataobject-message-field",
      "array" : "0",
      "comments" : "",
      "decimal" : -1,
      "delegate" : false,
      "fieldType" : "string",
      "includeMessageName" : "MsgJson",
      "includeMessagePath" : "com.tmax.openframe.dto",
      "length" : "10",
      "logicalName" : "DEPT_hilight",
      "maskingEndIndex" : 0,
      "maskingStartIndex" : 0,
      "metaId" : "",
      "physicalName" : "DEPT_hilight",
      "referencedtoName" : "",
      "referenceId" : ""
    }, {
      "eClass" : "http://www.tmax.co.kr/proobject/message#//MessageFieldType",
      "id" : "do_message_field",
      "type" : "dataobject-message-field",
      "array" : "0",
      "comments" : "",
      "decimal" : -1,
      "delegate" : false,
      "fieldType" : "string",
      "includeMessageName" : "MsgJson",
      "includeMessagePath" : "com.tmax.openframe.dto",
      "length" : "10",
      "logicalName" : "DEPT_outline",
      "maskingEndIndex" : 0,
      "maskingStartIndex" : 0,
      "metaId" : "",
      "physicalName" : "DEPT_outline",
      "referencedtoName" : "",
      "referenceId" : ""
    }, {
      "eClass" : "http://www.tmax.co.kr/proobject/message#//MessageFieldType",
      "id" : "do_message_field",
      "type" : "dataobject-message-field",
      "array" : "0",
      "comments" : "",
      "decimal" : -1,
      "delegate" : false,
      "fieldType" : "string",
      "includeMessageName" : "MsgJson",
      "includeMessagePath" : "com.tmax.openframe.dto",
      "length" : "10",
      "logicalName" : "DEPT_transp",
      "maskingEndIndex" : 0,
      "maskingStartIndex" : 0,
      "metaId" : "",
      "physicalName" : "DEPT_transp",
      "referencedtoName" : "",
      "referenceId" : ""
    }, {
      "eClass" : "http://www.tmax.co.kr/proobject/message#//MessageFieldType",
      "id" : "do_message_field",
      "type" : "dataobject-message-field",
      "array" : "0",
      "comments" : "",
      "decimal" : -1,
      "delegate" : false,
      "fieldType" : "string",
      "includeMessageName" : "MsgJson",
      "includeMessagePath" : "com.tmax.openframe.dto",
      "length" : "10",
      "logicalName" : "DEPT_validn",
      "maskingEndIndex" : 0,
      "maskingStartIndex" : 0,
      "metaId" : "",
      "physicalName" : "DEPT_validn",
      "referencedtoName" : "",
      "referenceId" : ""
    }, {
      "eClass" : "http://www.tmax.co.kr/proobject/message#//MessageFieldType",
      "id" : "do_message_field",
      "type" : "dataobject-message-field",
      "array" : "0",
      "comments" : "",
      "decimal" : -1,
      "delegate" : false,
      "fieldType" : "string",
      "includeMessageName" : "MsgJson",
      "includeMessagePath" : "com.tmax.openframe.dto",
      "length" : "10",
      "logicalName" : "DEPT_sosi",
      "maskingEndIndex" : 0,
      "maskingStartIndex" : 0,
      "metaId" : "",
      "physicalName" : "DEPT_sosi",
      "referencedtoName" : "",
      "referenceId" : ""
    }, {
      "eClass" : "http://www.tmax.co.kr/proobject/message#//MessageFieldType",
      "id" : "do_message_field",
      "type" : "dataobject-message-field",
      "array" : "0",
      "comments" : "",
      "decimal" : -1,
      "delegate" : false,
      "fieldType" : "string",
      "includeMessageName" : "MsgJson",
      "includeMessagePath" : "com.tmax.openframe.dto",
      "length" : "10",
      "logicalName" : "DEPT_ps",
      "maskingEndIndex" : 0,
      "maskingStartIndex" : 0,
      "metaId" : "",
      "physicalName" : "DEPT_ps",
      "referencedtoName" : "",
      "referenceId" : ""
    }, {
      "eClass" : "http://www.tmax.co.kr/proobject/message#//MessageFieldType",
      "id" : "do_message_field",
      "type" : "dataobject-message-field",
      "array" : "0",
      "comments" : "",
      "decimal" : -1,
      "delegate" : false,
      "fieldType" : "int",
      "includeMessageName" : "MsgJson",
      "includeMessagePath" : "com.tmax.openframe.dto",
      "length" : "5",
      "logicalName" : "PHON_length",
      "maskingEndIndex" : 0,
      "maskingStartIndex" : 0,
      "metaId" : "",
      "physicalName" : "PHON_length",
      "referencedtoName" : "",
      "referenceId" : ""
    }, {
      "eClass" : "http://www.tmax.co.kr/proobject/message#//MessageFieldType",
      "id" : "do_message_field",
      "type" : "dataobject-message-field",
      "array" : "0",
      "comments" : "",
      "decimal" : -1,
      "delegate" : false,
      "fieldType" : "string",
      "includeMessageName" : "MsgJson",
      "includeMessagePath" : "com.tmax.openframe.dto",
      "length" : "10",
      "logicalName" : "PHON_color",
      "maskingEndIndex" : 0,
      "maskingStartIndex" : 0,
      "metaId" : "",
      "physicalName" : "PHON_color",
      "referencedtoName" : "",
      "referenceId" : ""
    }, {
      "eClass" : "http://www.tmax.co.kr/proobject/message#//MessageFieldType",
      "id" : "do_message_field",
      "type" : "dataobject-message-field",
      "array" : "0",
      "comments" : "",
      "decimal" : -1,
      "delegate" : false,
      "fieldType" : "string",
      "includeMessageName" : "MsgJson",
      "includeMessagePath" : "com.tmax.openframe.dto",
      "length" : "10",
      "logicalName" : "PHON_hilight",
      "maskingEndIndex" : 0,
      "maskingStartIndex" : 0,
      "metaId" : "",
      "physicalName" : "PHON_hilight",
      "referencedtoName" : "",
      "referenceId" : ""
    }, {
      "eClass" : "http://www.tmax.co.kr/proobject/message#//MessageFieldType",
      "id" : "do_message_field",
      "type" : "dataobject-message-field",
      "array" : "0",
      "comments" : "",
      "decimal" : -1,
      "delegate" : false,
      "fieldType" : "string",
      "includeMessageName" : "MsgJson",
      "includeMessagePath" : "com.tmax.openframe.dto",
      "length" : "10",
      "logicalName" : "PHON_outline",
      "maskingEndIndex" : 0,
      "maskingStartIndex" : 0,
      "metaId" : "",
      "physicalName" : "PHON_outline",
      "referencedtoName" : "",
      "referenceId" : ""
    }, {
      "eClass" : "http://www.tmax.co.kr/proobject/message#//MessageFieldType",
      "id" : "do_message_field",
      "type" : "dataobject-message-field",
      "array" : "0",
      "comments" : "",
      "decimal" : -1,
      "delegate" : false,
      "fieldType" : "string",
      "includeMessageName" : "MsgJson",
      "includeMessagePath" : "com.tmax.openframe.dto",
      "length" : "10",
      "logicalName" : "PHON_transp",
      "maskingEndIndex" : 0,
      "maskingStartIndex" : 0,
      "metaId" : "",
      "physicalName" : "PHON_transp",
      "referencedtoName" : "",
      "referenceId" : ""
    }, {
      "eClass" : "http://www.tmax.co.kr/proobject/message#//MessageFieldType",
      "id" : "do_message_field",
      "type" : "dataobject-message-field",
      "array" : "0",
      "comments" : "",
      "decimal" : -1,
      "delegate" : false,
      "fieldType" : "string",
      "includeMessageName" : "MsgJson",
      "includeMessagePath" : "com.tmax.openframe.dto",
      "length" : "10",
      "logicalName" : "PHON_validn",
      "maskingEndIndex" : 0,
      "maskingStartIndex" : 0,
      "metaId" : "",
      "physicalName" : "PHON_validn",
      "referencedtoName" : "",
      "referenceId" : ""
    }, {
      "eClass" : "http://www.tmax.co.kr/proobject/message#//MessageFieldType",
      "id" : "do_message_field",
      "type" : "dataobject-message-field",
      "array" : "0",
      "comments" : "",
      "decimal" : -1,
      "delegate" : false,
      "fieldType" : "string",
      "includeMessageName" : "MsgJson",
      "includeMessagePath" : "com.tmax.openframe.dto",
      "length" : "10",
      "logicalName" : "PHON_sosi",
      "maskingEndIndex" : 0,
      "maskingStartIndex" : 0,
      "metaId" : "",
      "physicalName" : "PHON_sosi",
      "referencedtoName" : "",
      "referenceId" : ""
    }, {
      "eClass" : "http://www.tmax.co.kr/proobject/message#//MessageFieldType",
      "id" : "do_message_field",
      "type" : "dataobject-message-field",
      "array" : "0",
      "comments" : "",
      "decimal" : -1,
      "delegate" : false,
      "fieldType" : "string",
      "includeMessageName" : "MsgJson",
      "includeMessagePath" : "com.tmax.openframe.dto",
      "length" : "10",
      "logicalName" : "PHON_ps",
      "maskingEndIndex" : 0,
      "maskingStartIndex" : 0,
      "metaId" : "",
      "physicalName" : "PHON_ps",
      "referencedtoName" : "",
      "referenceId" : ""
    }, {
      "eClass" : "http://www.tmax.co.kr/proobject/message#//MessageFieldType",
      "id" : "do_message_field",
      "type" : "dataobject-message-field",
      "array" : "0",
      "comments" : "",
      "decimal" : -1,
      "delegate" : false,
      "fieldType" : "int",
      "includeMessageName" : "MsgJson",
      "includeMessagePath" : "com.tmax.openframe.dto",
      "length" : "5",
      "logicalName" : "EMAL_length",
      "maskingEndIndex" : 0,
      "maskingStartIndex" : 0,
      "metaId" : "",
      "physicalName" : "EMAL_length",
      "referencedtoName" : "",
      "referenceId" : ""
    }, {
      "eClass" : "http://www.tmax.co.kr/proobject/message#//MessageFieldType",
      "id" : "do_message_field",
      "type" : "dataobject-message-field",
      "array" : "0",
      "comments" : "",
      "decimal" : -1,
      "delegate" : false,
      "fieldType" : "string",
      "includeMessageName" : "MsgJson",
      "includeMessagePath" : "com.tmax.openframe.dto",
      "length" : "10",
      "logicalName" : "EMAL_color",
      "maskingEndIndex" : 0,
      "maskingStartIndex" : 0,
      "metaId" : "",
      "physicalName" : "EMAL_color",
      "referencedtoName" : "",
      "referenceId" : ""
    }, {
      "eClass" : "http://www.tmax.co.kr/proobject/message#//MessageFieldType",
      "id" : "do_message_field",
      "type" : "dataobject-message-field",
      "array" : "0",
      "comments" : "",
      "decimal" : -1,
      "delegate" : false,
      "fieldType" : "string",
      "includeMessageName" : "MsgJson",
      "includeMessagePath" : "com.tmax.openframe.dto",
      "length" : "10",
      "logicalName" : "EMAL_hilight",
      "maskingEndIndex" : 0,
      "maskingStartIndex" : 0,
      "metaId" : "",
      "physicalName" : "EMAL_hilight",
      "referencedtoName" : "",
      "referenceId" : ""
    }, {
      "eClass" : "http://www.tmax.co.kr/proobject/message#//MessageFieldType",
      "id" : "do_message_field",
      "type" : "dataobject-message-field",
      "array" : "0",
      "comments" : "",
      "decimal" : -1,
      "delegate" : false,
      "fieldType" : "string",
      "includeMessageName" : "MsgJson",
      "includeMessagePath" : "com.tmax.openframe.dto",
      "length" : "10",
      "logicalName" : "EMAL_outline",
      "maskingEndIndex" : 0,
      "maskingStartIndex" : 0,
      "metaId" : "",
      "physicalName" : "EMAL_outline",
      "referencedtoName" : "",
      "referenceId" : ""
    }, {
      "eClass" : "http://www.tmax.co.kr/proobject/message#//MessageFieldType",
      "id" : "do_message_field",
      "type" : "dataobject-message-field",
      "array" : "0",
      "comments" : "",
      "decimal" : -1,
      "delegate" : false,
      "fieldType" : "string",
      "includeMessageName" : "MsgJson",
      "includeMessagePath" : "com.tmax.openframe.dto",
      "length" : "10",
      "logicalName" : "EMAL_transp",
      "maskingEndIndex" : 0,
      "maskingStartIndex" : 0,
      "metaId" : "",
      "physicalName" : "EMAL_transp",
      "referencedtoName" : "",
      "referenceId" : ""
    }, {
      "eClass" : "http://www.tmax.co.kr/proobject/message#//MessageFieldType",
      "id" : "do_message_field",
      "type" : "dataobject-message-field",
      "array" : "0",
      "comments" : "",
      "decimal" : -1,
      "delegate" : false,
      "fieldType" : "string",
      "includeMessageName" : "MsgJson",
      "includeMessagePath" : "com.tmax.openframe.dto",
      "length" : "10",
      "logicalName" : "EMAL_validn",
      "maskingEndIndex" : 0,
      "maskingStartIndex" : 0,
      "metaId" : "",
      "physicalName" : "EMAL_validn",
      "referencedtoName" : "",
      "referenceId" : ""
    }, {
      "eClass" : "http://www.tmax.co.kr/proobject/message#//MessageFieldType",
      "id" : "do_message_field",
      "type" : "dataobject-message-field",
      "array" : "0",
      "comments" : "",
      "decimal" : -1,
      "delegate" : false,
      "fieldType" : "string",
      "includeMessageName" : "MsgJson",
      "includeMessagePath" : "com.tmax.openframe.dto",
      "length" : "10",
      "logicalName" : "EMAL_sosi",
      "maskingEndIndex" : 0,
      "maskingStartIndex" : 0,
      "metaId" : "",
      "physicalName" : "EMAL_sosi",
      "referencedtoName" : "",
      "referenceId" : ""
    }, {
      "eClass" : "http://www.tmax.co.kr/proobject/message#//MessageFieldType",
      "id" : "do_message_field",
      "type" : "dataobject-message-field",
      "array" : "0",
      "comments" : "",
      "decimal" : -1,
      "delegate" : false,
      "fieldType" : "string",
      "includeMessageName" : "MsgJson",
      "includeMessagePath" : "com.tmax.openframe.dto",
      "length" : "10",
      "logicalName" : "EMAL_ps",
      "maskingEndIndex" : 0,
      "maskingStartIndex" : 0,
      "metaId" : "",
      "physicalName" : "EMAL_ps",
      "referencedtoName" : "",
      "referenceId" : ""
    }, {
      "eClass" : "http://www.tmax.co.kr/proobject/message#//MessageFieldType",
      "id" : "do_message_field",
      "type" : "dataobject-message-field",
      "array" : "0",
      "comments" : "",
      "decimal" : -1,
      "delegate" : false,
      "fieldType" : "int",
      "includeMessageName" : "MsgJson",
      "includeMessagePath" : "com.tmax.openframe.dto",
      "length" : "5",
      "logicalName" : "ADDR_length",
      "maskingEndIndex" : 0,
      "maskingStartIndex" : 0,
      "metaId" : "",
      "physicalName" : "ADDR_length",
      "referencedtoName" : "",
      "referenceId" : ""
    }, {
      "eClass" : "http://www.tmax.co.kr/proobject/message#//MessageFieldType",
      "id" : "do_message_field",
      "type" : "dataobject-message-field",
      "array" : "0",
      "comments" : "",
      "decimal" : -1,
      "delegate" : false,
      "fieldType" : "string",
      "includeMessageName" : "MsgJson",
      "includeMessagePath" : "com.tmax.openframe.dto",
      "length" : "10",
      "logicalName" : "ADDR_color",
      "maskingEndIndex" : 0,
      "maskingStartIndex" : 0,
      "metaId" : "",
      "physicalName" : "ADDR_color",
      "referencedtoName" : "",
      "referenceId" : ""
    }, {
      "eClass" : "http://www.tmax.co.kr/proobject/message#//MessageFieldType",
      "id" : "do_message_field",
      "type" : "dataobject-message-field",
      "array" : "0",
      "comments" : "",
      "decimal" : -1,
      "delegate" : false,
      "fieldType" : "string",
      "includeMessageName" : "MsgJson",
      "includeMessagePath" : "com.tmax.openframe.dto",
      "length" : "10",
      "logicalName" : "ADDR_hilight",
      "maskingEndIndex" : 0,
      "maskingStartIndex" : 0,
      "metaId" : "",
      "physicalName" : "ADDR_hilight",
      "referencedtoName" : "",
      "referenceId" : ""
    }, {
      "eClass" : "http://www.tmax.co.kr/proobject/message#//MessageFieldType",
      "id" : "do_message_field",
      "type" : "dataobject-message-field",
      "array" : "0",
      "comments" : "",
      "decimal" : -1,
      "delegate" : false,
      "fieldType" : "string",
      "includeMessageName" : "MsgJson",
      "includeMessagePath" : "com.tmax.openframe.dto",
      "length" : "10",
      "logicalName" : "ADDR_outline",
      "maskingEndIndex" : 0,
      "maskingStartIndex" : 0,
      "metaId" : "",
      "physicalName" : "ADDR_outline",
      "referencedtoName" : "",
      "referenceId" : ""
    }, {
      "eClass" : "http://www.tmax.co.kr/proobject/message#//MessageFieldType",
      "id" : "do_message_field",
      "type" : "dataobject-message-field",
      "array" : "0",
      "comments" : "",
      "decimal" : -1,
      "delegate" : false,
      "fieldType" : "string",
      "includeMessageName" : "MsgJson",
      "includeMessagePath" : "com.tmax.openframe.dto",
      "length" : "10",
      "logicalName" : "ADDR_transp",
      "maskingEndIndex" : 0,
      "maskingStartIndex" : 0,
      "metaId" : "",
      "physicalName" : "ADDR_transp",
      "referencedtoName" : "",
      "referenceId" : ""
    }, {
      "eClass" : "http://www.tmax.co.kr/proobject/message#//MessageFieldType",
      "id" : "do_message_field",
      "type" : "dataobject-message-field",
      "array" : "0",
      "comments" : "",
      "decimal" : -1,
      "delegate" : false,
      "fieldType" : "string",
      "includeMessageName" : "MsgJson",
      "includeMessagePath" : "com.tmax.openframe.dto",
      "length" : "10",
      "logicalName" : "ADDR_validn",
      "maskingEndIndex" : 0,
      "maskingStartIndex" : 0,
      "metaId" : "",
      "physicalName" : "ADDR_validn",
      "referencedtoName" : "",
      "referenceId" : ""
    }, {
      "eClass" : "http://www.tmax.co.kr/proobject/message#//MessageFieldType",
      "id" : "do_message_field",
      "type" : "dataobject-message-field",
      "array" : "0",
      "comments" : "",
      "decimal" : -1,
      "delegate" : false,
      "fieldType" : "string",
      "includeMessageName" : "MsgJson",
      "includeMessagePath" : "com.tmax.openframe.dto",
      "length" : "10",
      "logicalName" : "ADDR_sosi",
      "maskingEndIndex" : 0,
      "maskingStartIndex" : 0,
      "metaId" : "",
      "physicalName" : "ADDR_sosi",
      "referencedtoName" : "",
      "referenceId" : ""
    }, {
      "eClass" : "http://www.tmax.co.kr/proobject/message#//MessageFieldType",
      "id" : "do_message_field",
      "type" : "dataobject-message-field",
      "array" : "0",
      "comments" : "",
      "decimal" : -1,
      "delegate" : false,
      "fieldType" : "string",
      "includeMessageName" : "MsgJson",
      "includeMessagePath" : "com.tmax.openframe.dto",
      "length" : "10",
      "logicalName" : "ADDR_ps",
      "maskingEndIndex" : 0,
      "maskingStartIndex" : 0,
      "metaId" : "",
      "physicalName" : "ADDR_ps",
      "referencedtoName" : "",
      "referenceId" : ""
    }, {
      "eClass" : "http://www.tmax.co.kr/proobject/message#//MessageFieldType",
      "id" : "do_message_field",
      "type" : "dataobject-message-field",
      "array" : "0",
      "comments" : "",
      "decimal" : -1,
      "delegate" : false,
      "fieldType" : "int",
      "includeMessageName" : "MsgJson",
      "includeMessagePath" : "com.tmax.openframe.dto",
      "length" : "5",
      "logicalName" : "MSG_length",
      "maskingEndIndex" : 0,
      "maskingStartIndex" : 0,
      "metaId" : "",
      "physicalName" : "MSG_length",
      "referencedtoName" : "",
      "referenceId" : ""
    }, {
      "eClass" : "http://www.tmax.co.kr/proobject/message#//MessageFieldType",
      "id" : "do_message_field",
      "type" : "dataobject-message-field",
      "array" : "0",
      "comments" : "",
      "decimal" : -1,
      "delegate" : false,
      "fieldType" : "string",
      "includeMessageName" : "MsgJson",
      "includeMessagePath" : "com.tmax.openframe.dto",
      "length" : "10",
      "logicalName" : "MSG_color",
      "maskingEndIndex" : 0,
      "maskingStartIndex" : 0,
      "metaId" : "",
      "physicalName" : "MSG_color",
      "referencedtoName" : "",
      "referenceId" : ""
    }, {
      "eClass" : "http://www.tmax.co.kr/proobject/message#//MessageFieldType",
      "id" : "do_message_field",
      "type" : "dataobject-message-field",
      "array" : "0",
      "comments" : "",
      "decimal" : -1,
      "delegate" : false,
      "fieldType" : "string",
      "includeMessageName" : "MsgJson",
      "includeMessagePath" : "com.tmax.openframe.dto",
      "length" : "10",
      "logicalName" : "MSG_hilight",
      "maskingEndIndex" : 0,
      "maskingStartIndex" : 0,
      "metaId" : "",
      "physicalName" : "MSG_hilight",
      "referencedtoName" : "",
      "referenceId" : ""
    }, {
      "eClass" : "http://www.tmax.co.kr/proobject/message#//MessageFieldType",
      "id" : "do_message_field",
      "type" : "dataobject-message-field",
      "array" : "0",
      "comments" : "",
      "decimal" : -1,
      "delegate" : false,
      "fieldType" : "string",
      "includeMessageName" : "MsgJson",
      "includeMessagePath" : "com.tmax.openframe.dto",
      "length" : "10",
      "logicalName" : "MSG_outline",
      "maskingEndIndex" : 0,
      "maskingStartIndex" : 0,
      "metaId" : "",
      "physicalName" : "MSG_outline",
      "referencedtoName" : "",
      "referenceId" : ""
    }, {
      "eClass" : "http://www.tmax.co.kr/proobject/message#//MessageFieldType",
      "id" : "do_message_field",
      "type" : "dataobject-message-field",
      "array" : "0",
      "comments" : "",
      "decimal" : -1,
      "delegate" : false,
      "fieldType" : "string",
      "includeMessageName" : "MsgJson",
      "includeMessagePath" : "com.tmax.openframe.dto",
      "length" : "10",
      "logicalName" : "MSG_transp",
      "maskingEndIndex" : 0,
      "maskingStartIndex" : 0,
      "metaId" : "",
      "physicalName" : "MSG_transp",
      "referencedtoName" : "",
      "referenceId" : ""
    }, {
      "eClass" : "http://www.tmax.co.kr/proobject/message#//MessageFieldType",
      "id" : "do_message_field",
      "type" : "dataobject-message-field",
      "array" : "0",
      "comments" : "",
      "decimal" : -1,
      "delegate" : false,
      "fieldType" : "string",
      "includeMessageName" : "MsgJson",
      "includeMessagePath" : "com.tmax.openframe.dto",
      "length" : "10",
      "logicalName" : "MSG_validn",
      "maskingEndIndex" : 0,
      "maskingStartIndex" : 0,
      "metaId" : "",
      "physicalName" : "MSG_validn",
      "referencedtoName" : "",
      "referenceId" : ""
    }, {
      "eClass" : "http://www.tmax.co.kr/proobject/message#//MessageFieldType",
      "id" : "do_message_field",
      "type" : "dataobject-message-field",
      "array" : "0",
      "comments" : "",
      "decimal" : -1,
      "delegate" : false,
      "fieldType" : "string",
      "includeMessageName" : "MsgJson",
      "includeMessagePath" : "com.tmax.openframe.dto",
      "length" : "10",
      "logicalName" : "MSG_sosi",
      "maskingEndIndex" : 0,
      "maskingStartIndex" : 0,
      "metaId" : "",
      "physicalName" : "MSG_sosi",
      "referencedtoName" : "",
      "referenceId" : ""
    }, {
      "eClass" : "http://www.tmax.co.kr/proobject/message#//MessageFieldType",
      "id" : "do_message_field",
      "type" : "dataobject-message-field",
      "array" : "0",
      "comments" : "",
      "decimal" : -1,
      "delegate" : false,
      "fieldType" : "string",
      "includeMessageName" : "MsgJson",
      "includeMessagePath" : "com.tmax.openframe.dto",
      "length" : "10",
      "logicalName" : "MSG_ps",
      "maskingEndIndex" : 0,
      "maskingStartIndex" : 0,
      "metaId" : "",
      "physicalName" : "MSG_ps",
      "referencedtoName" : "",
      "referenceId" : ""
    } ]
  } ]
}