com/mall/gorvenment/expections/GlobalExpectionHandler.class
com/mall/gorvenment/dto/request/DonationRequestDto.class
com/mall/gorvenment/repository/DonationRepostiory.class
com/mall/gorvenment/entity/DonationUser.class
com/mall/gorvenment/controller/PaymentController.class
com/mall/gorvenment/entity/Payment.class
com/mall/gorvenment/security/UserDetail.class
com/mall/gorvenment/service/impl/DonationUserServiceImpl$1.class
com/mall/gorvenment/service/impl/DonationServiceImpl.class
com/mall/gorvenment/entity/User$UserBuilder.class
com/mall/gorvenment/dto/request/UserLoginRequestDto$UserLoginRequestDtoBuilder.class
com/mall/gorvenment/repository/DonationUserRepository.class
com/mall/gorvenment/dto/response/UserResigterResponseDto$UserResigterResponseDtoBuilder.class
com/mall/gorvenment/entity/Role.class
com/mall/gorvenment/dto/response/ExpectionResponseDTO.class
com/mall/gorvenment/security/UserDetailService.class
com/mall/gorvenment/entity/Payment$PaymentBuilder.class
com/mall/gorvenment/expections/NotFoundExpection.class
com/mall/gorvenment/dto/request/UserResigterRequestDto$UserResigterRequestDtoBuilder.class
com/mall/gorvenment/service/DonationUserService.class
com/mall/gorvenment/EliteApplication.class
com/mall/gorvenment/service/impl/DonationUserServiceImpl.class
com/mall/gorvenment/service/PaymentService.class
com/mall/gorvenment/dto/response/DonationUserResponseDto.class
com/mall/gorvenment/controller/UserController.class
com/mall/gorvenment/security/SecurityConfig.class
com/mall/gorvenment/security/jwt/JwtTokenProvider.class
com/mall/gorvenment/controller/RoleToUserForm.class
com/mall/gorvenment/expections/BadRequestExpection.class
com/mall/gorvenment/entity/User.class
com/mall/gorvenment/dto/response/UserLoginResponseDto.class
com/mall/gorvenment/dto/response/UserResigterResponseDto.class
com/mall/gorvenment/service/DonationService.class
com/mall/gorvenment/repository/RoleRepository.class
com/mall/gorvenment/controller/DonationController.class
com/mall/gorvenment/dto/response/PaymentResponseDto.class
com/mall/gorvenment/repository/UserRepository.class
com/mall/gorvenment/dto/request/PaymentRequestDto.class
com/mall/gorvenment/repository/PaymentRepository.class
com/mall/gorvenment/entity/Donation$DonationBuilder.class
com/mall/gorvenment/service/UserService.class
com/mall/gorvenment/service/impl/UserServiceImp.class
com/mall/gorvenment/dto/request/UserResigterRequestDto.class
com/mall/gorvenment/security/jwt/JwtAuthenticationFilter.class
com/mall/gorvenment/config/GlobalConfig.class
com/mall/gorvenment/dto/request/UserLoginRequestDto.class
com/mall/gorvenment/entity/DonationUser$DonationUserBuilder.class
com/mall/gorvenment/dto/request/DonationUserRequestDto.class
com/mall/gorvenment/controller/DonationUserController.class
com/mall/gorvenment/service/impl/PaymentServiceImpl.class
com/mall/gorvenment/dto/response/CustomDonationUserResponseDto.class
com/mall/gorvenment/entity/Donation.class
com/mall/gorvenment/dto/response/DonationResponseDto.class
