<svg width="1920" height="4871" viewBox="0 0 1920 4871" fill="none" xmlns="http://www.w3.org/2000/svg">
<path d="M414.915 4427.11L413.605 4425.8L409.675 4427.11L407.054 4429.73L404.434 4432.35L403.124 4433.66L405.744 4434.97H408.365H409.675L413.605 4436.28L417.535 4434.97L420.155 4431.04L417.535 4428.42L414.915 4427.11ZM327.139 4465.08H324.519V4469.01L323.209 4475.56L327.139 4479.49V4476.87V4474.25L325.829 4469.01L327.139 4465.08ZM38.9189 4590.79L41.5391 4593.41V4598.64L48.0896 4597.33L50.7097 4594.71L54.64 4590.79L50.7097 4589.48L38.9189 4590.79ZM479.109 4860.52H477.799L473.869 4865.76L471.249 4868.38L473.869 4871L477.799 4869.69V4867.07L480.419 4865.76L479.109 4860.52ZM1404.03 699.224H1401.41H1400.1H1398.79L1394.86 700.534L1393.55 703.152L1394.86 704.462H1396.17L1400.1 701.843H1402.72H1406.65H1407.96L1404.03 699.224ZM1328.05 704.462L1325.43 703.152H1322.81L1321.5 704.462L1320.19 707.081L1322.81 711.009L1325.43 709.699L1328.05 708.39L1330.67 707.081L1331.98 704.462H1328.05ZM1334.6 752.91L1331.98 755.529V756.838L1333.29 758.148H1334.6L1339.84 754.219V751.601H1337.22H1335.91L1334.6 752.91ZM1135.46 814.452L1134.15 818.38L1139.4 820.999L1142.02 818.38L1135.46 814.452ZM1152.5 826.237L1153.81 824.927L1155.12 823.618V820.999H1153.81L1149.88 822.309L1151.19 824.927H1152.5V826.237ZM1258.61 838.021L1257.3 834.093L1255.99 830.165L1254.68 827.546L1253.37 828.856L1252.06 830.165L1253.37 834.093L1258.61 838.021ZM1253.37 838.021L1255.99 840.64L1258.61 843.259L1255.99 836.712L1252.06 832.784L1249.44 830.165H1248.13L1250.75 834.093L1253.37 838.021ZM1077.82 848.497L1081.75 849.806L1080.44 847.187L1077.82 841.95L1075.2 840.64H1073.89L1071.27 838.021L1069.96 839.331L1068.65 840.64V841.95H1069.96V843.259L1071.27 844.569H1072.58L1073.89 845.878H1075.2H1076.51V847.187L1077.82 848.497ZM1124.98 849.806V847.187V843.259L1122.36 840.64V843.259V844.569H1121.05V845.878V847.187L1119.74 848.497V849.806H1117.12V851.116L1122.36 853.734L1121.05 852.425L1124.98 849.806ZM1242.89 852.425L1241.58 853.734L1242.89 852.425H1245.51V851.116H1248.13L1249.44 849.806L1248.13 848.497H1246.82V847.187V845.878H1245.51L1244.2 847.187L1245.51 848.497L1242.89 849.806H1240.27V851.116L1242.89 852.425V851.116V852.425ZM1307.09 875.994L1304.47 878.613L1305.78 881.232L1308.4 878.613L1309.71 873.375L1308.4 874.685L1307.09 875.994ZM1304.47 889.088V887.779L1303.16 886.47L1301.85 887.779L1300.54 889.088V890.398L1296.61 894.326L1300.54 891.707L1304.47 889.088ZM1376.52 699.224H1375.21L1369.97 701.843L1364.73 708.39L1377.83 700.534L1376.52 699.224ZM1326.74 712.318L1328.05 713.628H1330.67L1331.98 714.937L1333.29 713.628H1337.22L1338.53 712.318L1339.84 711.009L1338.53 708.39L1334.6 707.081H1329.36L1325.43 709.699L1326.74 712.318ZM1356.87 713.628V711.009L1346.39 716.247L1345.08 717.556L1349.01 718.865H1350.32L1356.87 713.628ZM1460.37 716.247L1456.44 717.556V720.175L1459.06 721.484H1462.99H1465.61L1466.92 718.865V716.247L1465.61 714.937L1460.37 716.247ZM1366.04 731.959L1362.11 748.982V751.601L1363.42 750.291L1368.66 729.341V728.031L1367.35 729.341L1366.04 731.959ZM1331.98 772.551L1334.6 771.242L1337.22 764.695V762.076V759.457H1335.91L1333.29 760.766H1331.98L1330.67 759.457H1329.36H1328.05L1325.43 764.695L1324.12 766.004L1322.81 767.313V768.623L1321.5 769.932V771.242V772.551L1324.12 773.86V775.17L1322.81 776.479V775.17H1321.5L1318.88 779.098L1316.26 781.717L1313.64 783.026L1311.02 785.645H1312.33H1314.95L1316.26 784.336H1317.57L1322.81 781.717V780.407L1328.05 776.479L1331.98 775.17V772.551ZM1064.72 807.905L1062.1 806.596L1060.79 805.286L1058.17 803.977L1056.86 805.286V807.905L1059.48 811.833L1062.1 813.143L1066.03 814.452H1069.96L1073.89 815.762L1080.44 817.071L1081.75 815.762V813.143V811.833V810.524H1080.44V809.214H1081.75V806.596L1079.13 802.667L1076.51 800.049H1075.2L1073.89 801.358L1072.58 802.667V805.286L1073.89 807.905L1071.27 809.214L1064.72 807.905ZM1168.22 815.762L1173.46 814.452L1176.08 813.143V811.833L1174.77 810.524L1172.15 806.596H1169.53H1168.22H1166.91L1162.98 813.143L1164.29 814.452L1166.91 815.762H1168.22ZM1290.06 823.618L1291.37 822.309L1295.3 818.38L1297.92 811.833L1295.3 810.524L1292.68 813.143L1290.06 815.762L1287.44 817.071L1286.13 818.38L1284.82 822.309L1282.2 824.927L1279.57 826.237L1269.09 828.856L1262.54 830.165L1263.85 831.474H1273.02L1284.82 826.237L1290.06 823.618ZM1265.16 823.618H1266.47L1270.4 822.309L1276.95 815.762L1278.26 813.143V811.833H1276.95L1275.64 813.143V814.452V813.143H1274.33L1270.4 817.071H1267.78H1266.47L1265.16 818.38L1262.54 815.762H1261.23L1258.61 817.071H1255.99L1257.3 818.38L1259.92 819.69L1265.16 823.618ZM1216.69 838.021H1215.38V839.331L1219.31 841.95H1220.62L1221.93 843.259V844.569H1223.24V841.95V840.64L1220.62 838.021H1216.69ZM1191.8 855.044L1190.49 853.734L1189.18 852.425L1187.87 851.116V849.806V848.497V847.187H1186.56L1185.25 848.497L1183.94 849.806V851.116H1182.63V852.425V853.734L1183.94 855.044H1185.25L1186.56 853.734L1189.18 857.663L1191.8 855.044ZM1081.75 857.663L1085.68 861.591L1088.3 862.9H1090.92L1094.85 861.591L1097.47 858.972L1096.16 857.663H1094.85H1092.23L1088.3 855.044L1081.75 847.187L1080.44 848.497V852.425L1081.75 857.663ZM1283.51 864.21L1282.2 866.828V869.447V873.375V874.685L1283.51 875.994L1284.82 877.304L1286.13 875.994L1287.44 874.685V872.066L1286.13 868.138L1283.51 865.519V864.21ZM1193.11 870.757L1195.73 875.994H1197.04L1198.35 874.685V873.375L1199.66 872.066H1200.97V869.447L1199.66 868.138H1198.35V864.21L1197.04 862.9V864.21L1195.73 862.9L1193.11 864.21H1191.8V865.519V866.828V868.138V869.447L1193.11 870.757ZM1202.28 877.304H1199.66L1198.35 879.923L1197.04 881.232V882.541L1198.35 883.851L1199.66 885.16H1200.97L1202.28 883.851V882.541V881.232V878.613V877.304ZM1384.38 1089.43L1387 1090.74H1388.31L1389.62 1089.43L1390.93 1086.81V1084.19H1389.62L1387 1085.5L1384.38 1089.43ZM819.733 1336.91L817.113 1338.22L815.803 1339.53V1342.14L817.113 1343.45L818.423 1344.76H819.733L821.043 1343.45V1342.14V1340.83L819.733 1336.91ZM1626.75 2460.38H1629.37L1630.68 2461.69V2463V2464.31L1635.92 2468.24L1637.23 2470.85H1638.54V2469.54V2463L1637.23 2460.38L1628.06 2452.52H1625.44L1621.51 2455.14V2456.45L1622.82 2457.76L1626.75 2460.38ZM1821.95 2650.24H1825.88L1828.5 2648.93L1829.81 2647.62L1828.5 2645.01L1824.57 2643.7H1820.64H1816.71L1814.09 2645.01V2646.31L1816.71 2647.62L1821.95 2650.24ZM1895.32 3218.53H1897.94L1899.25 3219.84V3218.53L1897.94 3215.91L1896.63 3214.6L1894.01 3210.67H1892.7L1894.01 3214.6L1895.32 3218.53ZM911.439 4493.89L907.509 4489.96L904.889 4486.03L889.168 4471.63L873.447 4449.37L870.827 4448.06L869.516 4446.75L868.206 4445.44L866.896 4448.06L873.447 4457.23L876.067 4462.46L877.377 4469.01L878.687 4474.25L882.617 4479.49L890.478 4488.65L900.959 4505.67L903.579 4508.29L910.129 4506.98L908.819 4504.37L903.579 4500.44L898.339 4495.2L900.959 4492.58L906.199 4495.2L912.749 4500.44L917.99 4506.98L916.68 4513.53V4516.15H924.54L928.471 4513.53L931.091 4508.29V4500.44L927.16 4497.82L911.439 4493.89ZM1076.51 4287L1069.96 4285.69L1063.41 4283.08H1026.73L1018.87 4281.77L1008.39 4277.84H1003.15L1017.56 4284.38L1058.17 4292.24L1064.72 4294.86L1067.34 4298.79L1069.96 4300.1L1073.89 4298.79L1077.82 4296.17L1080.44 4293.55L1079.13 4289.62L1076.51 4287ZM1113.19 4186.18L1110.57 4188.8L1109.26 4191.42H1110.57L1113.19 4196.65V4197.96L1115.81 4200.58L1119.74 4203.2L1123.67 4204.51L1124.98 4200.58L1123.67 4196.65L1121.05 4191.42L1119.74 4187.49H1122.36L1124.98 4194.04L1126.29 4196.65L1127.6 4197.96L1130.22 4196.65V4194.04L1128.91 4190.11L1127.6 4186.18V4184.87L1128.91 4183.56L1130.22 4182.25V4179.63H1128.91H1127.6L1126.29 4178.32L1124.98 4175.7L1117.12 4170.47V4167.85H1114.5H1110.57L1106.64 4169.16V4171.78L1110.57 4174.39L1111.88 4177.01L1110.57 4183.56L1113.19 4186.18ZM1143.33 4235.94L1136.77 4232.01L1134.15 4235.94H1131.53L1138.09 4220.22L1139.4 4211.06L1132.84 4207.13L1126.29 4209.75L1121.05 4212.37L1118.43 4217.6L1121.05 4225.46V4221.53H1123.67L1122.36 4226.77L1117.12 4233.32L1115.81 4238.56L1117.12 4242.48L1118.43 4246.41L1119.74 4250.34V4255.58H1122.36L1126.29 4251.65L1132.84 4249.03L1148.57 4245.1L1145.95 4241.17L1143.33 4235.94ZM1218 4233.32L1219.31 4234.63H1220.62L1221.93 4235.94L1219.31 4232.01L1210.14 4224.15L1207.52 4226.77L1206.21 4229.39L1204.9 4233.32V4237.25L1202.28 4238.56L1193.11 4242.48L1180.01 4245.1L1178.7 4251.65L1182.63 4267.36L1186.56 4263.43L1193.11 4254.27L1197.04 4250.34L1203.59 4247.72L1206.21 4246.41L1208.83 4239.86L1211.45 4238.56L1214.07 4237.25L1215.38 4233.32H1218ZM1051.62 4762.32L1049 4761.01L1039.83 4764.94L1029.35 4771.48L1021.49 4779.34L1017.56 4787.2L1018.87 4788.51L1024.11 4795.05L1025.42 4796.36H1030.66L1031.97 4795.05V4793.74V4792.44V4789.82V4785.89V4783.27L1034.59 4781.96H1038.52L1041.14 4780.65H1043.76L1047.69 4781.96L1046.38 4778.03L1043.76 4774.1V4770.18L1051.62 4768.87V4767.56V4766.25L1050.31 4764.94H1052.93H1054.24L1051.62 4762.32ZM993.975 4400.92L980.874 4391.76L975.634 4390.45L974.324 4389.14V4391.76L988.735 4404.85L997.905 4410.09L1005.77 4421.87L1009.7 4424.49L1012.32 4421.87L1008.39 4415.33L997.905 4404.85L993.975 4400.92ZM1098.78 839.331L1100.09 847.187L1106.64 860.281L1107.95 865.519L1110.57 866.828L1115.81 868.138L1119.74 865.519L1118.43 857.663L1106.64 843.259L1105.33 838.021L1104.02 830.165L1100.09 826.237L1088.3 820.999L1084.37 830.165L1081.75 839.331L1083.06 845.878L1086.99 848.497L1092.23 849.806L1096.16 852.425H1098.78L1097.47 849.806V847.187V844.569L1098.78 839.331ZM1328.05 826.237L1330.67 820.999L1331.98 813.143V810.524V809.214L1330.67 807.905L1329.36 813.143L1321.5 828.856L1318.88 834.093L1314.95 836.712L1311.02 838.021H1304.47V840.64L1308.4 844.569V849.806L1303.16 861.591H1307.09L1309.71 858.972L1311.02 851.116L1312.33 847.187L1328.05 826.237ZM1401.41 802.667L1405.34 803.977V801.358L1394.86 793.502L1390.93 792.192L1388.31 797.43L1389.62 800.049L1392.24 801.358L1393.55 803.977V807.905L1387 819.69L1392.24 817.071L1397.48 813.143L1400.1 807.905L1398.79 801.358L1401.41 802.667ZM1341.15 796.12L1343.77 785.645L1355.56 760.766V758.148H1354.25L1351.63 759.457L1343.77 767.313L1342.46 768.623L1341.15 771.242L1339.84 773.86V781.717L1338.53 785.645L1334.6 789.573L1333.29 793.502V797.43L1334.6 800.049V802.667L1330.67 803.977L1337.22 805.286L1341.15 796.12ZM1413.2 682.202V680.892L1411.89 679.583V678.274L1407.96 676.964L1402.72 679.583L1384.38 690.058L1380.45 693.987L1379.14 695.296L1409.27 682.202H1413.2ZM1469.54 663.87L1428.93 667.798L1426.31 669.108L1415.82 671.727V674.345L1423.68 673.036H1430.24L1427.61 674.345L1426.31 676.964L1424.99 679.583V678.274L1423.68 674.345L1422.37 678.274L1421.06 682.202H1424.99L1445.96 674.345L1448.58 673.036H1451.2L1453.82 675.655L1459.06 674.345L1470.85 666.489V663.87H1469.54ZM1892.7 3666.34L1891.39 3665.03L1888.77 3663.73L1876.98 3661.11L1871.74 3658.49V3662.42V3663.73L1869.12 3662.42L1865.19 3661.11L1862.57 3659.8V3662.42L1865.19 3665.03L1869.12 3668.96L1874.36 3671.58H1880.91V3670.27L1879.6 3668.96L1882.22 3667.65H1884.84L1887.46 3668.96L1888.77 3671.58L1890.08 3670.27L1894.01 3667.65L1895.32 3666.34L1894.01 3663.73L1892.7 3666.34ZM1766.93 4195.35L1763 4197.96L1761.69 4203.2L1763 4208.44L1765.62 4211.06H1772.17L1773.48 4205.82L1770.86 4199.27L1766.93 4195.35ZM1415.82 802.667L1421.06 794.811L1423.68 792.192L1424.99 788.264L1421.06 786.955L1415.82 790.883L1413.2 797.43V802.667H1415.82ZM1278.26 843.259V841.95L1279.57 840.64L1280.88 839.331L1279.57 836.712L1276.95 835.403H1271.71H1267.78H1266.47L1265.16 834.093L1262.54 832.784L1261.23 834.093V835.403L1262.54 838.021H1263.85L1265.16 836.712L1269.09 840.64L1271.71 841.95H1274.33H1276.95L1278.26 843.259ZM1267.78 855.044L1263.85 851.116H1262.54V856.353L1265.16 861.591L1269.09 862.9H1271.71L1274.33 864.21L1275.64 866.828H1276.95V862.9L1275.64 860.281L1271.71 857.663L1267.78 855.044ZM1104.02 4222.84H1102.71L1101.4 4221.53L1105.33 4220.22L1109.26 4221.53L1113.19 4222.84L1118.43 4224.15V4221.53L1115.81 4214.99L1113.19 4212.37H1107.95V4209.75H1115.81L1118.43 4205.82L1117.12 4201.89L1114.5 4199.27L1113.19 4197.96L1109.26 4192.73L1107.95 4191.42V4187.49L1109.26 4184.87L1111.88 4182.25V4178.32L1110.57 4173.09L1106.64 4169.16L1097.47 4166.54L1096.16 4165.23L1093.54 4159.99L1090.92 4157.37L1088.3 4156.06H1080.44L1088.3 4169.16L1090.92 4177.01L1088.3 4184.87L1085.68 4186.18L1080.44 4187.49L1079.13 4188.8L1080.44 4194.04L1081.75 4196.65L1080.44 4205.82V4209.75L1081.75 4214.99L1085.68 4222.84L1092.23 4232.01L1100.09 4238.56L1107.95 4241.17L1114.5 4238.56V4232.01L1110.57 4225.46L1104.02 4222.84ZM1183.94 864.21L1190.49 865.519L1187.87 864.21L1186.56 862.9L1185.25 861.591L1183.94 858.972H1181.32H1178.7L1173.46 857.663L1169.53 855.044L1170.84 851.116V848.497L1168.22 845.878L1164.29 844.569L1161.67 845.878V851.116H1159.05L1155.12 848.497L1145.95 847.187L1142.02 843.259L1144.64 840.64L1142.02 843.259V845.878V848.497L1140.71 851.116L1138.09 852.425L1130.22 855.044L1128.91 861.591L1132.84 866.828L1142.02 872.066L1145.95 875.994L1153.81 886.47L1160.36 890.398V887.779L1159.05 886.47L1157.74 882.541H1160.36L1161.67 883.851L1164.29 885.16L1165.6 886.47H1168.22V883.851H1169.53L1170.84 885.16L1172.15 886.47V889.088H1165.6V890.398L1166.91 891.707L1168.22 893.017L1169.53 890.398V893.017L1170.84 891.707H1172.15L1174.77 890.398V898.254L1177.39 893.017L1178.7 887.779H1181.32V890.398H1183.94L1182.63 885.16L1173.46 879.923L1172.15 873.375L1174.77 875.994L1177.39 877.304H1180.01L1183.94 875.994V873.375L1181.32 872.066L1180.01 869.447V866.828L1181.32 864.21L1183.94 870.757L1186.56 873.375L1190.49 874.685L1189.18 872.066L1187.87 870.757L1186.56 869.447V866.828L1183.94 864.21ZM1307.09 827.546L1312.33 826.237L1316.26 823.618L1318.88 819.69L1321.5 814.452L1324.12 802.667L1329.36 790.883L1330.67 786.955L1329.36 785.645L1328.05 786.955L1324.12 792.192V785.645L1321.5 792.192L1320.19 794.811L1316.26 793.502L1314.95 792.192L1311.02 801.358L1309.71 806.596L1311.02 810.524L1305.78 817.071L1297.92 822.309L1288.75 827.546L1279.57 831.474V834.093L1284.82 832.784L1299.23 828.856L1307.09 827.546ZM1292.68 731.959V734.578H1291.37L1288.75 731.959H1286.13L1284.82 742.435L1282.2 751.601V755.529L1279.57 762.076L1275.64 769.932L1273.02 777.789L1278.26 781.717L1288.75 772.551L1292.68 769.932L1300.54 767.313L1304.47 766.004L1314.95 751.601L1321.5 745.053L1326.74 746.363H1329.36L1331.98 741.125L1342.46 734.578L1346.39 730.65L1347.7 726.722H1346.39L1339.84 729.341L1329.36 731.959L1326.74 733.269H1324.12L1322.81 731.959V730.65V728.031V725.412V722.794L1321.5 721.484H1318.88L1316.26 720.175L1308.4 711.009L1305.78 708.39L1304.47 707.081H1303.16H1301.85H1300.54H1297.92L1296.61 709.699L1295.3 713.628V722.794V728.031L1296.61 730.65H1293.99L1292.68 731.959ZM1908.42 3541.95L1907.11 3538.02L1904.49 3535.4L1900.56 3534.09L1894.01 3532.78L1886.15 3534.09L1883.53 3538.02L1887.46 3540.64L1891.39 3541.95L1892.7 3544.57L1894.01 3547.19L1905.8 3555.04L1911.04 3556.35L1912.35 3552.43L1911.04 3548.5L1908.42 3541.95ZM215.781 4229.39L218.401 4232.01L214.471 4228.08H210.541L207.921 4230.7L205.3 4233.32L203.99 4235.94V4239.86L202.68 4242.48L200.06 4243.79L198.75 4245.1L194.82 4250.34L193.51 4251.65L190.889 4254.27H184.339L164.688 4251.65L163.378 4252.96L164.688 4256.89L167.308 4269.98L171.238 4273.91L183.029 4280.46L192.2 4288.31L198.75 4298.79L206.611 4322.36L210.541 4348.55L214.471 4362.95L221.022 4365.57L222.332 4366.88L227.572 4369.5L226.262 4364.26L224.952 4360.33V4356.4L227.572 4349.86L222.332 4342L226.262 4324.98L238.053 4293.55V4259.51L236.743 4254.27L215.781 4229.39ZM1932 3523.62L1926.76 3519.69H1921.52L1916.28 3514.45L1901.87 3486.95V3483.03V3479.1V3475.17L1900.56 3469.93L1903.18 3467.31H1905.8H1908.42L1911.04 3466L1912.35 3464.7L1914.97 3459.46L1916.28 3458.15L1922.83 3454.22H1926.76V3455.53L1925.45 3456.84L1924.14 3458.15L1922.83 3459.46L1920.21 3460.77L1918.9 3462.08L1920.21 3464.7H1921.52L1926.76 3463.39L1928.07 3462.08L1929.38 3459.46L1930.69 3454.22V3447.67V3442.44L1928.07 3438.51L1914.97 3422.79L1908.42 3412.32L1900.56 3403.15L1894.01 3391.37L1891.39 3388.75L1887.46 3386.13L1888.77 3383.51L1887.46 3379.58L1884.84 3375.66L1882.22 3371.73L1880.91 3366.49L1882.22 3361.25L1883.53 3356.01L1884.84 3350.78L1882.22 3344.23V3341.61L1886.15 3333.75L1887.46 3331.14V3324.59V3321.97L1886.15 3319.35L1884.84 3316.73H1883.53V3318.04L1884.84 3320.66V3323.28L1880.91 3324.59L1879.6 3328.52V3338.99L1875.67 3335.06L1873.05 3329.83L1869.12 3319.35L1871.74 3318.04H1873.05L1874.36 3315.42L1875.67 3316.73L1879.6 3318.04L1880.91 3319.35V3316.73V3314.11L1879.6 3312.8L1878.29 3311.49V3308.88H1882.22L1884.84 3307.57L1886.15 3304.95V3301.02L1883.53 3297.09H1880.91L1876.98 3301.02L1873.05 3298.4L1867.81 3290.54L1862.57 3287.93V3282.69L1863.88 3280.07L1866.5 3277.45L1862.57 3274.83V3272.21L1863.88 3269.59L1862.57 3266.97L1863.88 3261.74L1866.5 3259.12L1869.12 3257.81H1871.74L1882.22 3264.36L1883.53 3266.97V3270.9L1880.91 3273.52L1876.98 3274.83L1875.67 3277.45L1876.98 3280.07L1883.53 3281.38L1886.15 3285.31L1890.08 3282.69L1892.7 3280.07L1895.32 3273.52L1894.01 3269.59L1896.63 3265.66L1895.32 3263.05L1891.39 3264.36H1887.46L1884.84 3261.74L1883.53 3257.81V3255.19L1886.15 3251.26L1887.46 3248.64L1883.53 3249.95L1882.22 3251.26L1880.91 3252.57H1878.29L1871.74 3244.71L1869.12 3240.79H1870.43L1871.74 3239.48V3238.17L1869.12 3236.86L1865.19 3232.93L1863.88 3230.31L1862.57 3223.76L1861.26 3219.84L1858.64 3217.22L1856.01 3215.91L1854.7 3213.29V3208.05H1857.32L1859.95 3213.29L1869.12 3222.45L1871.74 3230.31L1878.29 3242.1L1880.91 3244.71V3240.79V3239.48L1879.6 3238.17V3235.55H1883.53L1884.84 3234.24V3231.62L1883.53 3229H1882.22L1878.29 3226.38L1874.36 3223.76V3222.45L1870.43 3219.84L1867.81 3214.6L1861.26 3208.05L1859.95 3201.5V3192.34V3189.72L1856.01 3181.86V3175.32L1858.64 3171.39L1862.57 3168.77L1866.5 3164.84L1862.57 3163.53L1859.95 3160.91L1857.32 3153.06L1853.39 3154.37V3151.75L1857.32 3145.2L1858.64 3133.41L1859.95 3130.8L1863.88 3126.87L1866.5 3132.11L1870.43 3147.82L1869.12 3166.15L1870.43 3170.08H1878.29L1880.91 3168.77L1879.6 3156.98L1882.22 3132.11L1880.91 3129.49L1873.05 3122.94L1870.43 3119.01L1866.5 3082.35L1857.32 3058.78L1854.7 3053.54L1845.53 3048.3L1841.6 3041.76V3036.52L1849.46 3037.83L1852.08 3041.76L1853.39 3045.68L1856.01 3048.3L1862.57 3049.61L1852.08 3032.59L1848.15 3022.11L1850.77 3016.88L1848.15 3003.78L1846.84 2999.86L1844.22 2995.93L1833.74 2985.45L1829.81 2976.29L1828.5 2971.05V2967.12V2950.1L1827.19 2946.17L1821.95 2938.31L1808.85 2906.89V2909.51L1806.23 2916.05L1804.92 2912.12L1806.23 2909.51L1808.85 2908.2L1810.16 2904.27H1812.78L1814.09 2902.96V2900.34L1812.78 2896.41L1811.47 2870.22L1812.78 2872.84L1815.4 2875.46L1818.02 2876.77L1815.4 2861.06L1814.09 2857.13L1802.3 2841.42L1799.68 2838.8L1793.13 2829.63L1791.82 2827.01L1785.27 2824.39L1783.96 2823.08L1790.51 2821.78L1770.86 2775.95L1764.31 2751.07L1756.45 2723.57L1755.14 2727.5V2730.12V2732.74H1753.83V2728.81L1752.52 2726.19L1749.9 2724.88L1747.28 2726.19H1743.35L1740.73 2722.26L1742.04 2719.64H1745.97L1751.21 2722.26L1752.52 2717.02L1753.83 2707.86L1755.14 2703.93L1759.07 2706.55V2703.93L1757.76 2702.62H1755.14H1752.52V2700H1757.76L1761.69 2698.69L1764.31 2696.07L1766.93 2692.14L1765.62 2690.83H1761.69L1759.07 2689.53L1755.14 2686.91L1747.28 2679.05L1745.97 2675.12V2663.34L1744.66 2660.72L1736.8 2654.17L1734.18 2652.86L1731.56 2650.24L1728.94 2637.15L1730.25 2631.91L1727.63 2633.22H1725.01H1722.39L1719.77 2631.91L1721.08 2634.53L1722.39 2635.84L1723.7 2637.15V2639.77L1717.15 2643.7L1714.53 2650.24L1717.15 2655.48L1725.01 2656.79V2659.41H1718.46H1715.83H1713.21L1710.59 2664.65V2665.96H1707.97V2664.65V2663.34L1709.28 2662.03L1706.66 2658.1V2654.17V2650.24V2646.31L1704.04 2643.7L1697.49 2639.77L1696.18 2638.46L1694.87 2635.84L1687.01 2629.29L1685.7 2626.67V2618.82L1684.39 2612.27H1681.77L1675.22 2626.67L1669.98 2629.29L1662.12 2624.05L1659.5 2617.51L1662.12 2613.58L1667.36 2610.96L1671.29 2609.65L1675.22 2613.58L1677.84 2610.96L1680.46 2601.79L1668.67 2603.1L1659.5 2597.87L1608.41 2527.16L1597.93 2507.52L1595.31 2487.88L1594 2483.95H1591.38L1588.76 2485.26L1586.14 2487.88L1584.83 2489.19L1582.21 2487.88L1583.52 2486.57L1586.14 2485.26H1590.07L1587.45 2480.02L1583.52 2477.4L1578.28 2474.78L1561.24 2461.69L1557.31 2456.45L1552.07 2448.59L1548.14 2436.81L1545.52 2423.72L1548.14 2411.93L1552.07 2413.24L1559.93 2411.93L1562.55 2414.55L1563.86 2410.62L1566.48 2408L1570.42 2405.38L1574.35 2402.76L1570.42 2398.84V2397.53L1569.1 2396.22L1566.48 2398.84L1565.17 2401.46V2402.76L1559.93 2401.46L1556 2398.84L1552.07 2396.22L1549.45 2393.6H1546.83L1545.52 2394.91V2393.6L1542.9 2392.29L1546.83 2396.22L1545.52 2398.84L1544.21 2401.46L1541.59 2402.76V2405.38L1548.14 2406.69V2411.93L1545.52 2418.48V2423.72L1548.14 2427.64L1550.76 2444.67L1548.14 2440.74L1542.9 2442.05L1537.66 2444.67L1532.42 2445.98L1536.35 2443.36L1540.28 2439.43L1542.9 2434.19L1544.21 2428.95V2427.64L1541.59 2415.86H1538.97L1536.35 2417.17L1531.11 2422.41L1525.87 2415.86L1519.32 2411.93L1514.08 2406.69V2397.53L1518.01 2389.67L1528.49 2380.5L1533.73 2373.96H1525.87L1516.7 2372.65L1508.84 2371.34L1503.6 2368.72H1500.98L1497.05 2370.03L1490.5 2368.72L1485.26 2366.1L1482.64 2362.17L1483.95 2356.94L1487.88 2358.24L1497.05 2364.79L1486.57 2347.77L1483.95 2342.53L1481.33 2330.75V2328.13L1477.4 2329.44L1476.09 2332.06L1474.78 2334.68L1472.16 2337.29L1465.61 2335.98L1451.2 2325.51L1445.96 2326.82V2329.44L1448.58 2339.91L1447.27 2342.53L1435.48 2351.7L1434.17 2350.39L1431.55 2351.7L1430.24 2347.77L1427.61 2345.15H1424.99L1422.37 2347.77H1419.75L1411.89 2343.84L1407.96 2341.22L1406.65 2338.6L1402.72 2320.27V2317.65H1405.34L1407.96 2318.96L1409.27 2320.27L1411.89 2321.58H1414.51L1415.82 2320.27L1417.13 2318.96L1410.58 2316.34L1404.03 2307.18L1398.79 2303.25L1392.24 2291.47L1389.62 2288.85L1377.83 2280.99L1376.52 2278.37L1375.21 2277.06L1372.59 2278.37L1371.28 2280.99L1369.97 2283.61L1368.66 2284.92H1366.04V2283.61L1364.73 2279.68L1362.11 2277.06H1360.8V2274.44L1362.11 2271.82L1363.42 2269.21L1364.73 2266.59L1356.87 2267.9H1352.94H1347.7L1349.01 2265.28V2263.97L1350.32 2262.66H1352.94L1354.25 2263.97L1358.18 2265.28V2262.66L1350.32 2260.04L1347.7 2257.42L1345.08 2253.49L1342.46 2254.8H1338.53L1334.6 2253.49L1331.98 2249.56L1328.05 2248.25L1320.19 2246.95L1296.61 2233.85L1305.78 2232.54L1343.77 2253.49L1355.56 2257.42V2254.8L1346.39 2252.18L1312.33 2222.07L1274.33 2194.57L1233.72 2159.21L1228.48 2156.6L1227.17 2155.29L1225.86 2152.67L1223.24 2150.05L1220.62 2151.36L1215.38 2155.29V2157.91V2160.52V2161.83L1211.45 2163.14H1207.52H1199.66V2160.52L1211.45 2153.98L1212.76 2152.67L1214.07 2150.05L1216.69 2148.74L1219.31 2147.43L1220.62 2146.12L1219.31 2143.5L1215.38 2140.88L1198.35 2116L1194.42 2113.39L1195.73 2100.29L1190.49 2091.13L1138.09 2053.15L1080.44 2009.94L1052.93 1979.83L1049 1974.59L1047.69 1973.28V1971.97L1041.14 1966.73H1039.83L1037.21 1961.49L1033.28 1951.02L1017.56 1924.83L1009.7 1915.66L1001.84 1901.26L997.905 1897.33L991.355 1893.4L980.874 1889.48L970.393 1888.17L963.843 1890.79L965.153 1892.1L966.463 1893.4L967.773 1897.33L958.603 1892.1L959.913 1885.55L966.463 1881.62L973.014 1884.24H975.634V1881.62L959.913 1877.69L949.432 1876.38L941.572 1873.76L933.711 1871.14L929.781 1868.53L932.401 1865.91L936.331 1868.53L957.293 1871.14L969.083 1877.69L974.324 1879L976.944 1880.31L980.874 1888.17L990.045 1892.1H993.975L996.595 1889.48L995.285 1886.86L988.735 1880.31L987.425 1876.38L984.804 1859.36L982.184 1850.19L979.564 1843.65L982.184 1839.72V1837.1L980.874 1834.48L976.944 1833.17V1830.55H983.494L987.425 1827.93L990.045 1824.01L992.665 1820.08L999.215 1814.84L1005.77 1810.91V1808.29L978.254 1774.25L974.324 1767.7L973.014 1761.15L976.944 1754.61V1750.68L973.014 1749.37L966.463 1757.23L963.843 1758.54H959.913L957.293 1757.23L954.672 1755.92L952.052 1757.23L950.742 1759.85L949.432 1763.77L948.122 1767.7V1771.63L945.502 1765.08V1762.46L946.812 1758.54H942.882H941.572L940.261 1759.85L936.331 1757.23L937.641 1754.61L941.572 1751.99L945.502 1750.68L948.122 1751.99H950.742L948.122 1745.44L944.192 1741.51L933.711 1733.66L924.54 1721.87L921.92 1720.56L915.37 1717.94L912.749 1716.63L895.718 1703.54L890.478 1702.23L882.617 1703.54L876.067 1706.16L870.827 1707.47L868.206 1704.85L874.757 1703.54L873.447 1699.61L869.516 1694.37L852.485 1679.97L840.694 1664.26L838.074 1661.64L830.214 1656.4L827.594 1652.47L824.973 1647.24L822.353 1640.69L821.043 1634.14L810.562 1632.83L798.772 1619.74L786.981 1597.48L779.12 1573.91L776.5 1569.98L775.19 1566.05V1556.89L773.88 1547.72L767.329 1543.79L768.639 1545.1L769.95 1564.74V1572.6L763.399 1575.22L764.709 1571.29L766.019 1564.74V1558.2L763.399 1555.58L762.089 1552.96L767.329 1539.86L766.019 1534.63L762.089 1529.39L755.539 1521.53L752.918 1520.22H747.678H745.058L743.748 1518.91L739.818 1511.06H742.438L745.058 1512.37L746.368 1514.99L747.678 1518.91L751.608 1513.68V1511.06L745.058 1508.44L737.197 1503.2L730.647 1497.96L726.717 1492.73L725.406 1488.8L722.786 1478.32V1474.39L721.476 1471.78L720.166 1469.16V1465.23L724.096 1454.75L730.647 1442.97L738.507 1435.11L747.678 1437.73L748.988 1435.11L751.608 1432.49L759.469 1428.56L756.849 1420.71V1408.92L760.779 1387.97L762.089 1386.66H766.019H769.95L772.57 1377.5H775.19H777.81L780.43 1376.19L781.74 1373.57V1367.02L780.43 1365.71L777.81 1367.02L776.5 1363.09L775.19 1360.48L781.74 1364.4L780.43 1359.17L775.19 1348.69L773.88 1339.53L772.57 1335.6L768.639 1332.98V1330.36L772.57 1332.98L776.5 1323.81L780.43 1326.43L779.12 1313.34L783.05 1288.46V1276.67H781.74V1275.36V1271.44L780.43 1267.51L779.12 1264.89L777.81 1266.2L775.19 1268.82L773.88 1271.44V1266.2L777.81 1263.58L781.74 1264.89V1272.75L783.05 1268.82V1259.65V1254.41L785.671 1249.18L792.221 1238.7L793.531 1233.46L796.151 1229.53H800.082H804.012L806.632 1226.92L807.942 1221.68L813.183 1213.82L814.493 1209.89L810.562 1211.2L801.392 1212.51L797.462 1213.82L800.082 1207.27L809.252 1202.04L813.183 1199.42L815.803 1195.49L818.423 1199.42L819.733 1200.73L821.043 1196.8V1187.63L822.353 1182.4L828.904 1173.23V1170.61L826.283 1165.37V1162.75L827.594 1157.52L830.214 1153.59L844.625 1140.49L848.555 1136.57L849.865 1132.64H852.485L855.105 1136.57L859.036 1140.49L864.276 1143.11L868.206 1144.42L869.516 1141.8L874.757 1127.4L876.067 1122.16H878.687L877.377 1128.71L874.757 1133.95L873.447 1139.19L874.757 1144.42L879.997 1140.49L891.788 1137.88L897.028 1135.26L899.649 1131.33L903.579 1120.85L906.199 1115.62L908.819 1118.23L907.509 1119.54L904.889 1127.4L910.129 1124.78L917.99 1115.62L925.85 1111.69L933.711 1101.21L940.261 1095.97L950.742 1081.57L954.672 1072.41L957.293 1069.79L963.843 1067.17L966.463 1065.86L963.843 1063.24V1060.62L966.463 1059.31H967.773H970.393V1061.93H967.773V1064.55L988.735 1061.93L992.665 1060.62L1000.53 1056.69L1007.08 1054.07L1011.01 1051.46L1013.63 1047.53L1014.94 1043.6L1016.25 1040.98H1017.56V1039.67L1016.25 1037.05L1014.94 1035.74L1007.08 1030.5L1005.77 1034.43L1003.15 1035.74L1000.53 1034.43L997.905 1030.5H999.215L1004.46 1029.2L1009.7 1030.5L1013.63 1034.43L1016.25 1038.36L1020.18 1035.74L1021.49 1030.5L1022.8 1025.27L1025.42 1021.34L1026.73 1017.41L1024.11 1013.48L1018.87 1008.24H1020.18H1021.49V1006.94V1005.63V1006.94L1022.8 1009.55L1026.73 1005.63L1029.35 997.769L1030.66 983.366L1028.04 980.747L1021.49 982.056L1013.63 984.675L1009.7 987.294H1007.08L1008.39 984.675L1011.01 982.056L1013.63 979.438L1014.94 978.128L1016.25 976.819L1025.42 974.2H1026.73L1028.04 967.653L1025.42 962.415L1022.8 957.178L1026.73 951.94V949.321L1017.56 954.559H1013.63L1008.39 951.94L1028.04 944.084L1034.59 937.536L1039.83 934.918L1041.14 933.608L1042.45 932.299V930.99V927.061L1041.14 925.752H1039.83L1038.52 924.442L1033.28 919.205L1030.66 916.586L1029.35 911.348L1033.28 913.967L1037.21 920.514L1039.83 921.824H1045.07L1050.31 920.514L1055.55 919.205L1059.48 916.586L1066.03 911.348V907.42L1060.79 904.801L1052.93 900.873V898.254H1056.86L1066.03 900.873H1069.96L1072.58 899.564L1075.2 898.254H1077.82L1079.13 896.945L1083.06 894.326L1086.99 893.017L1088.3 894.326L1089.61 896.945L1092.23 899.564L1098.78 904.801L1093.54 886.47L1090.92 881.232L1089.61 883.851L1084.37 879.923L1079.13 873.375L1075.2 866.828L1072.58 860.281L1079.13 864.21L1083.06 861.591L1084.37 855.044L1081.75 847.187L1076.51 843.259L1069.96 840.64L1062.1 838.021L1067.34 831.474L1073.89 838.021H1076.51L1077.82 834.093L1080.44 830.165V826.237L1079.13 819.69L1076.51 818.38H1072.58L1066.03 815.762H1058.17L1055.55 813.143L1054.24 809.214V805.286L1052.93 801.358L1050.31 798.739V796.12L1056.86 797.43L1059.48 798.739V796.12L1050.31 792.192L1046.38 790.883L1051.62 789.573L1058.17 790.883L1069.96 796.12V793.502H1067.34V790.883L1073.89 788.264L1079.13 789.573L1084.37 792.192L1092.23 793.502V792.192L1090.92 789.573V788.264H1094.85L1097.47 789.573L1100.09 790.883L1102.71 793.502L1098.78 797.43L1100.09 800.049L1102.71 801.358L1105.33 802.667V806.596L1104.02 809.214L1101.4 810.524H1096.16L1090.92 813.143L1093.54 818.38L1100.09 822.309L1106.64 820.999H1109.26L1110.57 823.618L1109.26 824.927L1115.81 830.165L1118.43 836.712L1114.5 838.021L1121.05 828.856L1119.74 827.546L1118.43 824.927L1117.12 822.309V819.69H1119.74L1122.36 826.237L1124.98 830.165L1130.22 831.474H1138.09V828.856L1134.15 827.546L1132.84 824.927L1131.53 822.309L1130.22 819.69L1128.91 818.38L1122.36 814.452L1118.43 811.833L1109.26 801.358H1111.88H1113.19L1114.5 802.667L1115.81 798.739L1119.74 800.049L1127.6 806.596L1130.22 809.214L1134.15 811.833L1139.4 813.143L1144.64 814.452H1149.88H1156.43L1161.67 811.833L1164.29 806.596L1162.98 801.358L1155.12 794.811V789.573L1160.36 794.811L1162.98 796.12H1166.91L1162.98 792.192H1165.6H1166.91L1165.6 790.883L1164.29 788.264L1162.98 786.955V784.336H1166.91L1169.53 786.955L1170.84 790.883V796.12L1172.15 793.502L1173.46 790.883V788.264V784.336H1176.08L1174.77 790.883L1176.08 792.192L1178.7 789.573L1181.32 784.336L1182.63 785.645L1183.94 786.955L1182.63 788.264L1181.32 790.883V793.502L1182.63 794.811L1185.25 793.502L1186.56 792.192V789.573L1187.87 786.955L1190.49 785.645L1194.42 784.336L1198.35 783.026H1202.28V785.645L1185.25 797.43L1176.08 809.214V811.833L1182.63 814.452L1198.35 817.071L1203.59 822.309V819.69L1207.52 820.999H1210.14L1214.07 819.69H1219.31L1218 814.452L1224.55 806.596L1229.79 805.286V802.667H1227.17H1225.86L1224.55 801.358L1223.24 800.049L1227.17 797.43L1233.72 796.12H1240.27L1244.2 797.43L1248.13 796.12H1254.68H1262.54L1266.47 794.811L1269.09 793.502L1274.33 789.573V786.955L1271.71 784.336L1270.4 780.407V775.17L1269.09 769.932L1271.71 768.623L1273.02 767.313V766.004L1271.71 763.385L1276.95 758.148L1279.57 750.291L1280.88 735.888L1278.26 737.197H1275.64L1273.02 735.888L1270.4 733.269L1271.71 729.341V717.556L1273.02 714.937L1274.33 713.628L1275.64 712.318L1274.33 709.699V707.081L1282.2 704.462H1292.68L1299.23 701.843V699.224L1290.06 693.987L1287.44 691.368L1290.06 686.13L1301.85 688.749L1303.16 690.058L1304.47 692.677L1308.4 693.987L1311.02 695.296H1312.33L1318.88 696.605H1325.43L1329.36 695.296L1325.43 693.987V691.368L1326.74 688.749L1325.43 684.821L1324.12 680.892V679.583L1328.05 680.892L1329.36 683.511L1330.67 687.44L1331.98 691.368L1334.6 695.296L1337.22 697.915L1341.15 699.224H1346.39L1349.01 697.915L1350.32 693.987L1351.63 686.13L1356.87 687.44L1358.18 688.749V687.44H1356.87L1360.8 684.821H1363.42L1360.8 682.202L1359.49 680.892L1360.8 679.583L1363.42 678.274V675.655L1362.11 674.345V673.036L1360.8 671.727L1366.04 674.345H1369.97L1371.28 671.727L1368.66 667.798V665.18L1369.97 663.87L1371.28 662.561H1373.9L1376.52 665.18L1380.45 666.489H1384.38L1385.69 663.87L1387 662.561H1389.62H1394.86L1400.1 653.395L1397.48 650.776L1398.79 648.157L1400.1 646.848L1402.72 645.538H1406.65L1405.34 642.92L1404.03 637.682L1402.72 635.063L1406.65 636.373L1405.34 631.135L1402.72 628.516L1398.79 627.207H1393.55V624.588L1397.48 621.969L1402.72 620.66L1406.65 621.969L1407.96 628.516L1410.58 625.897L1411.89 631.135H1414.51V627.207V625.897L1413.2 624.588V621.969L1415.82 619.35H1417.13V625.897L1418.44 631.135L1421.06 633.754L1424.99 632.444L1427.61 623.278L1430.24 620.66L1431.55 625.897H1434.17L1436.79 623.278V621.969V619.35L1442.03 620.66L1445.96 621.969L1448.58 624.588L1449.89 629.826V631.135L1451.2 632.444L1452.51 633.754V636.373L1451.2 637.682L1449.89 638.991L1448.58 641.61V645.538L1452.51 650.776L1459.06 646.848L1465.61 640.301L1472.16 636.373L1457.75 620.66L1453.82 619.35L1443.34 607.566L1434.17 601.019L1430.24 597.09L1426.31 591.853L1424.99 587.924L1422.37 585.306L1415.82 582.687L1405.34 580.068L1400.1 578.759H1394.86L1389.62 580.068L1377.83 589.234L1372.59 591.853L1354.25 595.781H1347.7L1334.6 594.471L1329.36 595.781L1326.74 597.09L1324.12 602.328L1321.5 603.637H1318.88L1311.02 602.328L1305.78 599.709L1301.85 598.4L1300.54 586.615L1296.61 581.377L1290.06 580.068L1284.82 582.687L1276.95 591.853L1266.47 598.4L1261.23 593.162L1253.37 568.283L1244.2 557.808L1235.03 559.117L1224.55 563.046L1211.45 559.117L1186.56 538.167L1177.39 532.929L1164.29 530.31L1157.74 527.692L1153.81 522.454L1152.5 515.907L1155.12 510.669L1159.05 505.432L1161.67 500.194V493.647L1157.74 488.409L1153.81 484.481H1147.26L1142.02 487.1L1136.77 489.719L1131.53 491.028L1124.98 487.1L1121.05 481.862L1118.43 476.625L1114.5 472.696L1106.64 471.387H1093.54L1088.3 470.078L1081.75 466.149L1080.44 464.84L1077.82 460.912L1076.51 459.602L1072.58 458.293H1069.96L1059.48 470.078L1054.24 474.006H1049L1047.69 471.387L1046.38 468.768V466.149V463.531L1052.93 447.818L1054.24 439.961V430.795L1052.93 429.486L1050.31 425.558L1049 424.248V421.63L1050.31 416.392V413.773L1049 409.845L1046.38 405.917L1043.76 401.988L1042.45 396.751L1046.38 391.513L1049 388.894L1050.31 384.966L1042.45 360.087L1041.14 356.159L1035.9 353.54H1022.8L1016.25 350.921L1012.32 346.993L1009.7 340.446L1008.39 327.352L1005.77 316.877V314.258L1007.08 310.33L1011.01 305.092L1012.32 302.473L1020.18 268.429L1022.8 261.882L1026.73 257.953L1033.28 256.644L1037.21 260.572L1041.14 265.81L1046.38 269.738H1052.93L1056.86 265.81L1062.1 248.788L1064.72 243.55L1071.27 233.075L1073.89 226.528L1075.2 216.052L1077.82 209.505L1081.75 205.577L1092.23 199.03L1094.85 195.102L1092.23 191.174L1085.68 189.864L1077.82 191.174H1073.89V189.864L1068.65 180.698L1059.48 172.842L1055.55 168.914L1052.93 166.295L1049 164.985L1046.38 166.295L1043.76 171.533L1041.14 172.842L1034.59 171.533L1030.66 167.604L1028.04 162.367L1025.42 157.129L1021.49 154.51L1005.77 150.582L1000.53 147.963L996.595 146.654L993.975 149.273L992.665 157.129L987.425 159.748L942.882 171.533L936.331 172.842H929.781L923.23 171.533L915.37 170.223L912.749 166.295L911.439 153.201L904.889 142.726L894.408 136.178L882.617 133.56L865.586 130.941L840.694 132.25L838.074 133.56L832.834 144.035L828.904 146.654L823.663 147.963L813.183 149.273H810.562L805.322 147.963H801.392L800.082 150.582V153.201L798.772 155.82L794.841 157.129L789.601 153.201L771.26 133.56L767.329 127.013L763.399 123.084L760.779 120.466L756.849 119.156L752.918 117.847L747.678 111.3L745.058 108.681H737.197L728.027 106.062L705.755 104.753H700.515L696.584 99.5151L695.274 92.968V78.5645L692.654 72.0175L688.724 68.0892L675.623 58.9234L673.003 54.9952L666.452 41.9011L662.522 34.0446L661.212 32.7352L657.282 31.4258H654.662L652.041 32.7352H649.421L645.491 30.1164L640.251 26.1882L635.01 22.2599L631.08 17.0223L628.46 10.4753L627.15 3.92823L624.529 0H619.289L615.359 2.61882L603.568 11.7847L600.948 15.7129L598.328 22.2599L597.018 28.807L594.397 34.0446L590.467 37.9729H586.537L583.917 36.6634L582.607 35.354H579.986H578.676L577.366 34.0446H576.056L574.746 35.354L573.436 36.6634V37.9729L572.126 39.2823L545.924 47.1387L541.994 48.4481L532.823 54.9952L522.342 60.2328L510.552 70.7081L507.931 72.0175H504.001L496.141 66.7798H492.21L485.66 69.3987V73.3269V78.5645L484.35 83.8021L476.489 90.3492L467.319 91.6586L463.388 95.5868L472.559 140.107V146.654L471.249 150.582L455.528 159.748L451.598 163.676L441.117 179.389L437.187 183.317L433.256 185.936L428.016 188.555H421.465L410.985 184.627L404.434 183.317L403.124 184.627L400.504 188.555L399.194 189.864L396.574 188.555L395.264 187.245L393.954 185.936L392.643 184.627L391.333 183.317V182.008V180.698H388.713L387.403 182.008L380.853 187.245L359.891 204.268L353.341 210.815L324.519 230.456L319.278 231.765L315.348 229.146L308.798 225.218L291.766 217.362L287.836 212.124L285.216 205.577V197.721L286.526 189.864L289.146 183.317H279.976L253.774 192.483L244.603 193.792L240.673 195.102L236.743 197.721L234.122 200.34L230.192 206.887L227.572 209.505L221.022 218.671L218.401 227.837L215.781 248.788L214.471 254.025L210.541 264.501L209.231 269.738V274.976V280.213V284.142L205.3 288.07L201.37 290.689L197.44 288.07L194.82 285.451L189.579 284.142L186.959 282.832L183.029 273.666L180.409 269.738L179.099 268.429H173.858H172.548L165.998 260.572L163.378 259.263L160.757 256.644L154.207 246.169L152.897 243.55L148.967 239.622L128.005 219.981L107.044 193.792L103.113 191.174L90.0125 199.03L86.0822 201.649L83.462 205.577L79.5318 212.124L76.9116 217.362L70.3611 225.218L69.051 229.146L71.6712 246.169L70.3611 248.788L59.8804 263.191L55.9501 265.81L50.7097 264.501L46.7795 261.882L38.9189 252.716L27.1281 234.384L24.5079 229.146V222.599V217.362L23.1979 212.124L19.2676 209.505L16.6474 205.577L14.0272 202.958L10.097 200.34L6.16666 197.721L-0.383789 195.102L-4.31406 196.411L-17.4149 218.671L-22.6553 234.384L-25.2755 237.003L-30.5159 240.931L-48.8571 251.406L-56.7177 257.953L-60.6479 268.429L-59.3379 271.048L-55.4076 276.285V280.213L-56.7177 282.832L-72.4388 293.308L-77.6791 295.926L-82.9195 297.236L-86.8498 299.855V305.092L-85.5397 310.33L-88.1599 314.258L-93.4002 318.186H-99.9507L-106.501 315.567L-116.982 307.711L-128.773 305.092L-132.703 301.164L-135.323 297.236L-145.804 276.285L-147.114 269.738L-149.734 264.501L-153.664 259.263L-158.905 256.644L-172.006 254.025L-178.556 251.406L-198.207 235.694L-204.758 233.075L-217.859 230.456L-224.409 227.837L-227.029 226.528L-230.96 222.599L-232.27 221.29H-234.89L-236.2 223.909L-237.51 226.528L-240.13 227.837H-246.681L-249.301 223.909L-250.611 217.362L-254.541 210.815L-261.092 205.577L-268.952 202.958L-276.813 204.268L-282.053 210.815L-285.984 222.599L-288.604 227.837L-292.534 231.765L-295.154 233.075H-299.084H-301.705L-304.325 235.694V239.622L-301.705 242.241L-299.084 243.55L-297.774 246.169L-296.464 248.788L-299.084 252.716L-338.387 293.308L-339.697 301.164L-341.007 312.949L-342.317 318.186L-346.248 323.424H-350.178L-355.418 320.805L-361.969 319.496L-367.209 320.805L-372.45 324.733L-379 328.662L-376.38 333.899L-375.07 337.827L-372.45 348.303L-371.139 349.612L-368.519 352.231L-367.209 353.54L-368.519 357.469V360.087L-364.589 365.325L-359.349 369.253L-352.798 373.181L-351.488 379.728L-344.938 384.966L-326.596 395.441L-304.325 417.701L-293.844 424.248L-291.224 426.867L-288.604 430.795L-285.984 438.652L-283.363 442.58L-276.813 447.818L-268.952 451.746L-263.712 455.674L-266.332 459.602L-267.642 460.912L-268.952 462.221V463.531V464.84L-265.022 477.934L-253.231 484.481L-238.82 489.719L-229.65 497.575L-219.169 522.454L-216.549 536.858L-217.859 556.499L-216.549 564.355L-215.239 572.212L-212.618 577.449L-209.998 581.377H-208.688L-207.378 580.068H-190.347L-186.417 578.759L-177.246 572.212L-170.696 563.046L-169.385 549.952L-168.075 522.454L-162.835 517.216L-156.285 522.454L-153.664 538.167L-154.974 551.261L-153.664 557.808L-149.734 561.736H-144.494L-122.222 551.261L-120.912 549.952H-119.602L-116.982 553.88L-115.672 557.808V561.736V585.306L-114.362 593.162L-111.741 601.019V602.328V603.637V604.947V606.256L-118.292 612.803L-130.083 627.207L-136.633 633.754L-151.044 657.323L-145.804 654.704L-139.253 650.776L-132.703 648.157L-128.773 649.467V653.395L-137.943 667.798L-139.253 674.345V690.058L-140.563 695.296L-144.494 699.224L-154.974 701.843L-160.215 707.081L-164.145 713.628L-161.525 714.937H-154.974H-148.424L-143.184 716.247L-139.253 718.865L-136.633 722.794L-135.323 726.722V729.341L-137.943 735.888V738.506L-136.633 742.435H-134.013H-131.393L-128.773 743.744L-124.842 748.982L-122.222 762.076L-119.602 767.313L-118.292 769.932L-116.982 772.551L-114.362 773.86H-109.121L-101.261 777.789L-96.0204 783.026L-89.4699 798.739L-80.2993 819.69L-75.0589 828.856L-65.8883 840.64L-60.6479 844.569L-58.0278 845.878L-54.0975 847.187L-48.8571 848.497L-46.237 849.806L-43.6168 851.116L-39.6865 853.734L-37.0663 855.044H-33.136L-26.5856 853.734H-23.9654L-18.725 855.044L-0.383789 864.21L8.78687 866.828H12.7171H14.0272L21.8878 864.21H27.1281L29.7483 861.591L31.0584 858.972L32.3685 857.663L36.2988 858.972L40.229 864.21L45.4694 875.994L49.3997 879.923L52.0199 881.232L54.64 882.541L57.2602 883.851H59.8804L79.5318 887.779L86.0822 891.707L97.873 904.801L104.423 911.348L105.734 912.658L107.044 913.967H110.974H113.594L117.524 912.658L121.455 911.348L122.765 910.039V907.42L118.834 899.564V896.945L120.145 893.017L121.455 891.707H124.075L128.005 890.398L134.556 886.47L135.866 883.851L134.556 881.232L133.245 874.685L134.556 869.447L137.176 862.9L139.796 856.353L142.416 852.425L146.346 851.116L152.897 852.425H155.517L158.137 851.116L163.378 847.187L165.998 845.878L189.579 838.021L196.13 835.403L198.75 834.093H202.68L214.471 832.784L228.882 815.762L240.673 814.452L243.293 815.762L248.534 819.69L251.154 820.999H253.774H260.324H264.255L273.425 824.927L276.045 826.237L277.355 828.856L279.976 835.403L281.286 836.712H283.906L290.456 834.093H293.077L295.697 835.403L298.317 836.712L300.937 838.021L303.557 840.64L307.488 845.878L312.728 856.353L316.658 861.591L319.278 862.9L324.519 864.21H328.449L329.759 866.828L332.379 872.066L334.999 874.685L341.55 877.304H348.1H354.651L358.581 882.541L361.201 893.017L366.442 898.254L382.163 906.111L400.504 912.658L404.434 917.895L401.814 927.061L380.853 954.559L374.302 959.797L366.442 962.415L358.581 961.106L350.721 954.559L344.17 967.653L328.449 979.438L325.829 985.985L336.31 992.532L349.41 995.151L393.954 993.841L397.884 996.46L405.744 1006.94L410.985 1010.86L422.776 1016.1L426.706 1020.03L428.016 1022.65L429.326 1026.58V1030.5V1033.12L426.706 1037.05L424.086 1038.36H421.465L418.845 1040.98L417.535 1044.91V1051.46V1058L418.845 1061.93L429.326 1067.17L442.427 1064.55L456.838 1059.31H469.939L497.451 1075.02V1077.64L496.141 1081.57V1089.43L500.071 1095.97L511.862 1103.83L514.482 1109.07L513.172 1110.38L509.242 1111.69L507.931 1113V1115.62L509.242 1118.23V1124.78L510.552 1128.71V1132.64L509.242 1136.57L505.311 1140.49H501.381L492.21 1139.19L485.66 1140.49V1139.19V1141.8L483.04 1147.04L475.179 1152.28L458.148 1162.75L451.598 1170.61L448.977 1177.16L450.287 1178.47H459.458L466.009 1181.09L468.629 1182.4V1185.01V1190.25L466.009 1200.73L459.458 1205.97L451.598 1209.89L443.737 1216.44L437.187 1217.75H433.256L429.326 1219.06L424.086 1222.99L420.155 1226.92L417.535 1230.84L407.054 1257.03L404.434 1260.96H401.814L396.574 1258.34L393.954 1257.03L391.333 1258.34L386.093 1260.96L383.473 1262.27L375.612 1263.58L370.372 1262.27L352.031 1251.79L344.17 1247.87L341.55 1246.56L338.93 1243.94L336.31 1240.01L332.379 1237.39L325.829 1236.08L320.589 1237.39L306.177 1246.56L300.937 1237.39L289.146 1233.46L285.216 1229.53L262.944 1236.08H256.394L255.084 1237.39L252.464 1240.01L249.844 1245.25L247.223 1247.87L240.673 1249.18L234.122 1246.56L218.401 1238.7L214.471 1237.39L211.851 1238.7L210.541 1243.94L211.851 1247.87L218.401 1264.89L222.332 1270.13L232.812 1276.67L236.743 1279.29L239.363 1284.53V1289.77L240.673 1295.01L244.603 1298.93L243.293 1302.86L240.673 1304.17L236.743 1305.48L234.122 1306.79L231.502 1310.72L230.192 1318.57L228.882 1322.5L226.262 1327.74L224.952 1326.43H219.711L211.851 1329.05L205.3 1332.98L198.75 1334.29L194.82 1336.91L188.269 1346.07L183.029 1350L171.238 1355.24L167.308 1357.86L164.688 1363.09L167.308 1364.4H172.548H177.789L181.719 1372.26L183.029 1374.88L185.649 1376.19L193.51 1380.12L202.68 1386.66L209.231 1384.04H215.781L223.642 1387.97L259.014 1403.69L272.115 1412.85L274.735 1415.47L276.045 1422.02V1428.56L278.666 1431.18L287.836 1428.56L294.387 1429.87L298.317 1433.8L302.247 1437.73L307.488 1441.66L314.038 1444.28L319.278 1445.59L324.519 1448.21L329.759 1453.44L338.93 1466.54L342.86 1469.16L348.1 1470.47L357.271 1469.16L363.821 1470.47L369.062 1473.08L372.992 1477.01L383.473 1494.04L387.403 1497.96L397.884 1503.2L401.814 1507.13L410.985 1516.3L416.225 1518.91L418.845 1520.22H425.396L428.016 1521.53L429.326 1522.84L433.256 1528.08L435.876 1530.7L439.807 1532.01L452.908 1533.32L464.698 1537.25H468.629L486.97 1535.94L494.831 1538.56L497.451 1546.41L501.381 1550.34L506.621 1551.65H513.172L518.412 1550.34L523.653 1551.65L539.374 1560.81L547.234 1563.43H551.164L555.095 1562.12H559.025L562.955 1563.43L572.126 1577.84L578.676 1583.07L581.297 1585.69V1590.93L578.676 1596.17H576.056L572.126 1594.86H568.196L564.265 1601.41L560.335 1610.57L555.095 1628.9L553.785 1642L557.715 1651.16L565.575 1657.71L576.056 1665.57L581.297 1670.81V1674.73L578.676 1678.66V1685.21L581.297 1689.14L597.018 1698.3L598.328 1700.92L600.948 1706.16L603.568 1707.47L606.188 1708.78L617.979 1707.47L619.289 1706.16H620.599L623.219 1710.09V1714.02L620.599 1721.87V1725.8L624.529 1731.04L629.77 1734.97L635.01 1737.59L640.251 1738.89L642.871 1740.2L644.181 1741.51H645.491L648.111 1740.2L649.421 1737.59L650.731 1729.73L652.041 1727.11L657.282 1724.49H663.832L670.383 1727.11L675.623 1731.04L676.933 1733.66L679.553 1742.82V1745.44L678.243 1746.75V1748.06V1749.37L679.553 1750.68L683.484 1751.99L684.794 1753.3L690.034 1765.08L692.654 1767.7L697.895 1770.32L700.515 1772.94L701.825 1776.87L703.135 1784.72L704.445 1787.34L707.065 1789.96L714.926 1793.89L720.166 1804.36L716.236 1829.24L720.166 1839.72L731.957 1851.5L739.818 1867.22L746.368 1876.38L748.988 1881.62L752.918 1894.71L755.539 1899.95L759.469 1902.57L775.19 1909.12L785.671 1915.66L793.531 1923.52L814.493 1949.71L821.043 1956.26L848.555 1988.99L900.959 2033.51L907.509 2037.44H911.439L915.37 2034.82L919.3 2029.58L920.61 2026.96L921.92 2024.35L923.23 2021.73H927.16L931.091 2023.04L932.401 2025.66V2029.58L933.711 2033.51L935.021 2036.13L938.951 2040.06L940.261 2041.37V2043.99L937.641 2049.22V2053.15L938.951 2058.39L948.122 2074.1L963.843 2088.51L966.463 2093.74V2095.05L963.843 2098.98V2100.29L970.393 2113.39L971.703 2116L974.324 2118.62L979.564 2121.24L986.115 2123.86L991.355 2125.17L999.215 2127.79L1008.39 2119.93L1011.01 2125.17V2219.45L1012.32 2227.3L1014.94 2233.85L1021.49 2241.71L1028.04 2245.64L1034.59 2248.25H1038.52L1043.76 2250.87L1045.07 2254.8L1043.76 2271.82V2275.75L1047.69 2288.85L1052.93 2298.01L1059.48 2303.25L1068.65 2301.94V2305.87L1069.96 2307.18H1072.58L1075.2 2305.87L1077.82 2303.25V2300.63V2298.01L1079.13 2295.39L1086.99 2290.16L1090.92 2286.23L1092.23 2280.99L1098.78 2269.21H1106.64L1111.88 2277.06L1113.19 2290.16L1111.88 2300.63V2301.94L1110.57 2303.25L1109.26 2304.56V2305.87L1110.57 2307.18L1113.19 2305.87L1114.5 2304.56H1115.81L1119.74 2313.72L1122.36 2317.65L1127.6 2321.58L1135.46 2325.51L1138.09 2326.82L1139.4 2329.44L1140.71 2337.29L1142.02 2339.91L1145.95 2342.53H1149.88H1160.36L1172.15 2343.84L1177.39 2345.15L1182.63 2347.77L1189.18 2351.7L1191.8 2355.63L1195.73 2372.65L1197.04 2376.58L1199.66 2380.5L1203.59 2384.43L1208.83 2387.05L1212.76 2388.36L1216.69 2389.67L1221.93 2390.98L1229.79 2396.22L1241.58 2410.62L1249.44 2417.17L1258.61 2419.79L1267.78 2418.48L1284.82 2414.55H1291.37L1292.68 2415.86L1291.37 2419.79V2426.33L1292.68 2430.26L1295.3 2432.88V2435.5L1291.37 2439.43L1287.44 2443.36L1278.26 2459.07L1273.02 2464.31L1269.09 2466.93L1257.3 2469.54L1252.06 2472.16L1229.79 2486.57L1227.17 2487.88H1224.55L1221.93 2486.57L1219.31 2485.26L1215.38 2486.57L1211.45 2490.5L1203.59 2507.52V2514.06L1207.52 2519.3L1224.55 2529.78L1227.17 2533.71L1228.48 2538.94L1229.79 2552.04L1231.1 2557.27L1233.72 2561.2L1238.96 2565.13L1250.75 2571.68L1254.68 2575.61L1271.71 2605.72L1275.64 2608.34L1278.26 2607.03L1280.88 2604.41L1283.51 2601.79H1286.13L1292.68 2603.1H1293.99L1295.3 2601.79H1296.61L1297.92 2605.72L1299.23 2608.34L1300.54 2609.65H1301.85L1304.47 2608.34L1308.4 2610.96L1309.71 2617.51V2625.36L1311.02 2630.6L1317.57 2634.53L1330.67 2631.91L1335.91 2633.22L1337.22 2637.15L1338.53 2650.24L1341.15 2655.48L1345.08 2659.41L1359.49 2669.88L1363.42 2675.12L1366.04 2679.05V2684.29L1363.42 2700L1362.11 2702.62H1359.49L1358.18 2701.31L1356.87 2700L1354.25 2702.62L1352.94 2705.24V2715.71L1351.63 2722.26L1349.01 2727.5L1347.7 2728.81L1343.77 2732.74L1342.46 2735.35V2737.97L1345.08 2743.21V2747.14L1341.15 2751.07H1335.91L1326.74 2749.76H1321.5L1307.09 2753.69H1300.54L1297.92 2756.3V2760.23L1300.54 2765.47V2770.71L1301.85 2774.64L1304.47 2778.56L1308.4 2781.18L1313.64 2783.8L1331.98 2798.21L1334.6 2800.82L1333.29 2804.75L1328.05 2811.3L1314.95 2824.39L1312.33 2828.32L1313.64 2833.56L1316.26 2838.8L1317.57 2844.04L1313.64 2847.96L1316.26 2850.58L1318.88 2853.2L1321.5 2855.82V2859.75L1325.43 2868.91L1324.12 2876.77L1316.26 2892.48V2897.72L1317.57 2906.89V2912.12L1316.26 2916.05L1312.33 2922.6L1311.02 2926.53V2929.15L1309.71 2933.08L1305.78 2940.93L1303.16 2946.17L1299.23 2950.1L1292.68 2951.41L1290.06 2950.1L1288.75 2947.48L1287.44 2946.17L1283.51 2947.48L1280.88 2950.1L1279.57 2952.72V2955.34L1278.26 2957.95L1271.71 2969.74L1269.09 2976.29V2982.83V2985.45L1271.71 2992L1273.02 2994.62V2997.24L1271.71 3009.02L1261.23 3039.14L1259.92 3046.99L1261.23 3050.92L1263.85 3053.54L1267.78 3058.78V3065.33L1266.47 3071.87V3078.42L1270.4 3083.66L1275.64 3086.28L1287.44 3084.97L1292.68 3086.28L1295.3 3088.89V3091.51V3094.13V3096.75L1299.23 3105.92L1300.54 3111.15L1299.23 3115.08L1297.92 3119.01L1296.61 3124.25L1300.54 3133.41V3136.03L1297.92 3142.58V3146.51L1299.23 3151.75L1305.78 3158.29L1308.4 3163.53L1309.71 3164.84L1317.57 3172.7L1322.81 3180.55L1349.01 3231.62L1351.63 3243.41L1354.25 3274.83L1352.94 3285.31L1307.09 3396.61L1308.4 3400.53L1313.64 3404.46L1314.95 3407.08V3409.7L1313.64 3411.01L1312.33 3412.32L1311.02 3414.94V3418.87L1312.33 3422.79L1316.26 3430.65L1317.57 3439.82L1318.88 3445.05L1321.5 3448.98L1330.67 3459.46L1334.6 3468.62L1335.91 3476.48V3485.65L1337.22 3494.81L1345.08 3530.17V3540.64L1343.77 3549.81L1342.46 3553.73L1341.15 3557.66L1339.84 3561.59L1342.46 3565.52V3573.38L1333.29 3599.56L1331.98 3607.42L1329.36 3615.28L1324.12 3620.51L1316.26 3624.44L1308.4 3629.68L1297.92 3644.08H1290.06L1283.51 3638.85L1274.33 3624.44L1266.47 3620.51L1252.06 3621.82L1232.41 3628.37L1214.07 3637.54L1204.9 3648.01L1202.28 3651.94L1198.35 3655.87L1190.49 3662.42L1180.01 3674.2L1159.05 3695.15L1151.19 3700.39L1139.4 3704.32L1127.6 3705.63L1104.02 3704.32L1094.85 3705.63L1088.3 3709.55L1083.06 3717.41L1079.13 3727.89L1072.58 3735.74L1066.03 3737.05L1050.31 3733.12L1052.93 3738.36L1025.42 3734.43H1009.7L1000.53 3740.98H996.595L995.285 3738.36L993.975 3735.74L991.355 3733.12H987.425H983.494L975.634 3734.43L978.254 3743.6L987.425 3760.62L988.735 3768.48L987.425 3769.79L982.184 3777.64V3780.26V3786.81V3789.43L979.564 3793.36L976.944 3797.28L975.634 3801.21V3806.45L984.804 3820.85L987.425 3828.71L984.804 3833.95H980.874L976.944 3831.33L970.393 3826.09L966.463 3824.78H963.843H959.913L941.572 3830.02L937.641 3828.71L935.021 3826.09L931.091 3819.54L928.471 3816.93L921.92 3813L899.649 3806.45H886.548L870.827 3801.21L856.416 3798.59L848.555 3806.45V3810.38L847.245 3814.31L845.935 3818.24L836.764 3827.4L834.144 3833.95L830.214 3837.88H821.043L806.632 3832.64L801.392 3833.95L794.841 3840.5L790.911 3844.42L786.981 3849.66L785.671 3856.21L789.601 3862.76L793.531 3865.37L801.392 3866.68L805.322 3869.3L806.632 3873.23V3877.16V3885.02L811.872 3902.04V3907.28L810.562 3912.51L806.632 3922.99L801.392 3946.56V3950.49L805.322 3953.1L810.562 3954.41L814.493 3957.03L815.803 3963.58L818.423 3972.75L824.973 3977.98L842.005 3981.91L847.245 3985.84L855.105 3997.62L860.346 4002.86L870.827 4012.03L874.757 4017.27L877.377 4023.81L881.307 4017.27L886.548 4014.65L891.788 4015.96L897.028 4019.88L900.959 4025.12L906.199 4043.45L910.129 4050L907.509 4051.31H897.028H891.788L890.478 4052.62L889.168 4055.24V4056.55V4064.4V4065.71L890.478 4070.95L898.339 4085.35L906.199 4115.47L899.649 4110.23L891.788 4107.61L873.447 4106.31L865.586 4103.69L856.416 4099.76L848.555 4094.52L842.005 4087.97L839.384 4084.05L828.904 4074.88V4080.12L826.283 4086.66L822.353 4093.21L819.733 4095.83H813.183L807.942 4091.9L804.012 4086.66L801.392 4082.74L797.462 4072.26L794.841 4067.02L784.361 4052.62L779.12 4043.45L773.88 4036.91L766.019 4035.6L756.849 4038.22L748.988 4042.14L742.438 4046.07L735.887 4050L686.104 4060.48H683.484L676.933 4056.55L667.763 4053.93L666.452 4052.62L662.522 4055.24L649.421 4069.64L640.251 4087.97L637.63 4090.59L632.39 4089.28L621.909 4080.12L616.669 4077.5L572.126 4069.64L568.196 4068.33L564.265 4063.09L562.955 4059.17L561.645 4057.86L555.095 4061.79L551.164 4064.4L547.234 4068.33L543.304 4073.57L540.684 4078.81L541.994 4089.28L547.234 4101.07L559.025 4122.02V4132.49L551.164 4140.35L519.722 4156.06L515.792 4159.99L511.862 4163.92L498.761 4183.56L490.9 4191.42L479.109 4195.35H464.698L417.535 4190.11H404.434L399.194 4191.42L395.264 4194.04L392.643 4199.27L390.023 4204.51L376.922 4224.15L372.992 4226.77L369.062 4228.08L363.821 4226.77L365.132 4230.7L363.821 4235.94V4239.86H369.062L374.302 4238.56L378.232 4235.94L380.853 4232.01L383.473 4226.77H386.093L387.403 4229.39V4232.01L386.093 4234.63L383.473 4238.56L380.853 4239.86H378.232L376.922 4241.17L378.232 4245.1L384.783 4254.27L387.403 4260.82V4269.98H390.023V4268.67V4267.36L391.333 4264.74L400.504 4271.29L403.124 4275.22L404.434 4283.08V4292.24L405.744 4294.86L409.675 4300.1L410.985 4302.72V4306.64L409.675 4309.26L408.365 4311.88L409.675 4314.5H410.985H421.465L422.776 4313.19L424.086 4306.64L425.396 4305.34L429.326 4304.03L430.636 4301.41V4298.79L431.946 4296.17L439.807 4289.62L448.977 4287L459.458 4288.31L469.939 4294.86L476.489 4302.72L483.04 4313.19L485.66 4334.14L496.141 4340.69H504.001L517.102 4338.07L523.653 4339.38L530.203 4343.31L541.994 4355.09L556.405 4373.42L560.335 4379.97L562.955 4386.52V4400.92L564.265 4412.71V4416.63L556.405 4396.99L555.095 4391.76L552.474 4389.14L545.924 4391.76L526.273 4406.16L521.032 4411.4L518.412 4416.63L515.792 4419.25L498.761 4425.8L492.21 4434.97L488.28 4448.06L476.489 4509.6L475.179 4522.7L477.799 4563.29L473.869 4577.69L471.249 4624.83L468.629 4644.47V4681.14L469.939 4688.99L475.179 4691.61V4694.23L469.939 4698.16L468.629 4706.01L471.249 4721.73L469.939 4728.27L466.009 4741.37L464.698 4749.23L469.939 4757.08L483.04 4754.46L502.691 4745.3L501.381 4751.84L502.691 4758.39L505.311 4763.63V4766.25L500.071 4770.18H497.451H489.59H484.35L480.419 4771.48L479.109 4772.79L480.419 4776.72L488.28 4780.65H498.761L509.242 4778.03L517.102 4774.1L514.482 4778.03L510.552 4781.96L505.311 4784.58L501.381 4785.89L480.419 4781.96H476.489L472.559 4784.58L473.869 4785.89L476.489 4787.2L477.799 4789.82L476.489 4793.74L473.869 4795.05L471.249 4796.36L468.629 4798.98L450.287 4813.39L447.667 4810.77L443.737 4809.46L441.117 4810.77L442.427 4814.7L443.737 4816L451.598 4818.62L471.249 4821.24L473.869 4822.55L475.179 4823.86L476.489 4825.17L484.35 4826.48L553.785 4812.08L565.575 4806.84L573.436 4800.29L583.917 4783.27L603.568 4767.56V4764.94L611.429 4766.25L621.909 4759.7L631.08 4750.53L636.32 4742.68L657.282 4692.92V4691.61V4687.68V4686.37L658.592 4685.06L662.522 4683.75L663.832 4682.45L665.142 4677.21L669.073 4673.28L676.933 4666.73L691.344 4652.33L699.205 4645.78L768.639 4619.59L849.865 4586.86L893.098 4573.76L902.269 4572.46L904.889 4569.84L906.199 4564.6L904.889 4560.67L902.269 4559.36L899.649 4558.05L897.028 4555.43L908.819 4543.65L910.129 4539.72L908.819 4526.63L907.509 4521.39L904.889 4517.46L872.137 4469.01L869.516 4462.46L868.206 4457.23L865.586 4451.99L792.221 4378.66L785.671 4369.5L792.221 4370.81L802.702 4377.35L813.183 4379.97L822.353 4386.52L834.144 4396.99L864.276 4433.66L923.23 4488.65L950.742 4503.06L966.463 4514.84L970.393 4517.46H983.494L987.425 4514.84L990.045 4513.53L992.665 4514.84L996.595 4516.15L1000.53 4514.84L1007.08 4510.91L1014.94 4504.37L1021.49 4495.2L1025.42 4484.72L1026.73 4469.01V4462.46L1025.42 4455.92L1021.49 4453.3L1013.63 4451.99L1011.01 4448.06L1008.39 4434.97L1003.15 4424.49L995.285 4415.33L967.773 4393.07L961.223 4385.21L959.913 4383.9L944.192 4368.19L942.882 4365.57L940.261 4360.33L938.951 4357.71L936.331 4355.09L915.37 4339.38L908.819 4332.83L904.889 4328.9L902.269 4324.98L899.649 4314.5L891.788 4307.95L883.927 4300.1L881.307 4298.79L878.687 4297.48L877.377 4296.17L879.997 4293.55H881.307L883.927 4294.86L886.548 4296.17L965.153 4377.35L991.355 4393.07L999.215 4398.3L1017.56 4417.94L1025.42 4424.49L1033.28 4425.8L1041.14 4423.18L1047.69 4416.63L1049 4406.16H1050.31L1051.62 4408.78L1052.93 4411.4V4414.02L1050.31 4416.63V4419.25L1054.24 4415.33L1058.17 4408.78L1059.48 4402.23L1056.86 4399.61L1051.62 4398.3L1033.28 4389.14L1016.25 4376.04L991.355 4364.26L984.804 4357.71L957.293 4321.05L954.672 4314.5L952.052 4302.72L948.122 4298.79L938.951 4290.93H937.641L936.331 4289.62L935.021 4288.31L946.812 4292.24L955.982 4301.41L982.184 4343.31L990.045 4352.47L999.215 4360.33L1014.94 4366.88L1020.18 4370.81L1024.11 4374.73L1028.04 4378.66L1033.28 4379.97H1045.07H1046.38L1047.69 4378.66L1049 4376.04L1051.62 4373.42V4370.81L1052.93 4369.5H1058.17L1059.48 4368.19L1058.17 4365.57L1055.55 4362.95L1054.24 4361.64L1055.55 4359.02L1056.86 4356.4L1060.79 4352.47V4351.16L1062.1 4345.93H1064.72L1066.03 4348.55V4351.16V4353.78L1064.72 4356.4L1069.96 4357.71L1075.2 4355.09L1092.23 4336.76L1093.54 4331.52V4323.67V4321.05L1092.23 4319.74L1089.61 4318.43H1086.99H1083.06L1080.44 4317.12L1079.13 4315.81L1077.82 4314.5L1076.51 4313.19L1071.27 4309.26L1069.96 4307.95L993.975 4281.77L975.634 4269.98L980.874 4268.67L984.804 4269.98L990.045 4272.6L996.595 4273.91H1008.39L1031.97 4277.84H1064.72L1080.44 4281.77H1086.99L1092.23 4279.15L1093.54 4272.6L1090.92 4245.1L1089.61 4239.86L1085.68 4234.63L1083.06 4230.7L1080.44 4225.46L1076.51 4220.22L1071.27 4218.91L1068.65 4220.22L1063.41 4229.39L1060.79 4232.01H1054.24L1051.62 4228.08L1050.31 4222.84L1049 4218.91H1046.38L1043.76 4224.15L1039.83 4228.08L1034.59 4230.7L1029.35 4232.01L1025.42 4230.7L1024.11 4226.77V4216.3L1026.73 4218.91L1028.04 4221.53L1029.35 4225.46V4230.7L1033.28 4228.08L1037.21 4226.77L1039.83 4225.46L1042.45 4218.91L1045.07 4216.3L1049 4214.99L1052.93 4213.68L1050.31 4211.06L1049 4209.75L1047.69 4204.51H1050.31L1052.93 4209.75H1058.17L1068.65 4205.82L1072.58 4203.2L1075.2 4197.96L1076.51 4191.42L1077.82 4186.18L1079.13 4183.56L1080.44 4182.25L1081.75 4180.94L1083.06 4177.01L1079.13 4167.85L1077.82 4165.23L1076.51 4163.92H1075.2L1072.58 4161.3L1073.89 4157.37L1075.2 4156.06L1081.75 4152.13H1083.06L1086.99 4154.75L1092.23 4158.68L1096.16 4163.92L1097.47 4167.85L1100.09 4171.78L1106.64 4170.47L1117.12 4165.23L1136.77 4180.94L1135.46 4191.42V4196.65L1136.77 4203.2L1138.09 4205.82L1139.4 4207.13L1140.71 4208.44L1142.02 4212.37V4214.99L1140.71 4218.91V4221.53L1143.33 4222.84L1145.95 4220.22L1152.5 4208.44L1157.74 4205.82L1151.19 4200.58L1148.57 4192.73V4183.56L1151.19 4174.39H1152.5V4183.56V4187.49L1151.19 4190.11V4191.42L1155.12 4195.35L1152.5 4197.96L1156.43 4200.58L1159.05 4201.89H1161.67V4199.27L1160.36 4197.96L1157.74 4196.65L1156.43 4194.04L1160.36 4186.18L1161.67 4180.94L1159.05 4178.32L1155.12 4177.01V4173.09L1157.74 4165.23L1155.12 4162.61L1151.19 4159.99L1148.57 4156.06L1149.88 4150.83L1159.05 4158.68L1162.98 4163.92V4171.78L1159.05 4170.47L1157.74 4169.16L1159.05 4171.78L1162.98 4175.7L1164.29 4178.32L1165.6 4200.58V4203.2L1162.98 4207.13L1160.36 4208.44L1156.43 4209.75L1153.81 4212.37L1152.5 4217.6H1153.81L1155.12 4214.99L1157.74 4213.68L1161.67 4211.06V4213.68L1162.98 4220.22L1166.91 4218.91L1169.53 4216.3L1172.15 4209.75L1173.46 4213.68V4214.99L1172.15 4217.6H1174.77L1180.01 4213.68H1186.56L1193.11 4216.3L1197.04 4220.22H1198.35V4216.3L1200.97 4217.6H1204.9H1208.83H1210.14L1216.69 4224.15L1218 4225.46L1219.31 4226.77L1221.93 4229.39L1223.24 4232.01V4234.63L1221.93 4237.25L1219.31 4238.56L1216.69 4239.86L1215.38 4242.48L1223.24 4243.79L1235.03 4250.34H1240.27L1248.13 4238.56L1257.3 4229.39L1259.92 4225.46L1263.85 4226.77L1276.95 4222.84L1291.37 4221.53L1296.61 4220.22L1316.26 4211.06L1322.81 4207.13L1325.43 4203.2L1326.74 4199.27L1334.6 4191.42L1337.22 4188.8L1350.32 4182.25L1358.18 4179.63L1364.73 4178.32L1385.69 4167.85L1397.48 4163.92L1401.41 4161.3L1414.51 4150.83L1432.86 4142.97L1438.1 4141.66H1444.65L1449.89 4142.97L1464.3 4146.9L1468.23 4149.52H1470.85L1482.64 4125.95L1485.26 4112.85L1489.19 4103.69L1490.5 4099.76L1491.81 4095.83L1499.67 4087.97L1500.98 4085.35L1504.91 4080.12L1514.08 4077.5L1553.38 4069.64L1561.24 4072.26L1563.86 4081.43H1565.17L1570.42 4070.95L1573.04 4068.33L1579.59 4067.02L1580.9 4064.4L1584.83 4050L1586.14 4046.07L1588.76 4044.76H1594H1597.93L1608.41 4039.53L1611.03 4038.22L1618.89 4036.91L1621.51 4032.98L1624.13 4019.88L1626.75 4014.65L1630.68 4009.41L1635.92 4004.17L1645.09 4001.55L1649.02 3997.62L1650.33 3996.32H1662.12L1666.05 3995.01L1672.6 3992.39L1675.22 3991.08H1679.15L1685.7 3993.7L1688.32 3995.01H1693.56L1697.49 3993.7L1700.11 3991.08L1702.73 3985.84L1706.66 3970.13L1709.28 3964.89L1711.9 3960.96L1715.83 3957.03L1726.32 3949.18L1731.56 3946.56L1736.8 3945.25H1742.04L1747.28 3946.56L1760.38 3953.1H1765.62L1770.86 3951.79L1774.79 3949.18L1782.65 3942.63L1786.58 3938.7L1787.89 3934.77L1786.58 3922.99L1789.2 3900.73V3886.32L1783.96 3878.47H1786.58H1793.13L1790.51 3873.23V3867.99L1791.82 3864.06V3860.14L1789.2 3858.83L1785.27 3854.9V3850.97L1793.13 3849.66L1794.44 3852.28L1797.06 3862.76L1800.99 3866.68L1807.54 3867.99H1812.78H1816.71L1820.64 3870.61H1823.26L1827.19 3865.37L1828.5 3861.45L1829.81 3857.52L1831.12 3854.9L1836.36 3849.66L1837.67 3847.04L1838.98 3841.8V3839.19L1840.29 3836.57L1845.53 3830.02L1848.15 3823.47L1850.77 3820.85L1853.39 3823.47L1857.32 3816.93L1845.53 3801.21V3793.36L1841.6 3788.12V3784.19L1844.22 3780.26L1845.53 3776.33H1842.91L1837.67 3781.57L1833.74 3788.12L1832.43 3790.74L1821.95 3789.43L1820.64 3778.95L1824.57 3768.48L1831.12 3767.17L1838.98 3759.31L1844.22 3751.46L1846.84 3742.29L1848.15 3733.12L1846.84 3727.89L1838.98 3721.34L1837.67 3718.72L1838.98 3709.55V3708.25L1837.67 3706.94L1833.74 3699.08L1837.67 3693.84L1840.29 3697.77L1842.91 3710.86L1849.46 3729.2H1846.84L1850.77 3739.67L1849.46 3763.24L1852.08 3772.41L1853.39 3771.1L1856.01 3769.79L1857.32 3768.48L1859.95 3772.41L1863.88 3775.02H1869.12L1874.36 3772.41V3769.79L1870.43 3768.48L1867.81 3764.55L1866.5 3759.31V3754.07L1871.74 3750.15V3748.84L1873.05 3743.6V3744.91L1863.88 3738.36L1861.26 3734.43L1852.08 3717.41L1849.46 3712.17L1848.15 3699.08V3696.46L1852.08 3692.53L1853.39 3689.91L1852.08 3685.99L1849.46 3683.37V3682.06V3680.75V3678.13V3674.2L1848.15 3671.58L1844.22 3668.96L1841.6 3671.58L1842.91 3667.65L1845.53 3666.34L1853.39 3668.96L1850.77 3665.03L1848.15 3662.42L1846.84 3658.49L1849.46 3653.25L1842.91 3649.32L1840.29 3646.7L1838.98 3644.08L1840.29 3645.39L1846.84 3648.01L1849.46 3638.85L1850.77 3636.23H1853.39L1857.32 3637.54L1858.64 3636.23V3633.61L1854.7 3630.99L1852.08 3628.37L1849.46 3624.44L1848.15 3621.82V3615.28L1846.84 3607.42L1844.22 3602.18L1837.67 3603.49L1835.05 3599.56L1829.81 3594.33L1828.5 3590.4H1831.12L1832.43 3591.71L1835.05 3593.02L1833.74 3591.71L1832.43 3587.78L1831.12 3586.47L1840.29 3585.16L1849.46 3591.71L1862.57 3607.42L1866.5 3615.28L1869.12 3619.21L1874.36 3620.51L1878.29 3617.9L1880.91 3612.66L1883.53 3610.04L1887.46 3613.97L1890.08 3611.35L1887.46 3608.73L1891.39 3604.8L1888.77 3600.87L1883.53 3596.95L1879.6 3595.64L1878.29 3594.33L1876.98 3591.71V3589.09L1879.6 3582.54L1878.29 3579.92L1862.57 3569.45L1858.64 3565.52L1857.32 3560.28L1858.64 3555.04L1861.26 3549.81V3545.88L1856.01 3544.57V3547.19H1858.64V3549.81L1854.7 3551.12L1853.39 3553.73V3557.66L1852.08 3560.28H1849.46V3558.97H1848.15H1846.84V3556.35L1845.53 3551.12V3545.88L1848.15 3543.26L1846.84 3530.17V3527.55L1856.01 3514.45L1858.64 3511.83L1862.57 3510.52L1866.5 3506.6L1874.36 3497.43L1876.98 3494.81L1887.46 3488.26L1888.77 3485.65V3483.03L1890.08 3480.41L1894.01 3479.1L1895.32 3480.41V3489.57L1896.63 3493.5L1901.87 3501.36L1903.18 3506.6L1901.87 3509.21L1899.25 3510.52L1896.63 3511.83L1895.32 3513.14L1894.01 3514.45L1888.77 3522.31H1892.7L1895.32 3523.62L1897.94 3526.24L1899.25 3528.86L1900.56 3526.24V3523.62V3521L1899.25 3518.38H1903.18H1905.8L1907.11 3517.07V3514.45L1913.66 3524.93V3527.55L1908.42 3532.78H1907.11V3536.71L1908.42 3538.02L1909.73 3539.33L1911.04 3540.64L1914.97 3549.81L1917.59 3553.73L1921.52 3551.12V3547.19L1920.21 3534.09L1921.52 3528.86L1922.83 3527.55H1925.45L1926.76 3526.24L1932 3523.62Z" fill="#568AC4" fill-opacity="0.05"/>
</svg>
