<svg width="24" height="24" viewBox="0 0 24 24" fill="none" xmlns="http://www.w3.org/2000/svg">
<path d="M19.071 4.92893C22.9763 8.83417 22.9763 15.1658 19.071 19.071C15.1658 22.9763 8.83413 22.9763 4.92893 19.071C1.02369 15.1658 1.02369 8.83413 4.92893 4.92893C8.83417 1.02369 15.1658 1.02369 19.071 4.92893" stroke="#323232" stroke-width="1.5" stroke-linecap="round" stroke-linejoin="round"/>
<path d="M9.26992 6.54492H14.7299C16.2339 6.54492 17.4539 7.76392 17.4539 9.26992V14.7299C17.4539 16.2339 16.2349 17.4539 14.7289 17.4539H9.26992C7.76492 17.4539 6.54492 16.2349 6.54492 14.7289V9.26992C6.54492 7.76492 7.76492 6.54492 9.26992 6.54492V6.54492Z" stroke="#323232" stroke-width="1.5" stroke-linecap="round" stroke-linejoin="round"/>
<path d="M15.0002 8.9502C14.9722 8.9502 14.9502 8.9732 14.9502 9.0002C14.9502 9.0272 14.9722 9.0502 15.0002 9.0502C15.0282 9.0502 15.0502 9.0282 15.0502 9.0002C15.0502 8.9732 15.0272 8.9502 15.0002 8.9502Z" stroke="#323232" stroke-width="1.5" stroke-linecap="round" stroke-linejoin="round"/>
<path d="M13.4142 10.5857C14.1952 11.3668 14.1952 12.6327 13.4142 13.4137C12.6332 14.1947 11.3672 14.1947 10.5862 13.4137C9.80524 12.6327 9.80524 11.3668 10.5862 10.5857C11.3672 9.80475 12.6332 9.80475 13.4142 10.5857Z" stroke="#323232" stroke-width="1.5" stroke-linecap="round" stroke-linejoin="round"/>
</svg>
