<svg width="16" height="16" viewBox="0 0 16 16" fill="none" xmlns="http://www.w3.org/2000/svg">
<g clip-path="url(#clip0)">
<path d="M8 10C9.10457 10 10 9.10457 10 8C10 6.89543 9.10457 6 8 6C6.89543 6 6 6.89543 6 8C6 9.10457 6.89543 10 8 10Z" stroke="#C2CFE0" stroke-width="1.5" stroke-miterlimit="10" stroke-linecap="square"/>
<path d="M14.5076 6.87611L13.3471 6.73111C13.212 6.16082 12.986 5.61601 12.6776 5.11761L13.3966 4.19311C13.5665 3.97525 13.651 3.70278 13.634 3.42701C13.617 3.15123 13.4998 2.89118 13.3044 2.6958C13.1091 2.50043 12.849 2.38322 12.5732 2.36624C12.2974 2.34926 12.025 2.43368 11.8071 2.60361L10.8826 3.32261C10.3842 3.01426 9.83941 2.7882 9.26911 2.65311L9.12411 1.49261C9.09219 1.21663 8.95994 0.962005 8.75251 0.777182C8.54507 0.59236 8.27694 0.490234 7.99911 0.490234C7.72129 0.490234 7.45316 0.59236 7.24572 0.777182C7.03829 0.962005 6.90604 1.21663 6.87411 1.49261L6.72911 2.65311C6.15882 2.7882 5.61401 3.01426 5.11561 3.32261L4.19311 2.60361C3.97525 2.43368 3.70278 2.34926 3.42701 2.36624C3.15123 2.38322 2.89118 2.50043 2.6958 2.6958C2.50043 2.89118 2.38322 3.15123 2.36624 3.42701C2.34926 3.70278 2.43368 3.97525 2.60361 4.19311L3.32261 5.11761C3.01426 5.61601 2.7882 6.16082 2.65311 6.73111L1.49261 6.87611C1.21663 6.90804 0.962005 7.04029 0.777182 7.24772C0.59236 7.45516 0.490234 7.72329 0.490234 8.00111C0.490234 8.27894 0.59236 8.54707 0.777182 8.75451C0.962005 8.96194 1.21663 9.09419 1.49261 9.12611L2.65311 9.27111C2.7882 9.84141 3.01426 10.3862 3.32261 10.8846L2.60361 11.8071C2.43368 12.025 2.34926 12.2974 2.36624 12.5732C2.38322 12.849 2.50043 13.1091 2.6958 13.3044C2.89118 13.4998 3.15123 13.617 3.42701 13.634C3.70278 13.651 3.97525 13.5665 4.19311 13.3966L5.11761 12.6776C5.61601 12.986 6.16082 13.212 6.73111 13.3471L6.87611 14.5076C6.90804 14.7836 7.04029 15.0382 7.24772 15.223C7.45516 15.4079 7.72329 15.51 8.00111 15.51C8.27894 15.51 8.54707 15.4079 8.75451 15.223C8.96194 15.0382 9.09419 14.7836 9.12611 14.5076L9.27111 13.3471C9.84141 13.212 10.3862 12.986 10.8846 12.6776L11.8091 13.3966C12.027 13.5665 12.2994 13.651 12.5752 13.634C12.851 13.617 13.1111 13.4998 13.3064 13.3044C13.5018 13.1091 13.619 12.849 13.636 12.5732C13.653 12.2974 13.5685 12.025 13.3986 11.8071L12.6796 10.8826C12.988 10.3842 13.214 9.83941 13.3491 9.26911L14.5096 9.12411C14.7856 9.09219 15.0402 8.95994 15.225 8.75251C15.4099 8.54507 15.512 8.27694 15.512 7.99911C15.512 7.72129 15.4099 7.45316 15.225 7.24572C15.0402 7.03829 14.7856 6.90604 14.5096 6.87411L14.5076 6.87611Z" stroke="#C2CFE0" stroke-width="1.5" stroke-miterlimit="10" stroke-linecap="square"/>
</g>
<defs>
<clipPath id="clip0">
<rect width="16" height="16" fill="white"/>
</clipPath>
</defs>
</svg>
