<?xml version="1.0" encoding="UTF-8"?>
<svg width="50px" height="50px" viewBox="0 0 50 50" version="1.1" xmlns="http://www.w3.org/2000/svg" xmlns:xlink="http://www.w3.org/1999/xlink">
    <!-- Generator: Sketch 51.3 (57544) - http://www.bohemiancoding.com/sketch -->
    <title>profile-beauty</title>
    <desc>Created with Sketch.</desc>
    <defs></defs>
    <g id="profile-beauty" stroke="none" stroke-width="1" fill="none" fill-rule="evenodd">
        <g id="Group" transform="translate(3.000000, 2.000000)" fill-rule="nonzero">
            <g id="Group-345" transform="translate(10.161290, 11.612903)" fill="#000000">
                <path d="M12.9683899,15.2100001 C13.3375628,14.7517888 13.7073685,14.2301604 14.0522828,13.6560188 C15.0298775,12.0287224 15.6135105,10.3158655 15.6135105,8.6054453 C15.6135105,6.89549619 15.0298742,5.18272519 14.0522708,3.55525421 C13.7073496,2.98104443 13.3375356,2.45931973 12.9683538,2.00099652 C12.9358812,1.96068317 12.9045304,1.92220814 12.8743848,1.88560553 C12.844266,1.92218811 12.8129439,1.96064083 12.7805017,2.00092965 C12.4114411,2.45925242 12.0417483,2.9809771 11.6969395,3.55518771 C10.7196485,5.18267184 10.1361964,6.89546325 10.1361964,8.6054453 C10.1361964,10.3158984 10.7196452,12.0287758 11.6969275,13.6560853 C12.0417293,14.2302278 12.4114139,14.7518561 12.7804655,15.210067 C12.8129208,15.2503631 12.844255,15.2888218 12.8743848,15.325409 C12.9045414,15.2888018 12.9359042,15.2503208 12.9683899,15.2100001 Z M16.6864418,8.6054453 C16.6864418,10.5357492 16.0417027,12.4279413 14.9720103,14.2085429 C14.6003741,14.8271656 14.2024473,15.3884601 13.8038875,15.8831459 C13.5626539,16.1825611 13.3725643,16.3955013 13.2591249,16.5122848 C13.0484097,16.7292117 12.7001275,16.7291832 12.4894478,16.5122218 C12.3760442,16.3954369 12.1860157,16.1824953 11.9448602,15.8830791 C11.5464307,15.3883928 11.1486341,14.8270982 10.7771202,14.2084764 C9.70778607,12.427888 9.06326508,10.5357163 9.06326508,8.6054453 C9.06326508,6.67564211 9.70778279,4.78358561 10.7771082,3.00283648 C11.1486151,2.38416546 11.5464035,1.82279116 11.9448241,1.32800728 C12.1859721,1.02853443 12.3759929,0.815543778 12.4893884,0.698730037 C12.7000803,0.481686983 13.0484569,0.481658464 13.2591844,0.698667018 C13.3726157,0.815479332 13.5626975,1.02846866 13.8039237,1.32794041 C14.2024744,1.82272385 14.6003931,2.38409812 14.9720223,3.00276998 C16.0417059,4.78353226 16.6864418,6.67560918 16.6864418,8.6054453 Z" id="Stroke-4476"></path>
                <path d="M18.2019407,3.7178919 C17.4583983,4.04392983 16.7146483,4.46268589 16.0229412,4.98135855 C15.9100346,5.06602089 15.7992895,5.15283777 15.6908472,5.24182615 L15.0102229,4.41240948 C15.1308884,4.31339061 15.253953,4.21691608 15.379268,4.12294939 C16.1419071,3.55108874 16.9563853,3.09251036 17.7710711,2.73527659 C18.2625705,2.51975767 18.6490948,2.38465385 18.8793296,2.31953957 C19.1577196,2.24080617 19.4483955,2.39700186 19.5363801,2.67260787 C19.5584463,2.74172893 19.5949682,2.86605305 19.6410702,3.03968729 C19.7168269,3.3250103 19.792335,3.64768678 19.8626928,4.00187167 C20.2077272,5.73879237 20.308156,7.5413055 20.0123896,9.24126115 C19.8735125,10.0394755 19.6489805,10.7886365 19.3298946,11.4790479 C18.7111939,12.8176772 17.7422476,13.9342547 16.5228656,14.8489731 C15.7597159,15.4214493 14.9446897,15.880681 14.1294561,16.238564 C13.6376311,16.4544725 13.2508581,16.589879 13.0204916,16.6551688 L12.7279277,15.6228957 C12.9134032,15.5703288 13.2543536,15.4509644 13.698173,15.2561301 C14.4423467,14.929442 15.1867278,14.5100157 15.8790249,13.9906896 C16.9648743,13.1761405 17.8178096,12.1932496 18.355954,11.0289133 C18.6340061,10.4272874 18.8318254,9.76725425 18.9553379,9.05735026 C19.2252109,7.50622018 19.1317676,5.82908404 18.8103242,4.21092172 C18.7616862,3.96607526 18.7105476,3.73789648 18.6588579,3.52886046 C18.5232147,3.58136596 18.3699558,3.64421851 18.2019407,3.7178919 Z" id="Stroke-4477"></path>
                <path d="M22.8898896,8.07543626 C21.8804519,7.90013184 20.7901248,7.855975 19.7219026,8.02275276 L19.5563947,6.96266379 C20.753661,6.77573881 21.9572824,6.82448392 23.0734728,7.01832759 C23.4472298,7.08323626 23.7253053,7.14907116 23.8846852,7.19517938 C24.1370902,7.26819956 24.2994607,7.51328994 24.2682737,7.77418765 C24.259315,7.84913275 24.2402425,7.98238861 24.2090563,8.16574457 C24.1577592,8.46734073 24.0903482,8.80239828 24.0047704,9.16275125 C23.7601201,10.1929299 23.4180516,11.223753 22.9603924,12.1905526 C22.316692,13.5503623 21.4952891,14.6726542 20.4668842,15.4710937 C19.7641733,16.0162225 18.9674846,16.4064128 18.0968528,16.6576363 C16.5984648,17.0900008 15.0182489,17.089361 13.5358735,16.8316904 C13.1622854,16.7667522 12.8843632,16.700885 12.7250728,16.6547493 L13.0235611,15.6241736 C13.1468505,15.6598822 13.3869326,15.7167814 13.7196182,15.7746098 C15.0553211,16.0067854 16.4804015,16.0073624 17.7993913,15.6267638 C18.5442285,15.4118387 19.2185126,15.0815979 19.8090712,14.6234715 C20.6893683,13.9400208 21.4135464,12.9505681 21.990628,11.73149 C22.4132564,10.8386924 22.7323548,9.87708986 22.9608724,8.91484289 C23.0283757,8.63059837 23.0836693,8.36379482 23.1278555,8.11949537 C23.0549287,8.1050996 22.9754695,8.09029853 22.8898896,8.07543626 Z" id="Stroke-4478"></path>
                <path d="M6.93931426,4.21087168 C6.61774681,5.82872167 6.52406991,7.50541951 6.79350036,9.05613287 C6.91693562,9.76656744 7.11478985,10.4270487 7.39299771,11.0290117 C7.93114618,12.1933569 8.78408152,13.1762478 9.86993092,13.9907969 C10.562228,14.510123 11.3066091,14.9295493 12.0507828,15.2562374 C12.4946022,15.4510717 12.8355526,15.5704361 13.0210281,15.623003 L12.7284642,16.6552761 C12.4980977,16.5899863 12.1113247,16.4545798 11.6194997,16.2386713 C10.8042661,15.8807883 9.98923993,15.4215566 9.2260902,14.8490804 C8.0067082,13.934362 7.03776195,12.8177845 6.4190571,11.4791463 C6.09977671,10.788314 5.87519861,10.0386226 5.73640609,9.23979892 C5.44112558,7.54030494 5.54180492,5.73827221 5.88696883,4.00170517 C5.95741152,3.64729831 6.03301046,3.32441122 6.10885813,3.03889554 C6.15501499,2.86514587 6.19157994,2.74073777 6.21367145,2.67157087 C6.30174189,2.39582876 6.59268783,2.23968064 6.87115766,2.31870382 C7.10159994,2.38409791 7.48851982,2.51967959 7.98053859,2.73580437 C8.79610055,3.09404914 9.61145567,3.55362331 10.3749129,4.12639246 C10.5361652,4.2473689 10.6936622,4.37245714 10.8470918,4.50173328 L10.1557525,5.32224008 C10.0179777,5.20615437 9.87630405,5.09363346 9.73102732,4.98464237 C9.03836814,4.46498809 8.29359856,4.04519939 7.54903581,3.71814183 C7.38058343,3.64414722 7.22694151,3.58102001 7.09098316,3.5282883 C7.03922416,3.73748681 6.98801713,3.96584082 6.93931426,4.21087168 Z" id="Stroke-4479"></path>
                <path d="M13.3947647,15.9823586 C13.4049528,16.0584195 13.4049528,16.0584195 13.4073941,16.0801114 C13.4362159,16.3395076 13.274173,16.5820073 13.0234885,16.6546319 C12.8642291,16.7007703 12.586364,16.7666398 12.2128499,16.8315796 C10.7303711,17.089326 9.15000724,17.0898957 7.65147354,16.6572027 C6.78137004,16.4059652 5.98511685,16.0158751 5.28254731,15.470856 C4.25432885,14.6725612 3.4328276,13.5502912 2.78893492,12.1905045 C2.3311375,11.2237178 1.98889221,10.1929065 1.74404622,9.16273911 C1.65839984,8.80238972 1.59092279,8.46733555 1.53956436,8.16574262 C1.50834101,7.98238918 1.48924093,7.84913569 1.48026642,7.77419286 C1.44902023,7.5132676 1.61138494,7.26811859 1.86381995,7.19507831 C2.0233091,7.14893126 2.3015914,7.08303974 2.6756454,7.01807508 C3.80292929,6.82229154 5.01835422,6.77443535 6.22608909,6.96712746 L6.05704275,8.02665795 C4.9797143,7.85477197 3.87871064,7.89812294 2.85924073,8.07518164 C2.77346798,8.09007842 2.69383898,8.10491377 2.62076732,8.11934187 C2.66500187,8.36362841 2.72034549,8.63041524 2.78789897,8.91464044 C3.01660457,9.87689862 3.3358754,10.8385129 3.75864332,11.7313235 C4.33591788,12.9504246 5.06021295,13.9398992 5.94036038,14.6232338 C6.53083643,15.0812962 7.20474832,15.4114504 7.94911697,15.6263826 C9.26817607,16.0072535 10.6933276,16.0067397 12.0290651,15.774506 C12.3616662,15.7166793 12.6016816,15.6597823 12.7249309,15.6240763 L12.8507902,16.0585151 L13.3947647,15.9823586 Z" id="Stroke-4480"></path>
                <path d="M19.3119046,21.0788079 C19.3119046,21.2760838 19.2036311,21.4574432 19.0299744,21.5510442 C17.9005821,22.1597866 15.177398,22.5637447 12.6060842,22.5637447 C5.86713112,22.5637447 0.535607293,19.958643 0.535607293,16.4287237 C0.535607293,14.8794882 1.61696587,13.4820161 3.5014667,12.4070459 L4.03308589,13.339013 C2.45015779,14.2419579 1.60853857,15.3296077 1.60853857,16.4287237 C1.60853857,19.1568804 6.38509645,21.4908135 12.6060842,21.4908135 C14.8012385,21.4908135 17.1387032,21.1726463 18.2389734,20.735759 L18.2389734,17.7033661 C18.2389734,17.4070843 18.4791572,17.1669004 18.775439,17.1669004 L24.0191854,17.1669004 C23.9747581,15.625806 23.157607,14.3945499 21.6505754,13.4362323 L22.2263054,12.5308504 C24.2047625,13.7889462 25.2406151,15.541858 25.0774423,17.7430255 C25.0566764,18.0231527 24.8233404,18.2398317 24.5424446,18.2398317 L19.3119046,18.2398317 L19.3119046,21.0788079 Z" id="Stroke-4481"></path>
            </g>
            <path d="M22.5,44.5236895 C10.474445,44.5236895 0.725806452,34.775051 0.725806452,22.749496 C0.725806452,10.7239409 10.474445,0.975302419 22.5,0.975302419 C34.525555,0.975302419 44.2741935,10.7239409 44.2741935,22.749496 C44.2741935,34.775051 34.525555,44.5236895 22.5,44.5236895 Z M22.5,43.0720766 C33.7238514,43.0720766 42.8225806,33.9733473 42.8225806,22.749496 C42.8225806,11.5256446 33.7238514,2.42691532 22.5,2.42691532 C11.2761486,2.42691532 2.17741935,11.5256446 2.17741935,22.749496 C2.17741935,33.9733473 11.2761486,43.0720766 22.5,43.0720766 Z" id="Oval-7" fill="#404040"></path>
        </g>
    </g>
</svg>