<?xml version="1.0" encoding="utf-8"?>
<!-- Generator: Adobe Illustrator 24.0.0, SVG Export Plug-In . SVG Version: 6.00 Build 0)  -->
<svg version="1.1" id="Layer_1" xmlns="http://www.w3.org/2000/svg" xmlns:xlink="http://www.w3.org/1999/xlink" x="0px" y="0px"
	 viewBox="0 0 24 24" style="enable-background:new 0 0 24 24;" xml:space="preserve">
<style type="text/css">
	.st0{fill:#404040;}
</style>
<title>Artboard 1</title>
<path id="Stroke-3331" class="st0" d="M8.2,15.8C8.1,16,7.9,16.1,7.7,16c0,0,0,0,0,0c-0.2-0.1-0.3-0.2-0.2-0.4l2.9-8.4
	C10.5,7,10.7,6.9,10.9,7c0.1,0,0.2,0.1,0.2,0.2l2.9,8.4c0.1,0.2,0,0.4-0.2,0.5s-0.4,0-0.5-0.2l-2.6-7.5L8.2,15.8z"/>
<path id="Stroke-3332" class="st0" d="M8.8,13.2c-0.2,0-0.4-0.2-0.4-0.4c0-0.2,0.2-0.3,0.4-0.3h3.8c0.2,0,0.4,0.2,0.4,0.4
	c0,0.2-0.2,0.3-0.4,0.3H8.8z"/>
<path id="Stroke-3333" class="st0" d="M7.2,16.1c-0.2,0-0.4-0.2-0.4-0.4c0-0.2,0.2-0.4,0.4-0.4h1.2c0.2,0,0.4,0.2,0.4,0.4
	c0,0.2-0.1,0.4-0.3,0.4c0,0,0,0-0.1,0H7.2z"/>
<path id="Stroke-3334" class="st0" d="M12.9,16.1c-0.2,0-0.4-0.2-0.4-0.4c0-0.2,0.2-0.4,0.4-0.4h1.2c0.2,0,0.4,0.2,0.4,0.4
	c0,0.2-0.1,0.4-0.3,0.4H12.9z"/>
<path id="Stroke-3335" class="st0" d="M14.1,13.1c0,0.2-0.2,0.3-0.4,0.3c-0.2-0.1-0.3-0.3-0.3-0.5l1-2.8c0.1-0.2,0.3-0.3,0.5-0.2
	c0.1,0,0.2,0.1,0.2,0.2l1.9,5.5c0.1,0.2,0,0.4-0.2,0.5c-0.2,0.1-0.4,0-0.5-0.2l0,0l-1.5-4.6L14.1,13.1z"/>
<path id="Stroke-3336" class="st0" d="M14.4,14c-0.2,0-0.4-0.2-0.4-0.4c0-0.2,0.2-0.4,0.4-0.4H16c0.2,0,0.4,0.2,0.4,0.4
	c0,0.2-0.2,0.4-0.4,0.4H14.4z"/>
<path id="Stroke-3337" class="st0" d="M16.3,16.1c-0.2,0-0.4-0.2-0.4-0.4c0-0.2,0.2-0.4,0.4-0.4h0.8c0.2,0,0.4,0.2,0.4,0.4
	c0,0.2-0.2,0.4-0.4,0.4H16.3z"/>
<path class="st0" d="M19.7,23.5H4.3c-2.1,0-3.8-2.3-3.8-5.2V5.7c0-2.9,1.7-5.2,3.8-5.2h15.4c2.1,0,3.8,2.3,3.8,5.2v12.5
	C23.5,21.2,21.8,23.5,19.7,23.5z M4.3,1.5c-1.5,0-2.8,1.9-2.8,4.2v12.5c0,2.3,1.3,4.2,2.8,4.2h15.4c1.5,0,2.8-1.9,2.8-4.2V5.7
	c0-2.3-1.2-4.2-2.8-4.2H4.3z"/>
</svg>
