<?xml version="1.0" encoding="UTF-8"?>
<svg width="50px" height="50px" viewBox="0 0 50 50" version="1.1" xmlns="http://www.w3.org/2000/svg" xmlns:xlink="http://www.w3.org/1999/xlink">
    <!-- Generator: Sketch 51.3 (57544) - http://www.bohemiancoding.com/sketch -->
    <title>profile-fashion</title>
    <desc>Created with Sketch.</desc>
    <defs></defs>
    <g id="profile-fashion" stroke="none" stroke-width="1" fill="none" fill-rule="evenodd">
        <path d="M25.2221522,46.90562 C13.1965972,46.90562 3.44795867,37.1569814 3.44795867,25.1314264 C3.44795867,13.1058714 13.1965972,3.35723286 25.2221522,3.35723286 C37.2477073,3.35723286 46.9963458,13.1058714 46.9963458,25.1314264 C46.9963458,37.1569814 37.2477073,46.90562 25.2221522,46.90562 Z M25.2221522,45.4540071 C36.4460036,45.4540071 45.5447329,36.3552778 45.5447329,25.1314264 C45.5447329,13.907575 36.4460036,4.80884577 25.2221522,4.80884577 C13.9983009,4.80884577 4.89957157,13.907575 4.89957157,25.1314264 C4.89957157,36.3552778 13.9983009,45.4540071 25.2221522,45.4540071 Z" id="Oval-7" fill="#404040" fill-rule="nonzero"></path>
        <g id="Group-1239" transform="translate(16.512475, 14.129729)" fill="#404040" fill-rule="nonzero">
            <path d="M4.78577885,8.37914172 L1.5358936,9.59784869 C1.28129149,9.69332448 1.00002287,9.54746058 0.931379939,9.28435223 L0.0145717897,5.77022659 C-0.0437837196,5.54654992 0.0735348044,5.31442038 0.288236183,5.22874695 L5.80008678,3.0293242 C6.03522697,2.93549497 6.30190938,3.05005015 6.39573861,3.28519034 C6.48956784,3.52033054 6.37501267,3.78701295 6.13987248,3.88084218 L1.00383048,5.93030405 L1.69012249,8.56086132 L4.88121336,7.36420224 C5.11357684,7.27706594 5.37308873,7.39066326 5.46670548,7.62049239 L6.38351363,9.8712564 C6.43108557,9.98804551 6.42844405,10.1192743 6.37621082,10.2340544 L3.41084752,16.7482544 C3.33554918,16.8901275 3.33995621,17.0608686 3.42204692,17.1973867 C3.50594183,17.336136 3.65426432,17.4199049 3.81548048,17.4199049 L13.6033243,17.4199049 C13.7648733,17.4199049 13.9139518,17.3358514 13.9970979,17.1983432 C14.0801128,17.0602908 14.0847722,16.8895303 13.9975111,16.7233201 L11.0426384,10.234152 C10.9903628,10.1193502 10.9877051,9.98808004 11.0352911,9.8712564 L11.9520993,7.62049239 C12.045716,7.39066326 12.3052279,7.27706594 12.5375914,7.36420224 L15.7286823,8.56086132 L16.414965,5.93033959 L11.3028076,3.89094237 C11.067659,3.79713432 10.9530798,3.53046223 11.0468878,3.29531359 C11.1406959,3.06016494 11.407368,2.94558574 11.6425166,3.03939379 L17.1305302,5.22873165 C17.3452539,5.31439156 17.4625924,5.5465347 17.404233,5.77022659 L16.4874248,9.28435223 C16.4187819,9.54746058 16.1375133,9.69332448 15.8829112,9.59784869 L12.6330259,8.37914172 L11.958905,10.0341085 L14.8196081,16.3184485 C15.0454948,16.744052 15.0314924,17.2572223 14.7822167,17.671761 C14.5324247,18.0848785 14.0857677,18.3367131 13.6033243,18.3367131 L3.81548048,18.3367131 C3.33311793,18.3367131 2.88733881,18.0849479 2.63692815,17.6708046 C2.3883122,17.2573604 2.37506682,16.7441966 2.58870599,16.3434804 L5.45991158,10.0341376 L4.78577885,8.37914172 Z" id="Stroke-2298"></path>
            <path d="M7.20646008,0.917724958 L6.41853069,3.28151314 C6.49005257,6.20334395 10.9293023,6.20334395 11.0008241,3.28151314 L10.2128948,0.917724958 L7.20646008,0.917724958 Z M6.87606112,0.00091680815 L10.5432937,0.00091680815 C10.7406048,0.00091680815 10.9157788,0.127175086 10.978174,0.314360786 L11.8949822,3.06478523 L11.9185059,3.20974533 C11.9185059,7.44967742 5.5008489,7.44967742 5.5008489,3.20974533 L5.52437268,3.06478523 L6.44118083,0.314360786 C6.50357606,0.127175086 6.67875007,0.00091680815 6.87606112,0.00091680815 Z" id="Stroke-2299"></path>
            <path d="M8.25127334,17.8786757 C8.25127334,17.6255061 8.45650784,17.4202716 8.70967742,17.4202716 C8.962847,17.4202716 9.16808149,17.6255061 9.16808149,17.8786757 L9.16808149,21.5459083 C9.16808149,21.7990779 8.962847,22.0043124 8.70967742,22.0043124 C8.45650784,22.0043124 8.25127334,21.7990779 8.25127334,21.5459083 L8.25127334,17.8786757 Z" id="Stroke-2300"></path>
            <path d="M1.8336163,22.0043124 C1.58044672,22.0043124 1.37521222,21.7990779 1.37521222,21.5459083 C1.37521222,21.2927387 1.58044672,21.0875042 1.8336163,21.0875042 L15.5857385,21.0875042 C15.8389081,21.0875042 16.0441426,21.2927387 16.0441426,21.5459083 C16.0441426,21.7990779 15.8389081,22.0043124 15.5857385,22.0043124 L1.8336163,22.0043124 Z" id="Stroke-2301"></path>
        </g>
    </g>
</svg>