<?xml version="1.0" encoding="utf-8"?>
<!-- Generator: Adobe Illustrator 24.0.0, SVG Export Plug-In . SVG Version: 6.00 Build 0)  -->
<svg version="1.1" id="Layer_1" xmlns="http://www.w3.org/2000/svg" xmlns:xlink="http://www.w3.org/1999/xlink" x="0px" y="0px"
	 viewBox="0 0 24 24" style="enable-background:new 0 0 24 24;" xml:space="preserve">
<style type="text/css">
	.st0{fill:#404040;}
</style>
<title>Artboard 1</title>
<path class="st0" d="M6,17.5H5.8c-0.2-0.1-0.3-0.3-0.3-0.5v-3.1H5.1C2.8,13.9,1,12,1,9.7c0,0,0,0,0,0V6.1C1,3.9,2.8,2,5,2
	c0,0,0.1,0,0.1,0h9.2c2.3,0,4.1,1.8,4.2,4.1v3.6c0,2.3-1.9,4.1-4.2,4.1c0,0,0,0,0,0h-3.9l-4,3.5C6.3,17.5,6.2,17.5,6,17.5z M5.1,3
	C3.4,3,2,4.4,2,6.1v3.6c0,1.7,1.4,3.1,3.2,3.1c0,0,0,0,0,0H6c0.3,0,0.5,0.2,0.5,0.4c0,0,0,0,0,0.1v2.5L9.8,13
	c0.1-0.1,0.2-0.1,0.3-0.1h4.1c1.7,0,3.1-1.4,3.2-3.1V6.1c0-1.7-1.3-3.1-3-3.1c0,0-0.1,0-0.1,0H5.1z"/>
<path class="st0" d="M18.9,22c-0.1,0-0.3,0-0.4-0.1l-2.6-2.6h-2.1c-1.5,0-2.8-1.3-2.8-2.8c0-0.3,0.2-0.5,0.5-0.5s0.5,0.2,0.5,0.5
	c0,1,0.8,1.8,1.8,1.8c0,0,0,0,0,0h2.3c0.1,0,0.3,0.1,0.4,0.1l1.9,1.9v-1.5c0-0.3,0.2-0.5,0.4-0.5c0,0,0,0,0.1,0h1.4
	c1,0,1.8-0.8,1.8-1.8c0,0,0,0,0,0v-1.8c0-1-0.8-1.8-1.8-1.8c0,0,0,0,0,0c-0.3,0-0.5-0.2-0.5-0.4c0,0,0,0,0-0.1
	c0-0.2,0.1-0.4,0.3-0.4c0,0,0,0,0.1,0c1.5,0,2.8,1.3,2.8,2.8c0,0,0,0,0,0v1.8c0,1.5-1.3,2.8-2.8,2.8h-0.9v2.2c0,0.2-0.1,0.4-0.3,0.5
	C19,22,19,22,18.9,22L18.9,22z"/>
</svg>
