<?xml version="1.0" encoding="UTF-8"?>
<svg width="50px" height="50px" viewBox="0 0 50 50" version="1.1" xmlns="http://www.w3.org/2000/svg" xmlns:xlink="http://www.w3.org/1999/xlink">
    <!-- Generator: Sketch 51.3 (57544) - http://www.bohemiancoding.com/sketch -->
    <title>blog</title>
    <desc>Created with Sketch.</desc>
    <defs></defs>
    <g id="blog" stroke="none" stroke-width="1" fill="none" fill-rule="evenodd">
        <g transform="translate(0.000000, 1.000000)" fill-rule="nonzero" id="Combined-Shape">
            <path d="M46.0514706,9.08105747 C46.0514706,5.96107187 43.1153274,3.06371051 39.9338235,3.06371051 L9.81617647,3.06371051 C6.63467264,3.06371051 3.69852941,5.96107187 3.69852941,9.08105747 L3.69852941,38.7945327 C3.69852941,41.9145835 6.63473933,44.8118797 9.81667843,44.8118797 L39.9338235,44.8118797 C43.1153274,44.8118797 46.0514706,41.9145183 46.0514706,38.7945327 L46.0514706,9.08105747 Z M48.875,9.08105747 L48.875,38.7945327 C48.875,43.482376 44.6663777,47.6354091 39.9338235,47.6354091 L9.81667843,47.6354091 C5.0837172,47.6354091 0.875,43.4824702 0.875,38.7945327 L0.875,9.08105747 C0.875,4.39321412 5.08362235,0.240181097 9.81617647,0.240181097 L39.9338235,0.240181097 C44.6663777,0.240181097 48.875,4.39321412 48.875,9.08105747 Z" fill="#333333"></path>
            <path d="M34.5273825,32.0677797 L33.4866837,29.020148 L30.4466706,29.020148 C29.9788529,29.020148 29.5996118,28.6409069 29.5996118,28.1730892 C29.5996118,27.7052715 29.9788529,27.3260304 30.4466706,27.3260304 L32.9081799,27.3260304 L31.3731496,22.8307752 L29.9526269,27.0032597 C29.8018564,27.4461159 29.3206269,27.6828983 28.8777707,27.5321278 C28.4349144,27.3813574 28.1981321,26.9001279 28.3489026,26.4572716 L30.570079,19.9330363 C30.8305395,19.1679888 31.9123868,19.1674907 32.1735516,19.9322981 L34.8848739,27.8722622 C34.891636,27.890057 34.8978156,27.9081387 34.9033895,27.9264841 L36.3053027,32.0319127 L36.6393294,32.0319127 C37.1071471,32.0319127 37.4863882,32.4111539 37.4863882,32.8789716 C37.4863882,33.3467892 37.1071471,33.7260304 36.6393294,33.7260304 L35.7190832,33.7260304 C35.7059307,33.7263385 35.6928058,33.7263369 35.6797181,33.7260304 L34.7720353,33.7260304 C34.3042176,33.7260304 33.9249765,33.3467892 33.9249765,32.8789716 C33.9249765,32.4962157 34.1788433,32.1727535 34.5273825,32.0677797 Z M29.2262522,32.0319127 L30.0519412,32.0319127 C30.5197588,32.0319127 30.899,32.4111539 30.899,32.8789716 C30.899,33.3467892 30.5197588,33.7260304 30.0519412,33.7260304 L28.6400243,33.7260304 C28.6268718,33.7263385 28.6137469,33.7263369 28.6006592,33.7260304 L27.2086471,33.7260304 C26.7408294,33.7260304 26.3615882,33.3467892 26.3615882,32.8789716 C26.3615882,32.4111539 26.7408294,32.0319127 27.2086471,32.0319127 L27.4360922,32.0319127 L25.76493,27.1377951 L18.3130264,27.1377951 L16.6468777,32.0319127 L16.8947647,32.0319127 C17.3625824,32.0319127 17.7418235,32.4111539 17.7418235,32.8789716 C17.7418235,33.3467892 17.3625824,33.7260304 16.8947647,33.7260304 L15.4834626,33.7260304 C15.470376,33.7263368 15.4572531,33.7263384 15.4441026,33.7260304 L14.0514706,33.7260304 C13.5836529,33.7260304 13.2044118,33.3467892 13.2044118,32.8789716 C13.2044118,32.4111539 13.5836529,32.0319127 14.0514706,32.0319127 L14.8572778,32.0319127 L16.8920177,26.0551012 C16.8993327,26.0297913 16.9077965,26.004969 16.9173487,25.9806942 L21.2303116,13.3118678 C21.4907677,12.5468085 22.5726324,12.546312 22.8337905,13.3111321 L27.1612145,25.9843025 C27.1695441,26.0057596 27.1770246,26.0276404 27.1836149,26.0499035 L29.2262522,32.0319127 Z M25.1864509,25.4436774 L22.0333809,16.2096868 L18.8897701,25.4436774 L25.1864509,25.4436774 Z" fill="#404040"></path>
        </g>
    </g>
</svg>