<?xml version="1.0" encoding="utf-8"?>
<!-- Generator: Adobe Illustrator 24.0.0, SVG Export Plug-In . SVG Version: 6.00 Build 0)  -->
<svg version="1.1" id="Layer_1" xmlns="http://www.w3.org/2000/svg" xmlns:xlink="http://www.w3.org/1999/xlink" x="0px" y="0px"
	 viewBox="0 0 24 24" style="enable-background:new 0 0 24 24;" xml:space="preserve">
<style type="text/css">
	.st0{fill:#404040;}
</style>
<title>Artboard 1</title>
<path class="st0" d="M21,19.6H3.1c-0.3,0-0.5-0.2-0.5-0.5s0.2-0.5,0.5-0.5H21c0.3,0,0.5,0.2,0.5,0.5S21.3,19.6,21,19.6z M21,14.4
	H3.1c-0.3,0-0.5-0.2-0.5-0.5s0.2-0.5,0.5-0.5H21c0.3,0,0.5,0.2,0.5,0.5S21.3,14.4,21,14.4z M21,9.3H3.1c-0.3,0-0.5-0.2-0.5-0.5
	s0.2-0.5,0.5-0.5H21c0.3,0,0.5,0.2,0.5,0.5S21.3,9.3,21,9.3z M21,4.1H3.1c-0.3,0-0.5-0.2-0.5-0.4c0,0,0,0,0-0.1
	c0-0.3,0.2-0.5,0.4-0.5c0,0,0,0,0.1,0H21c0.3,0,0.5,0.2,0.5,0.4c0,0,0,0,0,0.1C21.5,3.9,21.3,4.1,21,4.1C21,4.1,21,4.1,21,4.1z"/>
</svg>
