<?xml version="1.0" encoding="UTF-8"?>
<svg width="50px" height="50px" viewBox="0 0 50 50" version="1.1" xmlns="http://www.w3.org/2000/svg" xmlns:xlink="http://www.w3.org/1999/xlink">
    <!-- Generator: Sketch 51.3 (57544) - http://www.bohemiancoding.com/sketch -->
    <title>facebook</title>
    <desc>Created with Sketch.</desc>
    <defs></defs>
    <g id="facebook" stroke="none" stroke-width="1" fill="none" fill-rule="evenodd">
        <g id="Facebook" transform="translate(1.000000, 1.000000)" fill="#404040" fill-rule="nonzero">
            <path d="M45.1764706,8.94167843 C45.1764706,5.76443258 42.2360992,2.82352941 39.0588235,2.82352941 L8.94117647,2.82352941 C5.76390077,2.82352941 2.82352941,5.76443258 2.82352941,8.94167843 L2.82352941,39.0583216 C2.82352941,42.2356339 5.76396725,45.1764706 8.94167843,45.1764706 L39.0588235,45.1764706 C42.2360992,45.1764706 45.1764706,42.2355674 45.1764706,39.0583216 L45.1764706,8.94167843 Z M48,8.94167843 L48,39.0583216 C48,43.7948454 43.7956058,48 39.0588235,48 L8.94167843,48 C4.20448928,48 0,43.7949404 0,39.0583216 L0,8.94167843 C0,4.20515464 4.20439421,0 8.94117647,0 L39.0588235,0 C43.7956058,0 48,4.20515464 48,8.94167843 Z" id="Combined-Shape"></path>
            <path d="M22.95,46 L22.95,30.8378378 L18,30.8378378 L18,24.1486486 L22.95,24.1486486 L22.95,21.5425405 C22.95,17.0478514 26.35605,13 30.54375,13 L36,13 L36,19.6891892 L30.54375,19.6891892 C29.9466,19.6891892 29.25,20.4076081 29.25,21.4836757 L29.25,24.1486486 L36,24.1486486 L36,30.8378378 L29.25,30.8378378 L29.25,46 L22.95,46 Z" id="Mask"></path>
        </g>
    </g>
</svg>