<?xml version="1.0" encoding="UTF-8"?>
<svg width="50px" height="50px" viewBox="0 0 50 50" version="1.1" xmlns="http://www.w3.org/2000/svg" xmlns:xlink="http://www.w3.org/1999/xlink">
    <!-- Generator: Sketch 51.3 (57544) - http://www.bohemiancoding.com/sketch -->
    <title>add</title>
    <desc>Created with Sketch.</desc>
    <defs></defs>
    <g id="add" stroke="none" stroke-width="1" fill="none" fill-rule="evenodd">
        <g fill="#000000" fill-rule="nonzero" id="Combined-Shape">
            <path d="M0,0 L50,0 L50,50 L0,50 L0,0 Z M24.188,24.032 L16.7,24.032 L16.7,26.624 L24.188,26.624 L24.188,34.04 L26.852,34.04 L26.852,26.624 L34.34,26.624 L34.34,24.032 L26.852,24.032 L26.852,16.616 L24.188,16.616 L24.188,24.032 Z"></path>
        </g>
    </g>
</svg>