<?xml version="1.0" encoding="utf-8"?>
<!-- Generator: Adobe Illustrator 24.0.0, SVG Export Plug-In . SVG Version: 6.00 Build 0)  -->
<svg version="1.1" id="Layer_1" xmlns="http://www.w3.org/2000/svg" xmlns:xlink="http://www.w3.org/1999/xlink" x="0px" y="0px"
	 viewBox="0 0 24 24" style="enable-background:new 0 0 24 24;" xml:space="preserve">
<style type="text/css">
	.st0{fill:#404040;}
</style>
<title>Password Lock 24x24</title>
<desc>Created with Sketch.</desc>
<path class="st0" d="M12,15.7c-0.5,0-0.9-0.4-0.9-1s0.4-1,0.9-1s0.9,0.4,0.9,1S12.5,15.7,12,15.7z M11.9,14.8
	C11.9,14.8,12,14.8,11.9,14.8L11.9,14.8z"/>
<path class="st0" d="M12,18.5c-0.3,0-0.5-0.2-0.5-0.5v-2.8c0-0.3,0.2-0.5,0.5-0.5s0.5,0.2,0.5,0.5V18C12.5,18.2,12.3,18.5,12,18.5z"
	/>
<path class="st0" d="M19.6,23H4.4c-0.3,0-0.5-0.2-0.5-0.5V9.7c0-0.3,0.2-0.5,0.5-0.5h15.1c0.3,0,0.5,0.2,0.5,0.5v12.8
	C20.1,22.8,19.8,23,19.6,23z M4.9,22h14.1V10.2H4.9V22z"/>
<path class="st0" d="M16.9,10.2c-0.3,0-0.5-0.2-0.5-0.5V6.5C16.4,4,14.4,2,12,2S7.6,4,7.6,6.5C7.6,6.8,7.4,7,7.1,7S6.6,6.8,6.6,6.5
	C6.6,3.4,9,1,12,1c3,0,5.4,2.5,5.4,5.5v3.2C17.4,10,17.2,10.2,16.9,10.2z"/>
</svg>
