<?xml version="1.0" encoding="utf-8"?>
<!-- Generator: Adobe Illustrator 24.3.0, SVG Export Plug-In . SVG Version: 6.00 Build 0)  -->
<svg version="1.0" id="Layer_1" xmlns="http://www.w3.org/2000/svg" xmlns:xlink="http://www.w3.org/1999/xlink" x="0px" y="0px"
	 viewBox="0 0 54 72" style="enable-background:new 0 0 54 72;" xml:space="preserve">
<g>
	<path d="M35,0H0v72h54V19L35,0z M49,18H36V5L49,18z M51,69H3V3h29.8L33,3.2V21h17.8l0.2,0.2V69z"/>
	<path d="M44.7,39.5c-1.4-0.9-3.2-1.4-5.1-1.2c-2.9,0.2-5.7,0.7-8.2,1.4c-2.9-1.7-5.8-3.9-8.1-6.5c0.2-4.7-0.1-8.6-0.3-10.9
		c-0.1-1.1-0.7-2.2-1.6-2.9c-0.9-0.6-2-0.8-3-0.6c0,0,0,0,0,0c-1,0.3-1.7,0.9-2.1,1.8c-1.3,3.1,1.7,8.9,2.3,10.1
		c0.6,1.2,1.4,2.2,2.2,3.3c-0.2,3.6-0.7,7.5-1.7,11.4c-5.8,4-8.7,8.2-9,8.5c-0.8,1.3-1,2.5-0.8,3.5c0.2,0.6,0.6,1.4,1.7,1.9
		c0.8,0.4,1.8,0.5,2.7,0.3c0.9-0.2,1.7-0.8,2.3-1.6c2.4-3.3,4.1-7.1,5.2-11c2.7-1.8,6-3.5,9.9-4.7c3.6,2,6.9,3.4,9,4.1
		c2.2,0.8,4.7,0,5.9-2C47.2,42.8,46.7,40.9,44.7,39.5z M14.1,56.6c-0.4,0.6-1.3,0.9-1.9,0.6c-0.2-0.1-0.4-0.2-0.4-0.4
		c0-0.1-0.1-0.5,0.4-1.4c0-0.1,1.9-2.7,5.6-5.7C16.9,52.1,15.7,54.5,14.1,56.6z M18.7,21.8c0.1-0.2,0.2-0.3,0.5-0.4
		c0.4-0.1,0.8,0.1,0.9,0.2c0.3,0.2,0.6,0.6,0.6,1.1l0,0c0.1,1.6,0.3,4.2,0.3,7.3c0-0.1-0.1-0.2-0.1-0.2C19.5,27.3,18,23.2,18.7,21.8
		z M22.2,43.7c0.5-2.4,0.8-4.8,1-7c1.6,1.5,3.4,2.9,5.2,4.1C26.1,41.6,24,42.6,22.2,43.7z M44,43.3c-0.6,0.9-1.8,1.3-2.9,0.9
		c-1.5-0.6-3.8-1.5-6.3-2.7c1.6-0.3,3.3-0.6,5.1-0.7c1.3-0.1,2.5,0.2,3.5,0.8C44.5,42.4,44.2,42.9,44,43.3z"/>
</g>
</svg>
