<?xml version="1.0" encoding="utf-8"?>
<!-- Generator: Adobe Illustrator 24.0.0, SVG Export Plug-In . SVG Version: 6.00 Build 0)  -->
<svg version="1.1" id="Layer_1" xmlns="http://www.w3.org/2000/svg" xmlns:xlink="http://www.w3.org/1999/xlink" x="0px" y="0px"
	 viewBox="0 0 24 24" style="enable-background:new 0 0 24 24;" xml:space="preserve">
<style type="text/css">
	.st0{fill:#404040;}
</style>
<title>Artboard 1</title>
<polygon id="Shape" class="st0" points="14.4,7.9 11.9,10.2 9.3,7.9 7.2,9.7 7.2,12.5 11.9,16.6 16.5,12.5 16.5,9.7 "/>
<path id="Shape-2" class="st0" d="M16.6,17.6c-1.3,1.1-3,1.7-4.7,1.7h-0.7l-2.9,2.9c3.1,1.1,6.5,0.7,9.2-1l0,0L16.6,17.6z"/>
<path id="Shape-3" class="st0" d="M14.4,4.9c1.8,0.7,3.2,2,4.1,3.7l0,0l4,1c-0.6-3.1-2.6-5.8-5.4-7.3l0,0L14.4,4.9z"/>
<path id="Shape-4" class="st0" d="M19.1,10.4c0.1,0.5,0.1,1,0.1,1.4c0,1.4-0.4,2.7-1.1,3.9l0,0c-0.1,0.2-0.2,0.3-0.3,0.5l1,3.9
	c0.2-0.2,0.4-0.4,0.7-0.6c2-2,3.2-4.8,3.2-7.6v-0.6l0,0L19.1,10.4z"/>
<path id="Shape-5" class="st0" d="M7.1,6.2c1.3-1.1,3-1.7,4.8-1.7c0.3,0,0.5,0,0.8,0l0,0l2.8-2.9c-3.1-1.1-6.6-0.7-9.4,1h0.1
	L7.1,6.2z"/>
<path id="Shape-6" class="st0" d="M9.4,18.9C7.5,18.2,6,16.8,5.2,15l0,0l-3.9-1c0.6,3.2,2.6,6,5.5,7.5h0.1L9.4,18.9z"/>
<path id="Shape-7" class="st0" d="M4.6,13.2c-0.1-0.4-0.1-0.9-0.1-1.3c0-1.4,0.4-2.7,1.1-3.9l0,0c0.1-0.2,0.2-0.3,0.3-0.5L4.8,3.7
	C4.6,3.8,4.4,4,4.2,4.2C2.1,6.2,1,9,1,11.9v0.4l0,0L4.6,13.2z"/>
</svg>
