<?xml version="1.0" encoding="utf-8"?>
<!-- Generator: Adobe Illustrator 24.0.2, SVG Export Plug-In . SVG Version: 6.00 Build 0)  -->
<svg version="1.1" id="Layer_1" xmlns="http://www.w3.org/2000/svg" xmlns:xlink="http://www.w3.org/1999/xlink" x="0px" y="0px"
	 viewBox="0 0 50 50" style="enable-background:new 0 0 50 50;" xml:space="preserve">
<g>
	<polygon points="34.5,7.8 29.7,12.4 29.7,0.2 27.5,0.2 27.5,12.4 22.8,7.8 21.3,9.4 28.6,16.5 36,9.4 	"/>
	<path d="M40.8,49.8c-2.4,0-4.4-1.9-4.4-4.3c0-2.4,2-4.3,4.4-4.3c2.4,0,4.4,1.9,4.4,4.3C45.2,47.9,43.2,49.8,40.8,49.8z M40.8,43.5
		c-1.2,0-2.2,0.9-2.2,2.1c0,1.1,1,2.1,2.2,2.1c1.2,0,2.2-0.9,2.2-2.1C43,44.4,42,43.5,40.8,43.5z"/>
	<path d="M16.5,49.8c-2.4,0-4.4-1.9-4.4-4.3c0-2.4,2-4.3,4.4-4.3s4.4,1.9,4.4,4.3C20.9,47.9,19,49.8,16.5,49.8z M16.5,43.5
		c-1.2,0-2.2,0.9-2.2,2.1c0,1.1,1,2.1,2.2,2.1s2.2-0.9,2.2-2.1C18.7,44.4,17.7,43.5,16.5,43.5z"/>
	<path d="M50,18.1H11.6L8.4,5.4H0v2.2h6.6l8.6,33.7h24.4v-2.1h3.4L50,18.1z M16.4,37l-4.3-16.8H47L41.5,37H16.4z"/>
</g>
</svg>
