<?xml version="1.0" encoding="utf-8"?>
<!-- Generator: Adobe Illustrator 24.0.2, SVG Export Plug-In . SVG Version: 6.00 Build 0)  -->
<svg version="1.1" id="Layer_1" xmlns="http://www.w3.org/2000/svg" xmlns:xlink="http://www.w3.org/1999/xlink" x="0px" y="0px"
	 viewBox="0 0 50 50" style="enable-background:new 0 0 50 50;" xml:space="preserve">
<g id="Stroke-309">
	<path d="M37,50H19.7l-8.2-13c-0.7-1.2-1.1-3.2-0.4-4.5c0.5-0.8,1.3-1.3,2.3-1.3c2.1,0,4,0.9,6.8,4.8V16.7c0-2.3,1.8-4.2,4-4.2
		c2.2,0,4,1.9,4,4.2v11.7l8,2.9c2.6,0.9,3.4,3.9,2.8,6.5L37,50z M20.9,47.8h14.3L37,37.3c0.4-1.6,0-3.5-1.4-4l-9.4-3.4V16.7
		c0-1.1-0.8-2-1.9-2c-1,0-1.9,0.9-1.9,2v26.7l-2-3.3c-3.8-6.2-5.5-6.8-7-6.8c-0.3,0-0.3,0.1-0.4,0.2c-0.3,0.5-0.1,1.6,0.3,2.3
		L20.9,47.8z"/>
</g>
<g id="Stroke-310">
	<path d="M40.2,16.7h-6.1c-0.6,0-1.1-0.5-1.1-1.1c0-0.6,0.5-1.1,1.1-1.1h6.1c0.6,0,1.1,0.5,1.1,1.1C41.3,16.2,40.8,16.7,40.2,16.7z"
		/>
</g>
<g id="Stroke-311">
	<path d="M32.1,10.5c-0.3,0-0.5-0.1-0.8-0.3c-0.4-0.4-0.4-1.1,0-1.5l4.1-4.2c0.4-0.4,1.1-0.4,1.5,0c0.4,0.4,0.4,1.1,0,1.5l-4.1,4.2
		C32.7,10.4,32.4,10.5,32.1,10.5z"/>
</g>
<g id="Stroke-312">
	<path d="M26,8.4c-0.6,0-1.1-0.5-1.1-1.1V1.1C24.9,0.5,25.4,0,26,0c0.6,0,1.1,0.5,1.1,1.1v6.2C27.1,7.9,26.6,8.4,26,8.4z"/>
</g>
<g id="Stroke-313">
	<path d="M17.9,10.5c-0.3,0-0.6-0.1-0.8-0.3L13.1,6c-0.4-0.4-0.4-1.1,0-1.5c0.4-0.4,1.1-0.4,1.5,0l4.1,4.2c0.4,0.4,0.4,1.1,0,1.5
		C18.4,10.4,18.2,10.5,17.9,10.5z"/>
</g>
<g id="Stroke-314">
	<path d="M15.9,16.7H9.8c-0.6,0-1.1-0.5-1.1-1.1c0-0.6,0.5-1.1,1.1-1.1h6.1c0.6,0,1.1,0.5,1.1,1.1C17,16.2,16.5,16.7,15.9,16.7z"/>
</g>
</svg>
