<?xml version="1.0" encoding="UTF-8"?>
<svg width="50px" height="50px" viewBox="0 0 50 50" version="1.1" xmlns="http://www.w3.org/2000/svg" xmlns:xlink="http://www.w3.org/1999/xlink">
    <!-- Generator: Sketch 51.3 (57544) - http://www.bohemiancoding.com/sketch -->
    <title>circle-bold</title>
    <desc>Created with Sketch.</desc>
    <defs></defs>
    <g id="circle-bold" stroke="none" stroke-width="1" fill="none" fill-rule="evenodd">
        <path d="M25.5,0 C11.969,0 1,10.969 1,24.5 C1,38.031 11.969,49 25.5,49 C39.031,49 50,38.031 50,24.5 C50,10.969 39.031,0 25.5,0 M25.5,8 C34.598,8 42,15.402 42,24.5 C42,33.598 34.598,41 25.5,41 C16.402,41 9,33.598 9,24.5 C9,15.402 16.402,8 25.5,8" id="Fill-1" fill="#404040"></path>
    </g>
</svg>