<?xml version="1.0" encoding="UTF-8"?>
<svg width="50px" height="50px" viewBox="0 0 50 50" version="1.1" xmlns="http://www.w3.org/2000/svg" xmlns:xlink="http://www.w3.org/1999/xlink">
    <!-- Generator: Sketch 51.3 (57544) - http://www.bohemiancoding.com/sketch -->
    <title>checkbox-selected</title>
    <desc>Created with Sketch.</desc>
    <defs></defs>
    <g id="checkbox-selected" stroke="none" stroke-width="1" fill="none" fill-rule="evenodd">
        <path d="M0,50 L50,50 L50,0 L0,0 L0,50 Z M39.811,10.283 L44.053,14.526 L18.86,39.717 L18.122,38.995 L5.947,26.82 L10.189,22.578 L18.852,31.241 L39.811,10.283 Z" id="Fill-1" fill="#404040"></path>
    </g>
</svg>