<?xml version="1.0" encoding="utf-8"?>
<!-- Generator: Adobe Illustrator 24.0.0, SVG Export Plug-In . SVG Version: 6.00 Build 0)  -->
<svg version="1.1" id="Layer_1" xmlns="http://www.w3.org/2000/svg" xmlns:xlink="http://www.w3.org/1999/xlink" x="0px" y="0px"
	 viewBox="0 0 24 24" style="enable-background:new 0 0 24 24;" xml:space="preserve">
<style type="text/css">
	.st0{fill:#404040;}
</style>
<title>Artboard 1</title>
<path class="st0" d="M22.5,23h-21c-0.3-0.1-0.4-0.2-0.5-0.5v-21C1.1,1.2,1.2,1.1,1.5,1h20.9c0.3,0,0.5,0.2,0.6,0.5v20.9
	C23,22.7,22.8,22.9,22.5,23z M2,22h20V2H2V22z"/>
<path class="st0" d="M19.7,18.5c-0.2,0-0.4-0.1-0.5-0.3l-3-7.9l-3.9,5.8c-0.2,0.2-0.5,0.3-0.7,0.1c0,0-0.1-0.1-0.1-0.1l-2.3-2.8
	l-2.9,4.9c-0.2,0.2-0.4,0.3-0.7,0.2c-0.2-0.2-0.3-0.4-0.2-0.7l3.3-5.5c0.2-0.2,0.5-0.3,0.7-0.1c0,0,0.1,0.1,0.1,0.1L12,15l4-6
	c0.1-0.2,0.3-0.2,0.5-0.2s0.3,0.1,0.4,0.3l3.3,8.8c0.1,0.2,0,0.5-0.2,0.6c0,0-0.1,0-0.1,0L19.7,18.5z"/>
<path class="st0" d="M7.6,8.6c-1.2,0-2.1-0.9-2.1-2.1c0-1.1,1-2.1,2.1-2.1c1.1,0,2.1,1,2.1,2.1C9.7,7.7,8.8,8.6,7.6,8.6z M7.6,5.4
	C7,5.4,6.5,5.9,6.5,6.5S7,7.6,7.6,7.6s1.1-0.5,1.1-1.1v0C8.7,5.9,8.2,5.4,7.6,5.4z"/>
<path class="st0" d="M22.5,18.5h-21C1.2,18.5,1,18.3,1,18c0-0.3,0.2-0.5,0.4-0.5c0,0,0,0,0.1,0h20.9c0.3,0,0.5,0.2,0.5,0.4
	c0,0,0,0,0,0.1C22.9,18.2,22.7,18.5,22.5,18.5z"/>
</svg>
