<?xml version="1.0" encoding="utf-8"?>
<!-- Generator: Adobe Illustrator 24.0.0, SVG Export Plug-In . SVG Version: 6.00 Build 0)  -->
<svg version="1.1" id="Layer_1" xmlns="http://www.w3.org/2000/svg" xmlns:xlink="http://www.w3.org/1999/xlink" x="0px" y="0px"
	 viewBox="0 0 24 24" style="enable-background:new 0 0 24 24;" xml:space="preserve">
<style type="text/css">
	.st0{fill:none;}
	.st1{fill-rule:evenodd;clip-rule:evenodd;fill:#404040;}
	.st2{fill:#FFFFFF;}
</style>
<title>Artboard 1</title>
<rect id="Rectangle" class="st0" width="24" height="24"/>
<polygon id="Stroke-2764" class="st1" points="1.5,22.5 22.5,22.5 22.5,1.5 1.5,1.5 "/>
<path class="st2" d="M9.7,16.2c-0.3,0-0.5-0.1-0.7-0.3l-2.3-2.3c-0.4-0.3-0.5-1-0.2-1.4s1-0.5,1.4-0.2C8,12.1,8,12.1,8.1,12.2
	l1.6,1.6L15.9,8c0.3-0.4,1-0.5,1.4-0.2c0.4,0.3,0.5,1,0.2,1.4c-0.1,0.1-0.1,0.1-0.2,0.2l-6.9,6.4C10.3,16.1,10,16.2,9.7,16.2z"/>
</svg>
