<?xml version="1.0" encoding="UTF-8"?>
<svg width="18px" height="18px" viewBox="0 0 18 18" version="1.1" xmlns="http://www.w3.org/2000/svg" xmlns:xlink="http://www.w3.org/1999/xlink">
    <!-- Generator: Sketch 62 (91390) - https://sketch.com -->
    <title>Group 51 Copy</title>
    <desc>Created with Sketch.</desc>
    <g id="Versions" stroke="none" stroke-width="1" fill="none" fill-rule="evenodd" opacity="0.5" stroke-linecap="round" stroke-linejoin="round">
        <g id="Group-51-Copy" transform="translate(1.000000, 1.000000)" stroke="#000000">
            <g id="Group-929-Copy">
                <polygon id="Stroke-4447" points="0 3.2 3.2 3.2 3.2 0 0 0"></polygon>
                <polygon id="Stroke-4448" points="0 9.6 3.2 9.6 3.2 6.4 0 6.4"></polygon>
                <polygon id="Stroke-4449" points="0 16 3.2 16 3.2 12.8 0 12.8"></polygon>
            </g>
            <g id="Group-929-Copy-2" transform="translate(6.400000, 0.000000)">
                <polygon id="Stroke-4447" points="0 3.2 3.2 3.2 3.2 0 0 0"></polygon>
                <polygon id="Stroke-4448" points="0 9.6 3.2 9.6 3.2 6.4 0 6.4"></polygon>
                <polygon id="Stroke-4449" points="0 16 3.2 16 3.2 12.8 0 12.8"></polygon>
            </g>
            <g id="Group-929-Copy-3" transform="translate(12.800000, 0.000000)">
                <polygon id="Stroke-4447" points="0 3.2 3.2 3.2 3.2 0 0 0"></polygon>
                <polygon id="Stroke-4448" points="0 9.6 3.2 9.6 3.2 6.4 0 6.4"></polygon>
                <polygon id="Stroke-4449" points="0 16 3.2 16 3.2 12.8 0 12.8"></polygon>
            </g>
        </g>
    </g>
</svg>