<?xml version="1.0" encoding="utf-8"?>
<!-- Generator: Adobe Illustrator 24.0.0, SVG Export Plug-In . SVG Version: 6.00 Build 0)  -->
<svg version="1.1" id="Layer_1" xmlns="http://www.w3.org/2000/svg" xmlns:xlink="http://www.w3.org/1999/xlink" x="0px" y="0px"
	 viewBox="0 0 24 24" style="enable-background:new 0 0 24 24;" xml:space="preserve">
<style type="text/css">
	.st0{fill:#404040;}
</style>
<title>Artboard 1</title>
<path class="st0" d="M12,23C5.9,23,1,18.1,1,12S5.9,1,12,1s11,4.9,11,11S18.1,23,12,23z M12,2C6.5,2,2,6.5,2,12s4.5,10,10,10
	s10-4.5,10-10S17.5,2,12,2z"/>
<path class="st0" d="M12,20.3c-4,0-7.4-3.2-7.4-6.9c0-0.3,0.2-0.5,0.4-0.5c0,0,0,0,0.1,0h13.8c0.3,0,0.5,0.2,0.5,0.4c0,0,0,0,0,0.1
	C19.4,17.1,16,20.3,12,20.3z M5.6,13.9c0.5,3.1,3.2,5.4,6.4,5.4c3.2,0.1,5.9-2.3,6.3-5.4H5.6z"/>
<path class="st0" d="M9.7,10.7c-0.3,0-0.5-0.2-0.5-0.4c0,0,0,0,0-0.1c0-0.4-0.1-0.8-0.4-1c-0.6-0.5-1.5-0.4-2,0.1
	c-0.2,0.2-0.3,0.5-0.3,0.9c0,0.3-0.2,0.5-0.4,0.5c0,0,0,0-0.1,0c-0.3,0-0.5-0.2-0.5-0.5c0-1.2,0.9-2.3,2.1-2.3c0.1,0,0.1,0,0.2,0
	C9,7.8,10,8.8,10.1,10c0,0.1,0,0.1,0,0.2C10.2,10.4,10,10.7,9.7,10.7z"/>
<path class="st0" d="M18,10.7c-0.3,0-0.5-0.2-0.5-0.4c0,0,0,0,0-0.1c0-0.4-0.1-0.8-0.4-1c-0.6-0.5-1.5-0.4-2,0.1
	c-0.2,0.2-0.3,0.5-0.3,0.9c0,0.3-0.2,0.5-0.5,0.5s-0.5-0.2-0.5-0.5c0-1.2,0.9-2.3,2.1-2.3c0.1,0,0.1,0,0.2,0
	c1.2-0.1,2.2,0.9,2.3,2.1c0,0.1,0,0.1,0,0.2C18.5,10.4,18.2,10.7,18,10.7z"/>
</svg>
