<?xml version="1.0" encoding="UTF-8"?>
<svg width="50px" height="50px" viewBox="0 0 50 50" version="1.1" xmlns="http://www.w3.org/2000/svg" xmlns:xlink="http://www.w3.org/1999/xlink">
    <!-- Generator: Sketch 51.3 (57544) - http://www.bohemiancoding.com/sketch -->
    <title>link</title>
    <desc>Created with Sketch.</desc>
    <defs></defs>
    <g id="link" stroke="none" stroke-width="1" fill="none" fill-rule="evenodd">
        <g transform="translate(1.000000, 1.000000)" fill="#404040" fill-rule="nonzero">
            <path d="M36.709612,1.99999999e-06 C33.841725,0.001497 31.015706,1.067609 28.859557,3.223757 L23.019117,9.064197 L26.19652,12.2416 L32.03696,6.40116 C34.602807,3.835314 38.83436,3.827837 41.569169,6.447513 C44.229216,8.995416 44.166415,13.174635 41.569169,15.933369 C41.554216,15.949816 41.537769,15.963274 41.522816,15.979721 L31.10243,26.400108 C28.536584,28.965954 24.258678,29.021278 21.523869,26.400108 L18.392818,29.623863 C22.835201,33.880835 29.967536,33.889807 34.279833,29.577511 L44.746572,19.110772 C48.981115,14.692313 49.202412,7.537549 44.700219,3.223757 C42.47828,1.094523 39.577498,-0.001494 36.709612,1.99999999e-06 Z M21.616574,14.952486 C18.748688,14.953981 15.876315,16.020093 13.720167,18.176241 L3.253428,28.64298 C3.253269,28.658431 3.253269,28.673882 3.253428,28.689333 C-0.981115,33.107792 -1.202412,40.262556 3.299781,44.576347 C7.742164,48.83332 14.828146,48.842291 19.140443,44.529995 L25.121436,38.549001 L21.944033,35.371598 L15.96304,41.352592 C13.397193,43.918438 9.16564,43.973762 6.430831,41.352592 C3.755832,38.788241 3.833585,34.579116 6.477184,31.820383 L16.89757,21.353644 C19.463416,18.787798 23.741322,18.780322 26.476131,21.399997 L29.607182,18.176241 C27.385242,16.047008 24.48446,14.95099 21.616574,14.952486 Z"></path>
        </g>
    </g>
</svg>