<?xml version="1.0" encoding="UTF-8"?>
<svg width="50px" height="50px" viewBox="0 0 50 50" version="1.1" xmlns="http://www.w3.org/2000/svg" xmlns:xlink="http://www.w3.org/1999/xlink">
    <!-- Generator: Sketch 51.3 (57544) - http://www.bohemiancoding.com/sketch -->
    <title>profile-travel</title>
    <desc>Created with Sketch.</desc>
    <defs></defs>
    <g id="profile-travel" stroke="none" stroke-width="1" fill="none" fill-rule="evenodd">
        <path d="M24.8515625,45.9859123 C12.8260075,45.9859123 3.07736895,36.2372738 3.07736895,24.2117188 C3.07736895,12.1861637 12.8260075,2.4375252 24.8515625,2.4375252 C36.8771175,2.4375252 46.625756,12.1861637 46.625756,24.2117188 C46.625756,36.2372738 36.8771175,45.9859123 24.8515625,45.9859123 Z M24.8515625,44.5342994 C36.0754139,44.5342994 45.1741431,35.4355701 45.1741431,24.2117188 C45.1741431,12.9878674 36.0754139,3.8891381 24.8515625,3.8891381 C13.6277111,3.8891381 4.52898185,12.9878674 4.52898185,24.2117188 C4.52898185,35.4355701 13.6277111,44.5342994 24.8515625,44.5342994 Z" id="Oval-7" fill="#404040" fill-rule="nonzero"></path>
        <g id="Group-3" transform="translate(13.000000, 14.000000)"></g>
        <path d="M35.2979,30.966 C35.2979,32.298 34.2059,33.389 32.8739,33.389 L32.3889,33.389 L32.3889,18.847 L32.8739,18.847 C34.2059,18.847 35.2979,19.939 35.2979,21.271 L35.2979,30.966 Z M29.4809,33.389 L31.4199,33.389 L31.4199,18.847 L29.4809,18.847 L29.4809,33.389 Z M20.7559,18.847 L21.2409,18.847 L28.0269,18.847 L28.5109,18.847 L28.5109,33.389 L20.7559,33.389 L20.7559,18.847 Z M17.8469,33.389 L19.7859,33.389 L19.7859,18.847 L17.8469,18.847 L17.8469,33.389 Z M13.9689,30.966 L13.9689,21.271 C13.9689,19.939 15.0609,18.847 16.3929,18.847 L16.8779,18.847 L16.8779,33.389 L16.3929,33.389 C15.0609,33.389 13.9689,32.298 13.9689,30.966 Z M21.7249,16.424 C21.7249,15.625 22.3809,14.969 23.1789,14.969 L26.0879,14.969 C26.8869,14.969 27.5419,15.625 27.5419,16.424 L27.5419,17.878 L21.7249,17.878 L21.7249,16.424 Z M32.8739,17.878 L28.5109,17.878 L28.5109,16.424 C28.5109,15.09 27.4219,14 26.0879,14 L23.1789,14 C21.8449,14 20.7559,15.09 20.7559,16.424 L20.7559,17.878 L16.3929,17.878 C14.5259,17.878 12.9999,19.403 12.9999,21.271 L12.9999,30.966 C12.9999,32.833 14.5259,34.359 16.3929,34.359 L32.8739,34.359 C34.7419,34.359 36.2669,32.833 36.2669,30.966 L36.2669,21.271 C36.2669,19.403 34.7419,17.878 32.8739,17.878 Z" id="Fill-1" fill="#404040"></path>
    </g>
</svg>