<?xml version="1.0" encoding="utf-8"?>
<!-- Generator: Adobe Illustrator 24.1.2, SVG Export Plug-In . SVG Version: 6.00 Build 0)  -->
<svg version="1.1" id="Layer_1" xmlns="http://www.w3.org/2000/svg" xmlns:xlink="http://www.w3.org/1999/xlink" x="0px" y="0px"
	 viewBox="0 0 100 100" style="enable-background:new 0 0 100 100;" xml:space="preserve">
<g>
	<path d="M80.6,79.1V1.5c0-0.8-0.7-1.5-1.5-1.5H1.5C0.7,0,0,0.7,0,1.5v77.7c0,0.8,0.7,1.5,1.5,1.5h77.7
		C79.9,80.6,80.6,79.9,80.6,79.1z M77.7,2.9v62.6H68L54.4,32.5c-0.2-0.5-0.7-0.9-1.3-0.9c-0.6,0-1.1,0.3-1.4,0.8L41.1,55.3L31,43.4
		c-0.3-0.4-0.8-0.5-1.2-0.5c-0.5,0-0.9,0.3-1.1,0.7l-13.5,22H2.9V2.9H77.7z M64.8,65.5H18.6l11.5-18.7l10.3,12.1
		c0.3,0.4,0.8,0.6,1.3,0.5c0.5-0.1,0.9-0.4,1.1-0.8L53,36.6L64.8,65.5z M2.9,77.7v-9.2h74.8v9.2H2.9z"/>
	<path d="M98.7,27.5l-9.2-0.8c-0.8-0.1-1.5,0.5-1.6,1.3s0.5,1.5,1.3,1.6l7.7,0.7l-6,66.6l-67.5-6.2c-0.8-0.1-1.5,0.5-1.6,1.3
		c-0.1,0.8,0.5,1.5,1.3,1.6l69,6.3c0,0,0.1,0,0.1,0c0.3,0,0.7-0.1,0.9-0.3c0.3-0.2,0.5-0.6,0.5-1l6.3-69.5
		C100.1,28.3,99.5,27.6,98.7,27.5z"/>
	<path d="M20.9,29.6c4.8,0,8.7-3.9,8.7-8.7c0-4.8-3.9-8.7-8.7-8.7c-4.8,0-8.7,3.9-8.7,8.7C12.1,25.7,16.1,29.6,20.9,29.6z M20.9,15
		c3.2,0,5.8,2.6,5.8,5.8s-2.6,5.8-5.8,5.8S15,24.1,15,20.9S17.7,15,20.9,15z"/>
</g>
</svg>
