<?xml version="1.0" encoding="UTF-8"?>
<svg width="50px" height="50px" viewBox="0 0 50 50" version="1.1" xmlns="http://www.w3.org/2000/svg" xmlns:xlink="http://www.w3.org/1999/xlink">
    <!-- Generator: Sketch 51.3 (57544) - http://www.bohemiancoding.com/sketch -->
    <title>messaging</title>
    <desc>Created with Sketch.</desc>
    <defs></defs>
    <g id="messaging" stroke="none" stroke-width="1" fill="none" fill-rule="evenodd">
        <g id="Group-473" transform="translate(3.000000, 5.000000)" fill="#404040" fill-rule="nonzero">
            <path d="M6.84210526,28.5944328 L12.9262706,22.5410993 C13.1136589,22.3546607 13.3672426,22.25 13.6315789,22.25 L15.5789474,22.25 C16.1312321,22.25 16.5789474,22.6977153 16.5789474,23.25 C16.5789474,23.8022847 16.1312321,24.25 15.5789474,24.25 L14.0443053,24.25 L6.54741356,31.7089007 C5.91671836,32.3363998 4.84210526,31.8896806 4.84210526,31 L4.84210526,24.25 L0,24.25 C-0.55228475,24.25 -1,23.8022847 -1,23.25 L-1,0 C-1,-0.55228475 -0.55228475,-1 0,-1 L37,-1 C37.5522847,-1 38,-0.55228475 38,0 L38,12.59375 C38,13.1460347 37.5522847,13.59375 37,13.59375 C36.4477153,13.59375 36,13.1460347 36,12.59375 L36,1 L1,1 L1,22.25 L5.84210526,22.25 C6.39439001,22.25 6.84210526,22.6977153 6.84210526,23.25 L6.84210526,28.5944328 Z" id="Stroke-783"></path>
            <path d="M21,34.3333333 C20.4477153,34.3333333 20,33.8856181 20,33.3333333 L20,18 C20,17.4477153 20.4477153,17 21,17 L44,17 C44.5522847,17 45,17.4477153 45,18 L45,33.3333333 C45,33.8856181 44.5522847,34.3333333 44,34.3333333 L41.1666667,34.3333333 L41.1666667,41 C41.1666667,41.8628488 40.1472041,42.3206549 39.5023028,41.7474093 L31.1614673,34.3333333 L21,34.3333333 Z M31.5416667,32.3333333 C31.7865808,32.3333333 32.0229794,32.4232119 32.2060305,32.585924 L39.1666667,38.7731562 L39.1666667,33.3333333 C39.1666667,32.7810486 39.6143819,32.3333333 40.1666667,32.3333333 L43,32.3333333 L43,19 L22,19 L22,32.3333333 L31.5416667,32.3333333 Z" id="Stroke-784"></path>
        </g>
    </g>
</svg>