<?xml version="1.0" encoding="utf-8"?>
<!-- Generator: Adobe Illustrator 24.0.0, SVG Export Plug-In . SVG Version: 6.00 Build 0)  -->
<svg version="1.1" id="Layer_1" xmlns="http://www.w3.org/2000/svg" xmlns:xlink="http://www.w3.org/1999/xlink" x="0px" y="0px"
	 viewBox="0 0 24 24" style="enable-background:new 0 0 24 24;" xml:space="preserve">
<style type="text/css">
	.st0{fill:#404040;}
</style>
<title>Artboard 1</title>
<path class="st0" d="M7.8,23.5H7.6c-0.3-0.1-0.5-0.3-0.5-0.6c-0.3-1.7-0.3-3.3,0-5l1.6-6.7c-0.2-0.6-0.4-1.3-0.4-2
	c0-2.1,1.3-3.8,2.9-3.8c1.2,0,2.2,1,2.2,2.2c0,0.1,0,0.1,0,0.2c-0.1,1-0.3,2-0.6,2.9c-0.2,0.6-0.4,1.1-0.5,1.7
	c-0.1,0.4,0,0.8,0.2,1.2c0.3,0.4,0.8,0.6,1.3,0.6c2,0,3.5-2.7,3.5-6.2c0-2.7-1.8-4.3-4.7-4.3C9.6,3.6,7.1,6,7,9c0,0.1,0,0.1,0,0.2
	c0,0.8,0.2,1.6,0.7,2.2C8,11.7,8.1,12.1,8,12.5l-0.3,1c-0.1,0.3-0.3,0.5-0.5,0.6c-0.3,0.1-0.5,0.1-0.8,0c-1.8-0.7-2.9-2.7-2.9-5.3
	c0-4.1,3.6-8.4,9.5-8.4c5.3,0,8.5,3.9,8.5,7.7c0,5.3-3.1,9.2-7.3,9.2c-1,0-2-0.3-2.8-1c-0.2,0.9-0.6,2.2-0.7,2.5
	c-0.6,1.5-1.3,3-2.3,4.3C8.3,23.3,8.1,23.5,7.8,23.5z M11.3,6.4c-1.1,0-1.9,1.2-1.9,2.8c0,0.6,0.1,1.3,0.4,1.8
	c0.1,0.1,0.1,0.2,0,0.3c0,0,0,0,0,0l-1.6,6.9C8,19.5,7.9,20.7,8.1,22c0.8-1,1.3-2.1,1.7-3.3c0.2-0.6,0.9-3.5,0.9-3.5
	c0.1-0.2,0.2-0.4,0.4-0.4c0.2,0,0.4,0.1,0.5,0.3c0.6,0.8,1.6,1.3,2.6,1.3c3.7,0,6.3-3.4,6.3-8.2c0-3.3-2.8-6.7-7.5-6.7
	c-5.9,0-8.5,4.3-8.5,7.4c0,2.2,0.8,3.8,2.3,4.4l0.2-1v-0.1l-0.1-0.1c-0.6-0.8-1-1.8-1-2.8c0-3.6,2.9-6.6,6.5-6.6c0.1,0,0.1,0,0.2,0
	c3.5,0,5.7,2.1,5.7,5.3c0,4.1-1.9,7.2-4.5,7.2c-0.8,0.1-1.6-0.3-2-1c-0.5-0.6-0.6-1.4-0.4-2.1c0.1-0.6,0.3-1.2,0.5-1.8
	c0.3-0.8,0.5-1.7,0.6-2.6c0.1-0.7-0.4-1.2-1.1-1.3C11.4,6.4,11.3,6.4,11.3,6.4z"/>
</svg>
