<?xml version="1.0" encoding="utf-8"?>
<!-- Generator: Adobe Illustrator 24.3.0, SVG Export Plug-In . SVG Version: 6.00 Build 0)  -->
<svg version="1.0" id="Layer_1" xmlns="http://www.w3.org/2000/svg" xmlns:xlink="http://www.w3.org/1999/xlink" x="0px" y="0px"
	 viewBox="0 0 54 72" style="enable-background:new 0 0 54 72;" xml:space="preserve">
<g>
	<path d="M35,0H0v72h54V19L35,0z M49,18H36V5L49,18z M51,69H3V3h29.8L33,3.2V21h17.8l0.2,0.2V69z"/>
	<path d="M30,30v18h-6v-6h-9V23h-3v37h30V30H30z M30,51v6h-6v-6H30z M15,45h6v12h-6V45z M33,57V33h6v24H33z"/>
</g>
</svg>
