<?xml version="1.0" encoding="utf-8"?>
<!-- Generator: Adobe Illustrator 24.0.0, SVG Export Plug-In . SVG Version: 6.00 Build 0)  -->
<svg version="1.1" id="Layer_1" xmlns="http://www.w3.org/2000/svg" xmlns:xlink="http://www.w3.org/1999/xlink" x="0px" y="0px"
	 viewBox="0 0 24 24" style="enable-background:new 0 0 24 24;" xml:space="preserve">
<style type="text/css">
	.st0{fill:#404040;}
</style>
<title>Artboard 1</title>
<path class="st0" d="M19.7,23.5H4.3c-2.1,0-3.8-2.3-3.8-5.2V5.7c0-2.9,1.7-5.2,3.8-5.2h15.4c2.1,0,3.8,2.3,3.8,5.2v12.5
	C23.5,21.2,21.8,23.5,19.7,23.5z M4.3,1.5c-1.5,0-2.8,1.9-2.8,4.2v12.5c0,2.3,1.3,4.2,2.8,4.2h15.4c1.5,0,2.8-1.9,2.8-4.2V5.7
	c0-2.3-1.2-4.2-2.8-4.2H4.3z M9.7,16.3c-0.1,0-0.2,0-0.2-0.1c-0.2-0.1-0.3-0.2-0.3-0.4V7.9c0-0.2,0.1-0.4,0.3-0.4
	c0.2-0.1,0.3-0.1,0.5,0l6.2,4c0.1,0.1,0.2,0.2,0.2,0.4c0,0.2-0.1,0.3-0.2,0.4l-6.2,4H9.7z M10.2,8.8v6.1l4.8-3.1L10.2,8.8z"/>
</svg>
