<?xml version="1.0" encoding="utf-8"?>
<!-- Generator: Adobe Illustrator 24.0.0, SVG Export Plug-In . SVG Version: 6.00 Build 0)  -->
<svg version="1.1" id="Layer_1" xmlns="http://www.w3.org/2000/svg" xmlns:xlink="http://www.w3.org/1999/xlink" x="0px" y="0px"
	 viewBox="0 0 24 24" style="enable-background:new 0 0 24 24;" xml:space="preserve">
<style type="text/css">
	.st0{fill:#404040;}
</style>
<title>Artboard 1</title>
<path class="st0" d="M12,16.6c-0.3,0-0.5-0.2-0.5-0.5V8.8c0-0.3,0.2-0.5,0.5-0.5s0.5,0.2,0.5,0.5v7.3C12.5,16.4,12.3,16.6,12,16.6z"
	/>
<path class="st0" d="M22.5,23h-21c-0.2,0-0.3-0.1-0.4-0.2c-0.1-0.1-0.1-0.3,0-0.5l10.5-21C11.8,1,12.1,1,12.3,1.1
	c0.1,0,0.1,0.1,0.2,0.2l10.5,21c0.1,0.1,0.1,0.3,0,0.5C22.9,22.9,22.7,23,22.5,23z M2.3,22h19.4L12,2.6L2.3,22z"/>
<path class="st0" d="M12,20.1c-0.6,0-1-0.4-1-1s0.4-1,1-1s1,0.4,1,1S12.6,20.1,12,20.1z M12,19.1L12,19.1z"/>
</svg>
