<?xml version="1.0" encoding="utf-8"?>
<!-- Generator: Adobe Illustrator 24.0.0, SVG Export Plug-In . SVG Version: 6.00 Build 0)  -->
<svg version="1.1" id="Layer_1" xmlns="http://www.w3.org/2000/svg" xmlns:xlink="http://www.w3.org/1999/xlink" x="0px" y="0px"
	 viewBox="0 0 24 24" style="enable-background:new 0 0 24 24;" xml:space="preserve">
<style type="text/css">
	.st0{fill-rule:evenodd;clip-rule:evenodd;fill:#CE0404;}
	.st1{fill:#FFFFFF;}
</style>
<title>Artboard 1</title>
<path id="Stroke-3210" class="st0" d="M1.5,23.5c-0.3,0-0.6-0.2-0.7-0.5c0-0.2,0-0.3,0.1-0.4L11.6,1.4c0.2-0.5,0.6-0.5,0.9,0
	l11,22.1H1.5z"/>
<path class="st1" d="M12,17c-0.3,0-0.5-0.2-0.5-0.5v-8C11.5,8.2,11.7,8,12,8s0.5,0.2,0.5,0.5v8C12.5,16.8,12.3,17,12,17z"/>
<path class="st1" d="M12,20.9c-0.6,0-1-0.4-1-1s0.4-1,1-1s1,0.4,1,1S12.6,20.9,12,20.9z M12,19.8L12,19.8C12,19.8,12,19.8,12,19.8z"
	/>
</svg>
