<?xml version="1.0" encoding="UTF-8"?>
<svg width="50px" height="50px" viewBox="0 0 50 50" version="1.1" xmlns="http://www.w3.org/2000/svg" xmlns:xlink="http://www.w3.org/1999/xlink">
    <!-- Generator: Sketch 51.3 (57544) - http://www.bohemiancoding.com/sketch -->
    <title>profile-interior</title>
    <desc>Created with Sketch.</desc>
    <defs></defs>
    <g id="profile-interior" stroke="none" stroke-width="1" fill="none" fill-rule="evenodd">
        <g id="Group" transform="translate(3.000000, 2.000000)" fill-rule="nonzero">
            <path d="M22.5,44.5236895 C10.474445,44.5236895 0.725806452,34.775051 0.725806452,22.749496 C0.725806452,10.7239409 10.474445,0.975302419 22.5,0.975302419 C34.525555,0.975302419 44.2741935,10.7239409 44.2741935,22.749496 C44.2741935,34.775051 34.525555,44.5236895 22.5,44.5236895 Z M22.5,43.0720766 C33.7238514,43.0720766 42.8225806,33.9733473 42.8225806,22.749496 C42.8225806,11.5256446 33.7238514,2.42691532 22.5,2.42691532 C11.2761486,2.42691532 2.17741935,11.5256446 2.17741935,22.749496 C2.17741935,33.9733473 11.2761486,43.0720766 22.5,43.0720766 Z" id="Oval-7" fill="#404040"></path>
            <g id="Group-822" transform="translate(10.161290, 14.516129)" fill="#000000">
                <path d="M2.05645161,12.8528226 C2.05645161,12.5688859 2.2866278,12.3387097 2.57056452,12.3387097 C2.85450123,12.3387097 3.08467742,12.5688859 3.08467742,12.8528226 L3.08467742,14.9092742 C3.08467742,15.1932109 2.85450123,15.4233871 2.57056452,15.4233871 C2.2866278,15.4233871 2.05645161,15.1932109 2.05645161,14.9092742 L2.05645161,12.8528226 Z" id="Stroke-428"></path>
                <path d="M21.5927419,12.8528226 C21.5927419,12.5688859 21.8229181,12.3387097 22.1068548,12.3387097 C22.3907916,12.3387097 22.6209677,12.5688859 22.6209677,12.8528226 L22.6209677,14.9092742 C22.6209677,15.1932109 22.3907916,15.4233871 22.1068548,15.4233871 C21.8229181,15.4233871 21.5927419,15.1932109 21.5927419,14.9092742 L21.5927419,12.8528226 Z" id="Stroke-429"></path>
                <path d="M0,6.68346774 C0,6.39953103 0.230176187,6.16935484 0.514112903,6.16935484 C0.798049619,6.16935484 1.02822581,6.39953103 1.02822581,6.68346774 L1.02822581,10.796371 C1.02822581,11.6483856 1.71807313,12.3387097 2.57056452,12.3387097 L22.1068548,12.3387097 C22.9580794,12.3387097 23.6491935,11.6475955 23.6491935,10.796371 L23.6491935,6.68346774 C23.6491935,6.39953103 23.8793697,6.16935484 24.1633065,6.16935484 C24.4472432,6.16935484 24.6774194,6.39953103 24.6774194,6.68346774 L24.6774194,10.796371 C24.6774194,12.215469 23.5259528,13.3669355 22.1068548,13.3669355 L2.57056452,13.3669355 C1.15004062,13.3669355 0,12.2161001 0,10.796371 L0,6.68346774 Z" id="Stroke-430"></path>
                <path d="M20.5645161,6.68346774 C20.5645161,6.39953103 20.7946923,6.16935484 21.078629,6.16935484 C21.3625657,6.16935484 21.5927419,6.39953103 21.5927419,6.68346774 L21.5927419,7.71169355 C21.5927419,8.56245831 20.9016453,9.25403226 20.0504032,9.25403226 L4.62701613,9.25403226 C3.77502107,9.25403226 3.08467742,8.56273444 3.08467742,7.71169355 L3.08467742,6.68346774 C3.08467742,6.39953103 3.31485361,6.16935484 3.59879032,6.16935484 C3.88272704,6.16935484 4.11290323,6.39953103 4.11290323,6.68346774 L4.11290323,7.71169355 C4.11290323,7.99517868 4.34321267,8.22580645 4.62701613,8.22580645 L20.0504032,8.22580645 C20.3336129,8.22580645 20.5645161,7.99474372 20.5645161,7.71169355 L20.5645161,6.68346774 Z" id="Stroke-431"></path>
                <path d="M22.6209677,5.20539315 C22.6209677,5.48932986 22.3907916,5.71950605 22.1068548,5.71950605 C21.8229181,5.71950605 21.5927419,5.48932986 21.5927419,5.20539315 L21.5927419,4.62753024 C21.5927419,2.63880969 19.9821159,1.02873992 17.9939516,1.02873992 L6.68346774,1.02873992 C4.69465031,1.02873992 3.08467742,2.63843475 3.08467742,4.62753024 L3.08467742,5.22081653 C3.08467742,5.50475325 2.85450123,5.73492944 2.57056452,5.73492944 C2.2866278,5.73492944 2.05645161,5.50475325 2.05645161,5.22081653 L2.05645161,4.62753024 C2.05645161,2.07052156 4.12681664,0.000514112903 6.68346774,0.000514112903 L17.9939516,0.000514112903 C20.5499099,0.000514112903 22.6209677,2.07085673 22.6209677,4.62753024 L22.6209677,5.20539315 Z" id="Stroke-432"></path>
                <path d="M1.02822581,6.68346774 C1.02822581,6.96740446 0.798049619,7.19758065 0.514112903,7.19758065 C0.230176187,7.19758065 0,6.96740446 0,6.68346774 C0,5.54640578 0.919813336,4.62701613 2.05645161,4.62701613 C3.19236408,4.62701613 4.11290323,5.54670763 4.11290323,6.68346774 C4.11290323,6.96740446 3.88272704,7.19758065 3.59879032,7.19758065 C3.31485361,7.19758065 3.08467742,6.96740446 3.08467742,6.68346774 C3.08467742,6.11479322 2.62470259,5.65524194 2.05645161,5.65524194 C1.48758075,5.65524194 1.02822581,6.11438529 1.02822581,6.68346774 Z" id="Stroke-433"></path>
                <path d="M24.6774194,6.68346774 C24.6774194,6.96740446 24.4472432,7.19758065 24.1633065,7.19758065 C23.8793697,7.19758065 23.6491935,6.96740446 23.6491935,6.68346774 C23.6491935,6.11479322 23.1892187,5.65524194 22.6209677,5.65524194 C22.0520969,5.65524194 21.5927419,6.11438529 21.5927419,6.68346774 C21.5927419,6.96740446 21.3625657,7.19758065 21.078629,7.19758065 C20.7946923,7.19758065 20.5645161,6.96740446 20.5645161,6.68346774 C20.5645161,5.54640578 21.4843295,4.62701613 22.6209677,4.62701613 C23.7568802,4.62701613 24.6774194,5.54670763 24.6774194,6.68346774 Z" id="Stroke-434"></path>
                <path d="M11.3104839,0.514112903 C11.3104839,0.230176187 11.5406601,0 11.8245968,0 C12.1085335,0 12.3387097,0.230176187 12.3387097,0.514112903 L12.3387097,8.73991935 C12.3387097,9.02385607 12.1085335,9.25403226 11.8245968,9.25403226 C11.5406601,9.25403226 11.3104839,9.02385607 11.3104839,8.73991935 L11.3104839,0.514112903 Z" id="Stroke-435"></path>
            </g>
        </g>
    </g>
</svg>