<?xml version="1.0" encoding="UTF-8"?>
<svg width="50px" height="50px" viewBox="0 0 50 50" version="1.1" xmlns="http://www.w3.org/2000/svg" xmlns:xlink="http://www.w3.org/1999/xlink">
    <!-- Generator: Sketch 51.3 (57544) - http://www.bohemiancoding.com/sketch -->
    <title>profile-gifting</title>
    <desc>Created with Sketch.</desc>
    <defs></defs>
    <g id="profile-gifting" stroke="none" stroke-width="1" fill="none" fill-rule="evenodd">
        <path d="M25.4149446,45.9050554 C13.3893895,45.9050554 3.64075101,36.1564169 3.64075101,24.1308619 C3.64075101,12.1053069 13.3893895,2.35666835 25.4149446,2.35666835 C37.4404996,2.35666835 47.1891381,12.1053069 47.1891381,24.1308619 C47.1891381,36.1564169 37.4404996,45.9050554 25.4149446,45.9050554 Z M25.4149446,44.4534425 C36.6387959,44.4534425 45.7375252,35.3547133 45.7375252,24.1308619 C45.7375252,12.9070105 36.6387959,3.80828125 25.4149446,3.80828125 C14.1910932,3.80828125 5.09236391,12.9070105 5.09236391,24.1308619 C5.09236391,35.3547133 14.1910932,44.4534425 25.4149446,44.4534425 Z" id="Oval-7" fill="#404040" fill-rule="nonzero"></path>
        <path d="M37,29 L33,29 L33,26 L36.5,26 L37,26 L37,29 Z M33,33 L37,33 L37,30 L33,30 L33,33 Z M32,29 L28,29 L28,26 L29.5,26 L32,26 L32,29 Z M28,33 L32,33 L32,30 L28,30 L28,33 Z M15,20 L17,20 L17,25.5 C17,25.776 17.224,26 17.5,26 C17.776,26 18,25.776 18,25.5 L18,20 L24,20 L24,25.5 C24,25.776 24.224,26 24.5,26 C24.776,26 25,25.776 25,25.5 L25,20 L27,20 L27,25.5 L27,33 L15,33 L15,20 Z M18,16 C18,14.343 19.343,13 21,13 C22.657,13 24,14.343 24,16 L24,19 L18,19 L18,16 Z M30,19 L31,19 L31,20.5 C31,20.776 31.224,21 31.5,21 C31.776,21 32,20.776 32,20.5 L32,19 L34,19 L34,20.5 C34,20.776 34.224,21 34.5,21 C34.776,21 35,20.776 35,20.5 L35,19 L36,19 L36,25 L30,25 L30,19 Z M32,16.5 C32,15.948 32.448,15.5 33,15.5 C33.552,15.5 34,15.948 34,16.5 L34,18 L32,18 L32,16.5 Z M37.5,25 L37,25 L37,18.5 C37,18.224 36.776,18 36.5,18 L35,18 L35,16.5 C35,15.396 34.104,14.5 33,14.5 C31.896,14.5 31,15.396 31,16.5 L31,18 L29.5,18 C29.224,18 29,18.224 29,18.5 L29,25 L28,25 L28,19.5 C28,19.224 27.776,19 27.5,19 L25,19 L25,16 C25,13.791 23.21,12 21,12 C18.79,12 17,13.791 17,16 L17,19 L14.5,19 C14.224,19 14,19.224 14,19.5 L14,33.5 C14,33.776 14.224,34 14.5,34 L27.5,34 L37.5,34 C37.776,34 38,33.776 38,33.5 L38,25.5 C38,25.224 37.776,25 37.5,25 Z" id="Fill-1" fill="#404040"></path>
    </g>
</svg>