<?xml version="1.0" encoding="utf-8"?>
<!-- Generator: Adobe Illustrator 24.0.0, SVG Export Plug-In . SVG Version: 6.00 Build 0)  -->
<svg version="1.1" id="Layer_1" xmlns="http://www.w3.org/2000/svg" xmlns:xlink="http://www.w3.org/1999/xlink" x="0px" y="0px"
	 viewBox="0 0 24 24" style="enable-background:new 0 0 24 24;" xml:space="preserve">
<style type="text/css">
	.st0{fill:#404040;}
</style>
<title>Artboard 1</title>
<path class="st0" d="M1.8,22.8c-0.1,0-0.3-0.1-0.4-0.1c-0.1-0.1-0.2-0.3-0.1-0.5l1.4-5.9c0-0.1,0-0.1,0.1-0.2L17.1,1.7
	c0.9-0.9,2.4-0.9,3.3,0l1.9,1.9c0.9,0.9,0.9,2.4,0,3.3L8,21.2c-0.1,0.1-0.1,0.1-0.2,0.1l-5.9,1.4L1.8,22.8z M3.6,16.6l-1.2,5l5-1.2
	L21.6,6.2c0.5-0.5,0.5-1.4,0-1.9l-1.9-1.9c-0.5-0.5-1.4-0.5-1.9,0L3.6,16.6z"/>
<path class="st0" d="M21.3,7.7c-0.1,0-0.3,0-0.4-0.1L16.4,3c-0.2-0.2-0.2-0.5,0-0.7c0.2-0.2,0.5-0.2,0.7,0l4.5,4.5
	c0.2,0.2,0.2,0.5,0,0.7c0,0,0,0,0,0C21.6,7.7,21.5,7.7,21.3,7.7z"/>
<path class="st0" d="M20,9c-0.1,0-0.3,0-0.4-0.1l-4.5-4.6c-0.2-0.2-0.2-0.5,0-0.7c0.2-0.2,0.5-0.2,0.7,0l4.5,4.6
	c0.2,0.2,0.2,0.5,0,0.7c0,0,0,0,0,0C20.3,9,20.2,9,20,9z"/>
<path class="st0" d="M7.9,21.1c-0.1,0-0.3,0-0.4-0.1L3,16.5c-0.2-0.2-0.2-0.5,0-0.7c0.2-0.2,0.5-0.2,0.7,0l4.5,4.5
	c0.2,0.2,0.2,0.5,0,0.7c0,0,0,0,0,0C8.2,21.1,8,21.1,7.9,21.1z"/>
</svg>
