<svg width="14" height="18" viewBox="0 0 14 18" fill="none" xmlns="http://www.w3.org/2000/svg">
<path d="M10.5 15.7563H1.5V2.02854H10.5V3.40132H12V1.34215C12 0.963264 11.664 0.655762 11.25 0.655762H0.75C0.336 0.655762 0 0.963264 0 1.34215V16.4427C0 16.8216 0.336 17.1291 0.75 17.1291H11.25C11.664 17.1291 12 16.8216 12 16.4427V14.3835H10.5V15.7563Z" fill="#C2CFE0"/>
<path d="M14 9.35001L9 5.23169V8.66362H4V10.0364H9V13.4683L14 9.35001Z" fill="#C2CFE0"/>
</svg>
