<?xml version="1.0" encoding="utf-8"?>
<!-- Generator: Adobe Illustrator 24.0.0, SVG Export Plug-In . SVG Version: 6.00 Build 0)  -->
<svg version="1.1" id="Layer_1" xmlns="http://www.w3.org/2000/svg" xmlns:xlink="http://www.w3.org/1999/xlink" x="0px" y="0px"
	 viewBox="0 0 24 24" style="enable-background:new 0 0 24 24;" xml:space="preserve">
<style type="text/css">
	.st0{fill:#404040;}
</style>
<title>Artboard 1</title>
<path class="st0" d="M12,23C5.9,23,1,18.1,1,12S5.9,1,12,1s11,4.9,11,11S18.1,23,12,23z M12,2C6.5,2,2,6.5,2,12s4.5,10,10,10
	s10-4.5,10-10S17.5,2,12,2z"/>
<path class="st0" d="M12,17.3c-1.6,0-2.9-1.3-2.9-2.9c0-0.3,0.2-0.5,0.5-0.5s0.5,0.2,0.5,0.5c0,1,0.9,1.9,1.9,1.9
	c1,0,1.9-0.8,1.9-1.8c0,0,0-0.1,0-0.1c0-1-0.9-1.9-1.9-1.9c-1.6,0-2.9-1.3-2.9-2.9s1.3-2.9,2.9-2.9s2.9,1.3,2.9,2.9v0
	c0,0.3-0.2,0.5-0.5,0.5s-0.5-0.2-0.5-0.5c0-1-0.9-1.9-1.9-1.9c-1,0-1.9,0.9-1.9,1.9s0.9,1.9,1.9,1.9c0,0,0,0,0,0
	c1.6,0,2.9,1.3,2.9,2.9C14.9,16,13.6,17.3,12,17.3z"/>
<path class="st0" d="M12,18.7c-0.3,0-0.5-0.2-0.5-0.4c0,0,0,0,0-0.1V5.8c0-0.3,0.2-0.5,0.5-0.5s0.5,0.2,0.5,0.5v12.4
	C12.5,18.5,12.3,18.7,12,18.7C12,18.7,12,18.7,12,18.7z"/>
</svg>
