<?xml version="1.0" encoding="utf-8"?>
<!-- Generator: Adobe Illustrator 24.0.0, SVG Export Plug-In . SVG Version: 6.00 Build 0)  -->
<svg version="1.1" id="Layer_1" xmlns="http://www.w3.org/2000/svg" xmlns:xlink="http://www.w3.org/1999/xlink" x="0px" y="0px"
	 viewBox="0 0 24 24" style="enable-background:new 0 0 24 24;" xml:space="preserve">
<style type="text/css">
	.st0{fill:#404040;}
</style>
<title>Artboard 1</title>
<path id="Shape" class="st0" d="M19.7,6.5c0.9-0.5,1.5-1.3,1.8-2.3c-0.8,0.5-1.7,0.8-2.6,1c-0.8-0.8-1.9-1.3-3-1.3
	c-2.2,0-4.1,1.8-4.1,4c0,0,0,0.1,0,0.1c0,0.3,0,0.6,0.1,0.9C8.6,8.8,5.5,7.2,3.3,4.7C3,5.3,2.8,6,2.8,6.7c0,1.4,0.7,2.6,1.8,3.4
	c-0.7,0-1.3-0.2-1.9-0.5v0.1c0,2,1.4,3.6,3.3,4c-0.4,0.1-0.7,0.1-1.1,0.1c-0.3,0-0.5,0-0.8-0.1c0.6,1.7,2.1,2.8,3.9,2.8
	c-1.5,1.1-3.3,1.7-5.1,1.7c-0.3,0-0.7,0-1-0.1c1.9,1.2,4.1,1.8,6.3,1.8c6.4,0.1,11.7-5,11.8-11.5c0,0,0-0.1,0-0.1V7.8
	c0.8-0.6,1.5-1.3,2.1-2.1C21.4,6.1,20.5,6.4,19.7,6.5z M22.8,6.4c-0.5,0.8-1.1,1.5-1.9,2v0.1c0,6.9-5.5,12.5-12.3,12.5
	c-0.1,0-0.2,0-0.4,0c-2.4,0-4.8-0.7-6.8-2c-0.4-0.3-0.5-0.9-0.3-1.3c0.2-0.3,0.5-0.4,0.9-0.4c0.3,0,0.6,0.1,0.9,0.1
	c1,0,1.9-0.2,2.8-0.5c-1.1-0.6-2-1.6-2.4-2.8c-0.1-0.2,0-0.5,0.1-0.7c-1-0.9-1.6-2.2-1.6-3.6c0-0.4,0.2-0.7,0.5-0.9
	C2,8.2,1.8,7.5,1.8,6.7c0-0.9,0.2-1.8,0.7-2.5c0.2-0.4,0.8-0.6,1.2-0.4C3.8,3.9,3.9,4,4,4.1c1.7,2.1,4.1,3.4,6.8,3.8
	c0.1-2.8,2.5-5,5.3-4.9c1.1,0,2.2,0.5,3.1,1.2c0.7-0.2,1.3-0.4,1.9-0.8c0.4-0.2,1-0.1,1.2,0.4c0.1,0.2,0.1,0.5,0.1,0.7
	c0,0.2-0.1,0.3-0.2,0.4c0.5,0.1,0.9,0.7,0.7,1.2C22.9,6.2,22.9,6.3,22.8,6.4z"/>
<path class="st0" d="M8.2,21.2c-2.4,0-4.8-0.7-6.9-2c-0.5-0.3-0.6-0.8-0.4-1.3C1,17.4,1.5,17.1,2,17.2c1.1,0.1,2.2,0,3.3-0.4
	c-1-0.6-1.8-1.6-2.2-2.8c-0.1-0.2-0.1-0.5,0-0.7c-1-1-1.5-2.2-1.5-3.6C1.6,9.4,1.8,9,2,8.8c-0.3-0.6-0.4-1.3-0.4-2
	c0-0.9,0.2-1.8,0.7-2.6c0.2-0.3,0.5-0.5,0.8-0.5c0.3,0,0.7,0.1,0.9,0.4c1.7,2,4,3.3,6.5,3.7c0.1-2.8,2.4-4.9,5.2-4.9
	c1.2,0,2.4,0.4,3.3,1.2c0.6-0.2,1.2-0.4,1.8-0.7c0.4-0.2,0.9-0.2,1.2,0.1c0.4,0.3,0.5,0.8,0.3,1.2c0,0.1-0.1,0.2-0.1,0.3
	c0.3,0.1,0.5,0.3,0.6,0.6c0.1,0.3,0.1,0.7-0.1,1l0,0c-0.5,0.8-1.1,1.5-1.9,2l0,0C21.1,15.6,15.5,21.2,8.2,21.2z M1.9,17.5
	c-0.3,0-0.6,0.2-0.7,0.5c-0.2,0.3,0,0.7,0.3,0.9c2,1.3,4.3,2,6.7,2C15,21,20.6,15.6,20.7,8.8c0-0.1,0-0.2,0-0.3V8.3h0.1
	c0.7-0.6,1.3-1.3,1.9-2c0.2-0.2,0.2-0.5,0.1-0.7c-0.1-0.2-0.3-0.4-0.6-0.5L22,5l0.1-0.2c0.1-0.1,0.1-0.3,0.2-0.4
	c0.1-0.4,0-0.7-0.2-0.8c-0.2-0.2-0.6-0.3-0.9-0.1c-0.6,0.4-1.2,0.6-1.9,0.8h-0.1l-0.1-0.1c-0.9-0.8-2-1.2-3.2-1.2
	C13.2,3,11,5.1,11,7.7c0,0,0,0,0,0.1V8h-0.2C8.1,7.7,5.6,6.3,3.9,4.2C3.7,4,3.5,3.9,3.3,3.9C3,3.9,2.8,4.1,2.7,4.3
	C2.2,5,2,5.8,2,6.7c0,0.7,0.1,1.4,0.4,2l0.1,0.1L2.4,8.9C2.1,9.1,2,9.4,2,9.7c0,1.3,0.6,2.6,1.5,3.5l0.1,0.1l-0.1,0.1
	c-0.1,0.2-0.1,0.4-0.1,0.6c0.4,1.2,1.2,2.2,2.3,2.8L6,16.9L5.7,17C4.5,17.5,3.3,17.6,1.9,17.5L1.9,17.5z M8.2,20.2
	c-2.3,0-4.5-0.6-6.4-1.9L1.9,18c2,0.3,4-0.2,5.7-1.3c-1.6-0.2-3-1.3-3.6-2.9v-0.3h0.3c0.4,0.1,0.8,0.1,1.2,0.1
	c-1.7-0.6-2.8-2.2-2.8-4V9.3l0.2,0.1c0.4,0.2,0.8,0.4,1.3,0.4c-1-0.7-1.6-1.9-1.6-3.1c0-0.7,0.2-1.5,0.6-2.1l0.1-0.2l0.1,0.2
	c2,2.5,5,4,8.2,4.2c0-0.2-0.1-0.5-0.1-0.8c0-2.3,2-4.2,4.3-4.2c0,0,0,0,0,0c1.2,0,2.3,0.5,3.1,1.3c0.9-0.2,1.7-0.5,2.5-1l0.3-0.2
	l-0.1,0.4c-0.2,0.8-0.7,1.5-1.3,2C20.9,6.2,21.5,6,22,5.8l0.5-0.2L22.2,6c-0.5,0.8-1.2,1.5-2,2.1v0.5c0,6.5-5.3,11.7-11.8,11.6
	C8.3,20.2,8.3,20.2,8.2,20.2z M2.5,18.4c1.7,1,3.7,1.5,5.7,1.5C14.5,20,19.7,15,19.8,8.7c0-0.1,0-0.2,0-0.3V7.8h0.1
	c0.7-0.5,1.2-1,1.7-1.7c-0.6,0.2-1.3,0.4-1.9,0.5l-0.1-0.3c0.7-0.4,1.3-1,1.6-1.8c-0.7,0.4-1.5,0.7-2.3,0.8h-0.1l-0.1-0.1
	c-0.8-0.7-1.8-1.1-2.8-1.1c-2.2,0-3.9,1.7-4,3.9c0,0.3,0,0.6,0.1,0.9v0.2h-0.2C8.5,8.9,5.5,7.4,3.3,4.9C3.1,5.5,2.9,6.1,2.9,6.7
	C2.9,8,3.6,9.3,4.7,10l0.4,0.3H4.6c-0.6,0-1.2-0.2-1.7-0.4c0.1,1.8,1.4,3.3,3.2,3.7v0.3C5.5,14,5,14,4.4,13.9c0.6,1.5,2,2.5,3.6,2.5
	h0.4l-0.3,0.3C6.5,17.9,4.5,18.5,2.5,18.4z"/>
</svg>
