<?xml version="1.0" encoding="UTF-8"?>
<svg width="50px" height="50px" viewBox="0 0 50 50" version="1.1" xmlns="http://www.w3.org/2000/svg" xmlns:xlink="http://www.w3.org/1999/xlink">
    <!-- Generator: Sketch 51.3 (57544) - http://www.bohemiancoding.com/sketch -->
    <title>underlined</title>
    <desc>Created with Sketch.</desc>
    <defs></defs>
    <g id="underlined" stroke="none" stroke-width="1" fill="none" fill-rule="evenodd">
        <g transform="translate(9.000000, 3.000000)" fill="#404040" fill-rule="nonzero" id="Shape">
            <path d="M16.5,33.4444443 C24.3021429,33.4444443 30.6428571,27.0183333 30.6428571,19.1111111 L30.6428571,0 L24.7499998,0 L24.7499998,19.1111111 C24.7499998,23.7216667 21.0492858,27.4722223 16.5,27.4722223 C11.9507142,27.4722223 8.24999999,23.7216667 8.24999999,19.1111111 L8.24999999,0 L2.35714286,0 L2.35714286,19.1111111 C2.35714286,27.0183333 8.69785711,33.4444443 16.5,33.4444443 Z M0,38.2222223 L0,43 L33,43 L33,38.2222223 L0,38.2222223 Z"></path>
        </g>
    </g>
</svg>