<?xml version="1.0" encoding="UTF-8"?>
<svg viewBox="0 0 24 24" version="1.1" xmlns="http://www.w3.org/2000/svg" xmlns:xlink="http://www.w3.org/1999/xlink">
  <!-- Generator: Sketch 51.3 (57544) - http://www.bohemiancoding.com/sketch -->
  <title>weibo</title>
  <desc>Created with Sketch.</desc>
  <g stroke="none" stroke-width="1" fill="none" fill-rule="evenodd" transform="translate(1, 2)">
    <path d="M18.5696421,4.18157915 L18.5696421,4.18057911 C18.5696421,4.18057911 18.5652002,4.17514413 18.5574042,4.16562204 C18.5542315,4.1616219 18.5513306,4.15744783 18.5481126,4.15344768 L18.547614,4.15375204 C18.4684761,4.05792244 18.1897257,3.72812775 17.9861699,3.58342679 C17.1904396,2.88944484 15.8181719,2.98292652 15.5678858,3.03705894 C15.317645,3.09119136 14.9110321,3.32428686 15.0173651,3.88574222 C15.1236982,4.44719758 15.6488367,4.38615186 16.1343156,4.34941139 C16.5581522,4.31732325 16.9783627,4.59615956 17.0782596,4.66742304 C17.079574,4.66855352 17.2156404,4.78360121 17.3041607,4.9129103 L17.3032088,4.91351902 C17.3032088,4.91351902 17.3150387,4.9301718 17.3338941,4.96008594 C17.3339394,4.96021638 17.33403,4.9603903 17.334166,4.96052074 C17.334166,4.96052074 17.3342113,4.96052074 17.3342113,4.96056422 C17.4178818,5.09352561 17.6381626,5.48754005 17.5767015,5.86359731 C17.5012349,6.32504901 17.3974854,6.82267594 17.9728443,6.96742037 C18.5481579,7.11220829 18.8217412,6.74123817 18.8972077,6.50596868 C18.9717678,6.27335146 19.2025187,4.99743513 18.5696421,4.18157915 Z" id="Shape" stroke="#000000" stroke-width="0.699999988"></path>
    <path d="M20.7147007,2.17175264 C20.7147007,2.17175264 20.3567231,1.70045921 20.1428724,1.52176913 C20.1209592,1.49943841 20.0701835,1.4619547 20.0701835,1.4619547 C17.4607506,-0.662919822 14.8017002,0.145062407 14.5788618,0.176741904 C14.3356854,0.211257047 13.9775688,0.419721425 14.0011035,1.09593467 C14.0248235,1.77219223 14.8656794,1.80706183 14.8656794,1.80706183 C16.747853,1.27785916 18.1719803,2.08446788 18.8990543,2.6647565 C18.8990543,2.6647565 21.021671,4.50961085 20.0256622,7.12102041 C20.0256622,7.12102041 20.0084744,7.92576823 20.7125696,7.99147549 C21.4166648,8.05718275 21.6571542,7.72869074 21.7086248,7.49873748 C21.7558795,7.28796914 22.769632,4.79928994 20.7147007,2.17175264 Z" id="Shape" stroke="#000000" stroke-width="0.699999988"></path>
    <path d="M17.0866889,9.24677255 C17.0866889,9.24677255 16.0559818,8.88737808 15.9859368,8.77301528 C15.9158917,8.65865248 15.9612097,8.40136923 16.0766173,8.17264363 C16.1920248,7.94391802 16.2702974,7.26593832 16.2456148,7.00460059 C16.2208433,6.74321878 16.2002523,6.14698975 15.2811725,5.70179013 C14.3620928,5.25659051 12.3879346,5.73854488 12.136573,5.84471058 C11.885167,5.95092035 10.8713151,6.27818746 10.8713151,6.27818746 C10.8713151,6.27818746 10.5071254,6.47412466 10.6329397,5.88626901 C10.7587539,5.29841336 11.3339681,2.96475116 9.17680347,3.00040414 C7.01959434,3.03605713 4.3589949,5.08462764 3.42421614,5.9931839 C2.4893929,6.9016961 -0.638573688,10.0013908 0.116445061,13.4038934 C0.116445061,13.4038934 0.458042459,14.4015161 1.03330119,14.9894158 C1.60851545,15.5772274 2.39955736,16.4679792 4.21521357,17.1270967 C6.03086978,17.7862143 7.7206673,18 9.60828088,18 C11.4958945,18 14.2283623,17.4120562 16.1699217,16.0226473 C18.1113921,14.6331944 18.9203567,13.1901958 18.9922696,12.1925732 C19.064138,11.1949506 18.6506722,9.88169543 17.0866889,9.24677255 Z M9.18031684,16.7091767 C5.58849648,17.2056303 2.41076457,15.7184291 2.0826425,13.3873229 C1.75452043,11.0562168 4.40031035,8.76406898 7.99208624,8.2676595 C11.5838177,7.77116188 14.7616385,9.25840715 15.0898051,11.5894692 C15.4178382,13.9205753 12.7720483,16.2127232 9.18031684,16.7091767 Z" id="Shape" stroke="#000000" stroke-width="0.699999988"></path>
    <path d="M11.9442818,12.2871072 C11.602654,10.6781319 9.78362077,9.69291939 7.88138265,10.0866566 C5.97918971,10.4803491 4.71404236,12.1038627 5.05571526,13.7127934 C5.39738815,15.3218132 7.21642142,16.3070257 9.11865954,15.9133778 C11.0208977,15.5196406 12.2859547,13.8961717 11.9442818,12.2871072 Z M7.34809468,13.8565259 C6.6822752,13.8565259 6.14252778,13.3236496 6.14252778,12.6663507 C6.14252778,12.0090072 6.6822752,11.4761308 7.34809468,11.4761308 C8.01391416,11.4761308 8.55366157,12.0090072 8.55366157,12.6663507 C8.55366157,13.3236496 8.01391416,13.8565259 7.34809468,13.8565259 Z M10.1862293,13.9557072 C9.86718699,13.9557072 9.60853825,13.7003511 9.60853825,13.3854149 C9.60853825,13.0704341 9.86718699,12.815078 10.1862293,12.815078 C10.5052715,12.815078 10.7638751,13.0704341 10.7638751,13.3854149 C10.7638751,13.7003957 10.5052263,13.9557072 10.1862293,13.9557072 Z" id="Shape" fill="#000000"></path>
  </g>
</svg>
