<?xml version="1.0" encoding="UTF-8"?>
<svg width="50px" height="50px" viewBox="0 0 50 50" version="1.1" xmlns="http://www.w3.org/2000/svg" xmlns:xlink="http://www.w3.org/1999/xlink">
    <!-- Generator: Sketch 51.3 (57544) - http://www.bohemiancoding.com/sketch -->
    <title>profile-food</title>
    <desc>Created with Sketch.</desc>
    <defs></defs>
    <g id="profile-food" stroke="none" stroke-width="1" fill="none" fill-rule="evenodd">
        <g id="Group" transform="translate(3.000000, 2.000000)" fill-rule="nonzero">
            <path d="M22.5,44.5236895 C10.474445,44.5236895 0.725806452,34.775051 0.725806452,22.749496 C0.725806452,10.7239409 10.474445,0.975302419 22.5,0.975302419 C34.525555,0.975302419 44.2741935,10.7239409 44.2741935,22.749496 C44.2741935,34.775051 34.525555,44.5236895 22.5,44.5236895 Z M22.5,43.0720766 C33.7238514,43.0720766 42.8225806,33.9733473 42.8225806,22.749496 C42.8225806,11.5256446 33.7238514,2.42691532 22.5,2.42691532 C11.2761486,2.42691532 2.17741935,11.5256446 2.17741935,22.749496 C2.17741935,33.9733473 11.2761486,43.0720766 22.5,43.0720766 Z" id="Oval-7" fill="#404040"></path>
            <g id="Group-1101" transform="translate(9.968498, 11.953125)" fill="#000000">
                <path d="M21.5927419,14.3951613 L21.5927419,21.078629 C21.5927419,21.3625657 21.3625657,21.5927419 21.078629,21.5927419 C20.7946923,21.5927419 20.5645161,21.3625657 20.5645161,21.078629 L20.5645161,-2.22044605e-16 C20.5645161,-0.283936716 20.7946923,-0.514112903 21.078629,-0.514112903 L21.3038105,-0.514112903 C23.3055346,-0.514112903 24.6774194,5.72023551 24.6774194,13.8810484 C24.6774194,14.1649851 24.4472432,14.3951613 24.1633065,14.3951613 L21.5927419,14.3951613 Z M21.5927419,13.3669355 L23.6472845,13.3669355 C23.6199209,9.69220123 23.299586,6.40045768 22.7639509,3.9663352 C22.3976066,2.30153211 21.9395372,1.17332853 21.5927419,0.727605643 L21.5927419,13.3669355 Z" id="Stroke-2073"></path>
                <path d="M0,1.02822581 C0,0.74428909 0.230176187,0.514112903 0.514112903,0.514112903 C0.798049619,0.514112903 1.02822581,0.74428909 1.02822581,1.02822581 L1.02822581,5.14112903 C1.02822581,6.56096248 2.17895688,7.71169355 3.59879032,7.71169355 C5.01797717,7.71169355 6.16935484,6.56058093 6.16935484,5.14112903 L6.16935484,1.02822581 C6.16935484,0.74428909 6.39953103,0.514112903 6.68346774,0.514112903 C6.96740446,0.514112903 7.19758065,0.74428909 7.19758065,1.02822581 L7.19758065,5.14112903 C7.19758065,7.12850736 5.58579761,8.73991935 3.59879032,8.73991935 C1.61108345,8.73991935 0,7.12883591 0,5.14112903 L0,1.02822581 Z" id="Stroke-2074"></path>
                <path d="M3.08467742,1.02822581 C3.08467742,0.74428909 3.31485361,0.514112903 3.59879032,0.514112903 C3.88272704,0.514112903 4.11290323,0.74428909 4.11290323,1.02822581 L4.11290323,21.078629 C4.11290323,21.3625657 3.88272704,21.5927419 3.59879032,21.5927419 C3.31485361,21.5927419 3.08467742,21.3625657 3.08467742,21.078629 L3.08467742,1.02822581 Z" id="Stroke-2075"></path>
                <path d="M18.5080645,14.3951613 C18.5080645,10.9877674 15.7461036,8.22580645 12.3387097,8.22580645 C8.93131575,8.22580645 6.16935484,10.9877674 6.16935484,14.3951613 C6.16935484,17.8025552 8.93131575,20.5645161 12.3387097,20.5645161 C15.7461036,20.5645161 18.5080645,17.8025552 18.5080645,14.3951613 Z M19.5362903,14.3951613 C19.5362903,18.3704287 16.313977,21.5927419 12.3387097,21.5927419 C8.36344232,21.5927419 5.14112903,18.3704287 5.14112903,14.3951613 C5.14112903,10.4198939 8.36344232,7.19758065 12.3387097,7.19758065 C16.313977,7.19758065 19.5362903,10.4198939 19.5362903,14.3951613 Z" id="Stroke-2076"></path>
                <path d="M16.3179435,13.6336573 C16.3179435,14.0961316 16.1592288,14.5795095 15.8702154,15.0851368 C15.5409462,15.6611916 15.0475212,16.2578954 14.4324063,16.8649791 C14.0403084,17.2519577 13.6218722,17.6202808 13.2035114,17.9587765 C12.9518873,18.1623656 12.7548379,18.3117856 12.6391572,18.3950963 C12.4597055,18.5243335 12.2177138,18.5243335 12.0382622,18.3950963 C11.9225815,18.3117856 11.7255321,18.1623656 11.473908,17.9587765 C11.0555472,17.6202808 10.637111,17.2519577 10.2450131,16.8649791 C9.62989816,16.2578954 9.13647316,15.6611916 8.80720392,15.0851368 C8.51819055,14.5795095 8.35947581,14.0961316 8.35947581,13.6336573 C8.35947581,11.1855768 11.0785074,10.4437312 12.3387097,12.1796647 C13.598912,10.4437312 16.3179435,11.1855768 16.3179435,13.6336573 Z M12.5567583,17.1594276 C12.9505352,16.8408227 13.3442367,16.4942719 13.710134,16.1331519 C14.2643068,15.5862147 14.7020211,15.0568823 14.9775289,14.5748829 C15.1850555,14.2118163 15.2897177,13.8930594 15.2897177,13.6336573 C15.2897177,11.9631126 13.2904681,11.6818407 12.8382774,13.54224 C12.7110147,14.0658232 11.9664046,14.0658232 11.8391419,13.54224 C11.3869513,11.6818407 9.38770161,11.9631126 9.38770161,13.6336573 C9.38770161,13.8930594 9.49236389,14.2118163 9.69989043,14.5748829 C9.97539824,15.0568823 10.4131126,15.5862147 10.9672853,16.1331519 C11.3331826,16.4942719 11.7268842,16.8408227 12.1206611,17.1594276 C12.1997357,17.2234069 12.272763,17.2814523 12.3387097,17.3330875 C12.4046564,17.2814523 12.4776836,17.2234069 12.5567583,17.1594276 Z" id="Stroke-2077"></path>
            </g>
        </g>
    </g>
</svg>