<?xml version="1.0" encoding="UTF-8"?>
<svg width="50px" height="50px" viewBox="0 0 50 50" version="1.1" xmlns="http://www.w3.org/2000/svg" xmlns:xlink="http://www.w3.org/1999/xlink">
    <!-- Generator: Sketch 51.3 (57544) - http://www.bohemiancoding.com/sketch -->
    <title>grid-layout</title>
    <desc>Created with Sketch.</desc>
    <defs></defs>
    <g id="grid-layout" stroke="none" stroke-width="1" fill="none" fill-rule="evenodd">
        <g transform="translate(1.000000, 1.000000)" fill="#404040" fill-rule="nonzero" id="Shape">
            <path d="M48,48 L27.3,48 L27.3,27.3 L48,27.3 L48,48 Z M30.3,45 L45,45 L45,30.3 L30.3,30.3 L30.3,45 Z M20.7,48 L0,48 L0,27.3 L20.7,27.3 L20.7,48 Z M3,45 L17.7,45 L17.7,30.3 L3,30.3 L3,45 Z M48,20.7 L27.3,20.7 L27.3,0 L48,0 L48,20.7 Z M30.3,17.7 L45,17.7 L45,3 L30.3,3 L30.3,17.7 Z M20.7,20.7 L0,20.7 L0,0 L20.7,0 L20.7,20.7 Z M3,17.7 L17.7,17.7 L17.7,3 L3,3 L3,17.7 Z"></path>
        </g>
    </g>
</svg>