curl 'https://api-gateway.rewardstyle.com/api/ltk/v2/product_details/?ids%5B%5D=148815882:2&ids%5B%5D=148815856:2&ids%5B%5D=148815836:2&ids%5B%5D=85280042:2&ids%5B%5D=141599654:2&ids%5B%5D=54414412:2&ids%5B%5D=129348333:2&ids%5B%5D=141601893:2&ids%5B%5D=107891935:2&ids%5B%5D=32054680:2&ids%5B%5D=129227394:2&ids%5B%5D=134801310:2' \
  -H 'authority: api-gateway.rewardstyle.com' \
  -H 'accept: application/json, text/plain, */*' \
  -H 'user-agent: Mozilla/5.0 (X11; Linux x86_64) AppleWebKit/537.36 (KHTML, like Gecko) Chrome/85.0.4183.121 Safari/537.36' \
  -H 'origin: https://www.liketoknow.it' \
  -H 'sec-fetch-site: cross-site' \
  -H 'sec-fetch-mode: cors' \
  -H 'sec-fetch-dest: empty' \
  -H 'referer: https://www.liketoknow.it/ltk/1wHcRuwMjpQIpYlSdcRhdx' \
  -H 'accept-language: en-US,en;q=0.9,vi-VN;q=0.8,vi;q=0.7,fr-FR;q=0.6,fr;q=0.5,ru;q=0.4,zh-CN;q=0.3,zh;q=0.2,la;q=0.1' \
  --compressed