<?xml version="1.0" encoding="UTF-8"?>
<svg width="50px" height="50px" viewBox="0 0 50 50" version="1.1" xmlns="http://www.w3.org/2000/svg" xmlns:xlink="http://www.w3.org/1999/xlink">
    <!-- Generator: Sketch 51.3 (57544) - http://www.bohemiancoding.com/sketch -->
    <title>italic</title>
    <desc>Created with Sketch.</desc>
    <defs></defs>
    <g id="italic" stroke="none" stroke-width="1" fill="none" fill-rule="evenodd">
        <g transform="translate(4.000000, 1.000000)" fill="#404040" fill-rule="nonzero" id="Shape">
            <polygon points="13.6666667 0 13.6666667 10.2857143 21.2175001 10.2857143 9.53250001 37.7142856 0 37.7142856 0 48 27.3333334 48 27.3333334 37.7142856 19.7825001 37.7142856 31.4675003 10.2857143 41 10.2857143 41 0"></polygon>
        </g>
    </g>
</svg>