<?xml version="1.0" encoding="UTF-8"?>
<svg width="50px" height="50px" viewBox="0 0 50 50" version="1.1" xmlns="http://www.w3.org/2000/svg" xmlns:xlink="http://www.w3.org/1999/xlink">
    <!-- Generator: Sketch 51.3 (57544) - http://www.bohemiancoding.com/sketch -->
    <title>placeholder-avatar</title>
    <desc>Created with Sketch.</desc>
    <defs></defs>
    <g id="placeholder-avatar" stroke="none" stroke-width="1" fill="none" fill-rule="evenodd">
        <g transform="translate(1.000000, 1.000000)" fill-rule="nonzero">
            <circle id="Oval" fill="#404040" cx="24" cy="24" r="24"></circle>
            <g id="path-1" transform="translate(6.240000, 20.640000)" fill="#FFFFFF">
                <path d="M0,2.34357898 L0.379854864,2.34357898 L0.379854864,2.76202378 C0.493146816,2.59713739 0.612699216,2.47397582 0.738512112,2.39221258 C0.864270048,2.31077578 0.995245008,2.26986701 1.13160173,2.26986701 C1.23434981,2.26986701 1.34418206,2.30239819 1.46104358,2.36735179 L1.26713472,2.67786701 C1.18915382,2.64457421 1.12369382,2.62781899 1.07058994,2.62781899 C0.946644192,2.62781899 0.827146704,2.67824779 0.711932688,2.77915978 C0.596773584,2.88012619 0.509127408,3.03658061 0.448939344,3.24884938 C0.402809808,3.41199499 0.379854864,3.74193096 0.379854864,4.23833098 L0.379854864,5.20670534 L0,5.20670534 L0,2.34357898 Z M4.23838282,4.25670187 L4.55184408,4.41990187 C4.44893126,4.61998502 4.33020259,4.78128106 4.19554824,4.90400746 C4.06067424,5.02684262 3.90927048,5.12041066 3.74078779,5.18438506 C3.57236002,5.24835941 3.38185598,5.28045542 3.16916582,5.28045542 C2.69760101,5.28045542 2.32894906,5.12742826 2.06299027,4.82131944 C1.79719618,4.51499304 1.66418933,4.16895466 1.66418933,3.78304104 C1.66418933,3.41992109 1.77665755,3.09624106 2.00192352,2.81205547 C2.28726773,2.45073067 2.66909957,2.26985069 3.14780347,2.26985069 C3.64062077,2.26985069 4.03409482,2.45508269 4.32833544,2.82516586 C4.53740117,3.08661226 4.6438835,3.41290344 4.64745307,3.80414827 L2.04673507,3.80414827 C2.05381925,4.13674987 2.16112536,4.40929382 2.36848867,4.62188904 C2.57601672,4.83448426 2.83214554,4.94094504 3.13714973,4.94094504 C3.28432493,4.94094504 3.42749131,4.91570342 3.56670365,4.86489384 C3.70597099,4.81419302 3.82420541,4.74695462 3.92173646,4.66312426 C4.01926747,4.57918502 4.12487122,4.44372902 4.23838282,4.25670187 Z M4.23838282,3.48563626 C4.18868371,3.28925227 4.11646901,3.13219949 4.02146414,3.01469549 C3.92656906,2.89719149 3.80108573,2.80242667 3.64512389,2.73045547 C3.48905227,2.65848427 3.32512762,2.62252589 3.15307541,2.62252589 C2.86926883,2.62252589 2.62555109,2.71293869 2.42164747,2.89360109 C2.27271494,3.02514029 2.16002707,3.22261229 2.08396819,3.48563626 L4.23838282,3.48563626 Z M4.81478798,2.34357902 L5.19733378,2.34357902 L6.08318582,4.42258378 L7.00544726,2.34357902 L7.07277446,2.34357902 L8.00113157,4.42258378 L8.90422733,2.34357902 L9.29100158,2.34357902 L8.03539925,5.20670534 L7.96631477,5.20670534 L7.04218618,3.15675019 L6.11849688,5.20670534 L6.04930258,5.20670534 L4.81478798,2.34357902 Z M12.4641653,2.34356813 L12.4641653,5.2066945 L12.0976002,5.2066945 L12.0976002,4.71453768 C11.9418031,4.90238088 11.7669502,5.04360326 11.5730413,5.13836808 C11.3791325,5.23296965 11.1668816,5.28046085 10.9367281,5.28046085 C10.527603,5.28046085 10.1783913,5.13347208 9.88881859,4.8394945 C9.59930074,4.5457345 9.45437707,4.18827206 9.45437707,3.7672705 C9.45437707,3.3550273 9.6005089,3.00240653 9.89277254,2.70935371 C10.1849263,2.41640971 10.5365543,2.26985611 10.9473269,2.26985611 C11.1847294,2.26985611 11.3993965,2.31990413 11.5916579,2.41994573 C11.7836447,2.5199329 11.9524568,2.66985931 12.0976002,2.86994251 L12.0976002,2.34356813 L12.4641653,2.34356813 Z M10.9779701,2.62514251 C10.7709363,2.62514251 10.579993,2.6754625 10.4048105,2.77642891 C10.229628,2.87706893 10.0904157,3.01872653 9.98678894,3.20085773 C9.88338187,3.3832609 9.83159597,3.57578251 9.83159597,3.7791841 C9.83159597,3.9807361 9.88382122,4.17342086 9.98821675,4.35734731 C10.0926123,4.54138248 10.2327583,4.68467208 10.4087096,4.78721606 C10.5846608,4.8897601 10.7735723,4.94095046 10.9753342,4.94095046 C11.1787984,4.94095046 11.3714991,4.88997768 11.5536559,4.78852166 C11.7358676,4.6869025 11.8760136,4.54921608 11.9743135,4.3758433 C12.0725035,4.20230731 12.1214887,4.00706568 12.1214887,3.78968328 C12.1214887,3.4584961 12.0114917,3.18165451 11.7912231,2.9591041 C11.5710094,2.7364993 11.2998885,2.62514251 10.9779701,2.62514251 Z M13.0812743,2.34357898 L13.4611292,2.34357898 L13.4611292,2.76202378 C13.5744761,2.59713739 13.6940285,2.47397582 13.8197864,2.39221258 C13.9455444,2.31077578 14.0765193,2.26986701 14.212931,2.26986701 C14.3156242,2.26986701 14.4254564,2.30239819 14.5423728,2.36735179 L14.3484091,2.67786701 C14.2704282,2.64457421 14.2049681,2.62781899 14.1518093,2.62781899 C14.0279185,2.62781899 13.9084211,2.67824779 13.793207,2.77915978 C13.6781028,2.88012619 13.5904018,3.03658061 13.5302686,3.24884938 C13.484139,3.41199499 13.4611292,3.74193096 13.4611292,4.23833098 L13.4611292,5.20670534 L13.0812743,5.20670534 L13.0812743,2.34357898 Z M17.7298092,1.23832334 L17.7298092,5.2066945 L17.3632441,5.2066945 L17.3632441,4.71453768 C17.2073921,4.90238088 17.0324293,5.04360326 16.8386303,5.13836808 C16.6445567,5.23296965 16.4325255,5.28046085 16.2023172,5.28046085 C15.7932469,5.28046085 15.4438156,5.13347208 15.1544076,4.8394945 C14.8648897,4.5457345 14.7199661,4.18827206 14.7199661,3.7672705 C14.7199661,3.3550273 14.8661528,3.00240653 15.1583066,2.70935371 C15.4505703,2.41640971 15.8019786,2.26985611 16.2129159,2.26985611 C16.4501536,2.26985611 16.6648757,2.31990413 16.8570272,2.41994573 C17.0492337,2.5199329 17.2180459,2.66985931 17.3632441,2.86994251 L17.3632441,1.23832334 L17.7298092,1.23832334 Z M16.2435591,2.62514251 C16.0364704,2.62514251 15.8454172,2.6754625 15.6704544,2.77642891 C15.495272,2.87706893 15.3560047,3.01872653 15.2524329,3.20085773 C15.148916,3.3832609 15.0972399,3.57578251 15.0972399,3.7791841 C15.0972399,3.9807361 15.1494102,4.17342086 15.2538058,4.35734731 C15.3581464,4.54138248 15.4982375,4.68467208 15.6743535,4.78721606 C15.8502498,4.8897601 16.0392162,4.94095046 16.2407584,4.94095046 C16.4441678,4.94095046 16.6370881,4.88997768 16.8192449,4.78852166 C17.0014566,4.6869025 17.1416026,4.54921608 17.2399025,4.3758433 C17.3380376,4.20230731 17.3871326,4.00706568 17.3871326,3.78968328 C17.3871326,3.4584961 17.2770807,3.18165451 17.0567572,2.9591041 C16.8364337,2.7364993 16.5654226,2.62514251 16.2435591,2.62514251 Z M18.8556722,4.14260328 C19.2956603,5.29305446 20.1669047,5.94694248 20.9939964,5.94694248 C21.7157042,5.94694248 22.1115946,5.43269928 22.1115946,4.87477286 C22.1115946,4.63954728 22.0323506,4.32555048 21.7859419,4.0816753 C21.1348014,3.44514091 20.0348863,3.58478568 19.2956603,2.8524529 C19.0054285,2.56478573 18.8028978,2.15509934 18.8028978,1.63215211 C18.8028978,0.76898736 19.4101055,0.054388944 20.298923,0.054388944 C20.9498988,0.054388944 21.4252528,0.403147344 21.6891248,0.403147344 C21.8827042,0.403147344 22.0939116,0.28101936 22.2083568,0.071742576 L22.2961677,0.071742576 L22.3842531,1.72800494 L22.3051739,1.72800494 C22.1907287,1.53624494 21.9971494,1.17013296 21.6540334,0.829969728 C21.2491368,0.42904176 20.7740024,0.193816176 20.3164413,0.193816176 C19.9204411,0.193816176 19.3131236,0.38546736 19.3131236,1.13531693 C19.3131236,1.37930093 19.4101055,1.64950574 19.6036848,1.84126574 C20.2636668,2.4950449 21.5042771,2.33810093 22.3316984,3.1574737 C22.604357,3.42778728 22.7626802,3.83741928 22.7626802,4.30825128 C22.7626802,5.43269928 22.0500336,6.09529128 21.0115696,6.09529128 C20.3252279,6.09529128 19.9469106,5.76410405 19.5245507,5.76410405 C19.163587,5.76410405 18.9700076,5.98203048 18.8205808,6.10399526 L18.741227,6.10399526 L18.741227,4.14260328 L18.8556722,4.14260328 Z M22.8731275,2.31204874 L23.6387132,2.31204874 L23.6387132,0.943344768 L24.3340063,0.673248768 L24.3340063,2.31204874 L25.6187142,2.31204874 L25.6187142,2.56479115 L24.3340063,2.56479115 L24.3340063,4.88348232 C24.3162684,5.4500039 24.545049,5.83379592 24.9322626,5.83379592 C25.4514946,5.83379592 25.7331595,5.2670567 25.7242631,4.7528135 L25.8825863,4.7528135 L25.8825863,4.87477834 C25.8825863,5.5632647 25.3987202,6.07772549 24.7122686,6.07772549 C24.3251648,6.07772549 23.6123535,5.8509863 23.6387132,4.9184615 L23.6387132,2.55597835 L22.8731275,2.55597835 L22.8731275,2.31204874 Z M25.9465031,2.31204878 L27.9352907,2.31204878 L27.9352907,2.46023438 L27.6184247,2.46023438 C27.451205,2.46023438 27.3367598,2.48640077 27.3367598,2.60831117 C27.3367598,2.65199434 27.3543879,2.70427277 27.3807476,2.76525514 L28.5599616,5.3106311 L29.3958949,3.32312717 C29.4576207,3.17483275 29.4838706,3.05292235 29.4838706,2.93955274 C29.4838706,2.62577357 29.2639864,2.46023438 29.0175228,2.46023438 L28.8415166,2.46023438 L28.8415166,2.31204878 L30.5310113,2.31204878 L30.5310113,2.45147597 C30.0029928,2.45147597 29.8006268,2.78260877 29.5454316,3.39275914 L28.0848273,6.85346947 C27.7502783,7.63791749 27.5039794,8.10880387 26.7737048,8.10880387 C26.4128509,8.10880387 26.0961496,7.92553027 26.0961496,7.53325186 C26.0961496,7.28932229 26.2985155,7.06269187 26.5537107,7.06269187 C26.8439425,7.06269187 27.0289549,7.27207747 27.0289549,7.50741187 C27.0289549,7.65565186 26.9583877,7.82129986 26.7911681,7.95185986 C27.2225343,8.02160069 27.5831685,7.64662147 27.8031625,7.11507907 L28.1816445,6.20861189 L26.571174,2.74790155 C26.4567288,2.51251277 26.3687532,2.46023438 26.1223995,2.46023438 L25.9465031,2.46023438 L25.9465031,2.31204878 Z M30.770215,5.8509972 C30.9726359,5.8509972 31.0783494,5.7813108 31.0783494,5.528514 L31.0783494,0.873669264 C31.0783494,0.48144528 30.9639042,0.28968528 30.5503308,0.28968528 L30.3918978,0.28968528 L30.3918978,0.14149968 C30.9199713,0.14149968 31.2806604,0.115333296 31.7735327,0.06300048 L31.7735327,5.528514 C31.7735327,5.79001478 31.8790265,5.8509972 32.0814474,5.8509972 L32.4246732,5.8509972 L32.4246732,5.999346 L30.4357758,5.999346 L30.4357758,5.8509972 L30.770215,5.8509972 Z M36.1040757,5.22350952 C35.6553012,5.8337687 35.1535325,6.09526949 34.5111785,6.09526949 C33.4289464,6.09526949 32.7600679,5.1362519 32.7600679,4.20361834 C32.7600679,3.15750634 33.5257635,2.26833835 34.5904225,2.26833835 C35.3910996,2.26833835 36.0775512,2.93087597 36.1304355,3.82869355 L33.5697513,3.82869355 L33.5697513,4.31693352 C33.5697513,5.3890487 34.0800869,5.88604709 34.7312824,5.88604709 C35.241618,5.88604709 35.6553012,5.61567912 35.9807341,5.1450647 L36.1040757,5.22350952 Z M35.2679777,3.69813355 C35.3559533,3.49745194 35.3910996,3.32309995 35.3910996,3.17485997 C35.3910996,2.66067115 34.9687397,2.40803755 34.6081055,2.40803755 C34.0710807,2.40803755 33.596166,2.80896557 33.5697513,3.69813355 L35.2679777,3.69813355 Z M36.1304355,2.83799885 C35.9638749,2.83799885 35.8283968,2.70373963 35.8283968,2.53874443 C35.8283968,2.37374923 35.9638749,2.23954445 36.1304355,2.23954445 C36.2969961,2.23954445 36.4324742,2.37374923 36.4324742,2.53874443 C36.4324742,2.70373963 36.2969961,2.83799885 36.1304355,2.83799885 Z M36.1304355,2.27757005 C35.9850176,2.27757005 35.8666733,2.39469326 35.8666733,2.53874443 C35.8666733,2.68279565 35.9850176,2.79997325 36.1304355,2.79997325 C36.2758534,2.79997325 36.3940878,2.68279565 36.3940878,2.53874443 C36.3940878,2.39469326 36.2758534,2.27757005 36.1304355,2.27757005 Z M36.0115915,2.7019825 L36.0115915,2.37558254 L36.157888,2.37558254 C36.1870485,2.37558254 36.2095092,2.3785201 36.2248308,2.3843953 C36.2400426,2.39032493 36.2522889,2.40060653 36.2614049,2.41540334 C36.270521,2.4302545 36.275134,2.44662893 36.275134,2.46463531 C36.275134,2.48780971 36.2675006,2.50728494 36.2522889,2.52316973 C36.2372419,2.53905451 36.2139025,2.54911853 36.1822708,2.5534705 C36.1938032,2.55896491 36.2026447,2.56435051 36.2086306,2.56968173 C36.2212613,2.58132331 36.2332879,2.5957393 36.2447653,2.61314731 L36.3020429,2.7019825 L36.2472366,2.7019825 L36.2035783,2.63403691 C36.1909476,2.61445291 36.1802938,2.59943851 36.1722761,2.5890481 C36.163819,2.57865773 36.156625,2.5714225 36.15009,2.56723373 C36.1436099,2.5630993 36.1368552,2.56021613 36.1301005,2.5585297 C36.125158,2.5575505 36.1171403,2.55700651 36.1059923,2.55700651 L36.0552498,2.55700651 L36.0552498,2.7019825 L36.0115915,2.7019825 Z M36.0552498,2.51963371 L36.1489916,2.51963371 C36.1689262,2.51963371 36.1845224,2.51762093 36.1956703,2.51354093 C36.207038,2.50946093 36.2156049,2.50293293 36.2212613,2.49395693 C36.2271922,2.4849265 36.2302126,2.47513454 36.2302126,2.46463531 C36.2302126,2.44924013 36.2245013,2.43651053 36.2132435,2.42660971 C36.2018759,2.41660013 36.1838634,2.41164974 36.1595904,2.41164974 L36.0552498,2.41164974 L36.0552498,2.51963371 Z"></path>
            </g>
        </g>
    </g>
</svg>