%YAML 1.1
%TAG !u! tag:unity3d.com,2011:
--- !u!1 &3368896708443511431
GameObject:
  m_ObjectHideFlags: 0
  m_CorrespondingSourceObject: {fileID: 0}
  m_PrefabInstance: {fileID: 0}
  m_PrefabAsset: {fileID: 0}
  serializedVersion: 6
  m_Component:
  - component: {fileID: 3355746163626256100}
  - component: {fileID: 2086499968057973649}
  - component: {fileID: 3842638576484630181}
  m_Layer: 0
  m_Name: Layer1
  m_TagString: Untagged
  m_Icon: {fileID: 0}
  m_NavMeshLayer: 0
  m_StaticEditorFlags: 0
  m_IsActive: 1
--- !u!4 &3355746163626256100
Transform:
  m_ObjectHideFlags: 0
  m_CorrespondingSourceObject: {fileID: 0}
  m_PrefabInstance: {fileID: 0}
  m_PrefabAsset: {fileID: 0}
  m_GameObject: {fileID: 3368896708443511431}
  m_LocalRotation: {x: -0, y: -0, z: -0, w: 1}
  m_LocalPosition: {x: 0, y: 0, z: 0}
  m_LocalScale: {x: 1, y: 1, z: 1}
  m_Children: []
  m_Father: {fileID: 4817568383380006391}
  m_RootOrder: 0
  m_LocalEulerAnglesHint: {x: 0, y: 0, z: 0}
--- !u!1839735485 &2086499968057973649
Tilemap:
  m_ObjectHideFlags: 0
  m_CorrespondingSourceObject: {fileID: 0}
  m_PrefabInstance: {fileID: 0}
  m_PrefabAsset: {fileID: 0}
  m_GameObject: {fileID: 3368896708443511431}
  m_Enabled: 1
  m_Tiles:
  - first: {x: 2, y: -4, z: 0}
    second:
      serializedVersion: 2
      m_TileIndex: 9
      m_TileSpriteIndex: 17
      m_TileMatrixIndex: 0
      m_TileColorIndex: 0
      m_TileObjectToInstantiateIndex: 65535
      dummyAlignment: 0
      m_AllTileFlags: 1073741825
  - first: {x: 3, y: -4, z: 0}
    second:
      serializedVersion: 2
      m_TileIndex: 8
      m_TileSpriteIndex: 16
      m_TileMatrixIndex: 0
      m_TileColorIndex: 0
      m_TileObjectToInstantiateIndex: 65535
      dummyAlignment: 0
      m_AllTileFlags: 1073741825
  - first: {x: 4, y: -4, z: 0}
    second:
      serializedVersion: 2
      m_TileIndex: 7
      m_TileSpriteIndex: 15
      m_TileMatrixIndex: 0
      m_TileColorIndex: 0
      m_TileObjectToInstantiateIndex: 65535
      dummyAlignment: 0
      m_AllTileFlags: 1073741825
  - first: {x: 5, y: -4, z: 0}
    second:
      serializedVersion: 2
      m_TileIndex: 6
      m_TileSpriteIndex: 14
      m_TileMatrixIndex: 0
      m_TileColorIndex: 0
      m_TileObjectToInstantiateIndex: 65535
      dummyAlignment: 0
      m_AllTileFlags: 1073741825
  - first: {x: -3, y: -3, z: 0}
    second:
      serializedVersion: 2
      m_TileIndex: 0
      m_TileSpriteIndex: 0
      m_TileMatrixIndex: 0
      m_TileColorIndex: 0
      m_TileObjectToInstantiateIndex: 65535
      dummyAlignment: 0
      m_AllTileFlags: 1073741825
  - first: {x: -2, y: -3, z: 0}
    second:
      serializedVersion: 2
      m_TileIndex: 1
      m_TileSpriteIndex: 1
      m_TileMatrixIndex: 0
      m_TileColorIndex: 0
      m_TileObjectToInstantiateIndex: 65535
      dummyAlignment: 0
      m_AllTileFlags: 1073741825
  - first: {x: 2, y: -3, z: 0}
    second:
      serializedVersion: 2
      m_TileIndex: 11
      m_TileSpriteIndex: 13
      m_TileMatrixIndex: 0
      m_TileColorIndex: 0
      m_TileObjectToInstantiateIndex: 65535
      dummyAlignment: 0
      m_AllTileFlags: 1073741825
  - first: {x: 5, y: -3, z: 0}
    second:
      serializedVersion: 2
      m_TileIndex: 10
      m_TileSpriteIndex: 12
      m_TileMatrixIndex: 0
      m_TileColorIndex: 0
      m_TileObjectToInstantiateIndex: 65535
      dummyAlignment: 0
      m_AllTileFlags: 1073741825
  - first: {x: -3, y: -2, z: 0}
    second:
      serializedVersion: 2
      m_TileIndex: 2
      m_TileSpriteIndex: 2
      m_TileMatrixIndex: 0
      m_TileColorIndex: 0
      m_TileObjectToInstantiateIndex: 65535
      dummyAlignment: 0
      m_AllTileFlags: 1073741825
  - first: {x: -2, y: -2, z: 0}
    second:
      serializedVersion: 2
      m_TileIndex: 3
      m_TileSpriteIndex: 3
      m_TileMatrixIndex: 0
      m_TileColorIndex: 0
      m_TileObjectToInstantiateIndex: 65535
      dummyAlignment: 0
      m_AllTileFlags: 1073741825
  - first: {x: 2, y: -2, z: 0}
    second:
      serializedVersion: 2
      m_TileIndex: 13
      m_TileSpriteIndex: 7
      m_TileMatrixIndex: 0
      m_TileColorIndex: 0
      m_TileObjectToInstantiateIndex: 65535
      dummyAlignment: 0
      m_AllTileFlags: 1073741825
  - first: {x: 5, y: -2, z: 0}
    second:
      serializedVersion: 2
      m_TileIndex: 12
      m_TileSpriteIndex: 6
      m_TileMatrixIndex: 0
      m_TileColorIndex: 0
      m_TileObjectToInstantiateIndex: 65535
      dummyAlignment: 0
      m_AllTileFlags: 1073741825
  - first: {x: -3, y: -1, z: 0}
    second:
      serializedVersion: 2
      m_TileIndex: 4
      m_TileSpriteIndex: 4
      m_TileMatrixIndex: 0
      m_TileColorIndex: 0
      m_TileObjectToInstantiateIndex: 65535
      dummyAlignment: 0
      m_AllTileFlags: 1073741825
  - first: {x: -2, y: -1, z: 0}
    second:
      serializedVersion: 2
      m_TileIndex: 5
      m_TileSpriteIndex: 5
      m_TileMatrixIndex: 0
      m_TileColorIndex: 0
      m_TileObjectToInstantiateIndex: 65535
      dummyAlignment: 0
      m_AllTileFlags: 1073741825
  - first: {x: 2, y: -1, z: 0}
    second:
      serializedVersion: 2
      m_TileIndex: 17
      m_TileSpriteIndex: 11
      m_TileMatrixIndex: 0
      m_TileColorIndex: 0
      m_TileObjectToInstantiateIndex: 65535
      dummyAlignment: 0
      m_AllTileFlags: 1073741825
  - first: {x: 3, y: -1, z: 0}
    second:
      serializedVersion: 2
      m_TileIndex: 16
      m_TileSpriteIndex: 10
      m_TileMatrixIndex: 0
      m_TileColorIndex: 0
      m_TileObjectToInstantiateIndex: 65535
      dummyAlignment: 0
      m_AllTileFlags: 1073741825
  - first: {x: 4, y: -1, z: 0}
    second:
      serializedVersion: 2
      m_TileIndex: 15
      m_TileSpriteIndex: 9
      m_TileMatrixIndex: 0
      m_TileColorIndex: 0
      m_TileObjectToInstantiateIndex: 65535
      dummyAlignment: 0
      m_AllTileFlags: 1073741825
  - first: {x: 5, y: -1, z: 0}
    second:
      serializedVersion: 2
      m_TileIndex: 14
      m_TileSpriteIndex: 8
      m_TileMatrixIndex: 0
      m_TileColorIndex: 0
      m_TileObjectToInstantiateIndex: 65535
      dummyAlignment: 0
      m_AllTileFlags: 1073741825
  m_AnimatedTiles: {}
  m_TileAssetArray:
  - m_RefCount: 1
    m_Data: {fileID: 11400000, guid: 7d378ea20fd379c40a8ab9da94c759aa, type: 2}
  - m_RefCount: 1
    m_Data: {fileID: 11400000, guid: d2ebad373557cd44384a876665ccc499, type: 2}
  - m_RefCount: 1
    m_Data: {fileID: 11400000, guid: f514f030041ed984a806ce72403b39d2, type: 2}
  - m_RefCount: 1
    m_Data: {fileID: 11400000, guid: 8f6c86650c433c341987bd052c81c9cd, type: 2}
  - m_RefCount: 1
    m_Data: {fileID: 11400000, guid: cbb016314c56d2d46a560547467c07de, type: 2}
  - m_RefCount: 1
    m_Data: {fileID: 11400000, guid: d8faaffbdd9e79542ad8e8601d798117, type: 2}
  - m_RefCount: 1
    m_Data: {fileID: 11400000, guid: a0d5a4bea78636549bd572047e09daf6, type: 2}
  - m_RefCount: 1
    m_Data: {fileID: 11400000, guid: 2c789939c9fe54b4389255f8b5b9cc82, type: 2}
  - m_RefCount: 1
    m_Data: {fileID: 11400000, guid: ae90b07ed354f61429f9729d0eebc515, type: 2}
  - m_RefCount: 1
    m_Data: {fileID: 11400000, guid: 027579f34c67c9e4f98ea3e0cafa4e81, type: 2}
  - m_RefCount: 1
    m_Data: {fileID: 11400000, guid: 2fdf48df186d56b48a2e9e0959463e1b, type: 2}
  - m_RefCount: 1
    m_Data: {fileID: 11400000, guid: 52911812851fd594898af43e3fd6aaf9, type: 2}
  - m_RefCount: 1
    m_Data: {fileID: 11400000, guid: 28e43d89b329a904bbc37c88efe40fa6, type: 2}
  - m_RefCount: 1
    m_Data: {fileID: 11400000, guid: e6b3e2f504e13ce41a0af942a7d2ac6b, type: 2}
  - m_RefCount: 1
    m_Data: {fileID: 11400000, guid: 3d501a73af9752e4ca3b9eec2e82af61, type: 2}
  - m_RefCount: 1
    m_Data: {fileID: 11400000, guid: 61895ab8389ae5a459e8b024f4f085c1, type: 2}
  - m_RefCount: 1
    m_Data: {fileID: 11400000, guid: fd300714cd615ac46bb97829a0e53d63, type: 2}
  - m_RefCount: 1
    m_Data: {fileID: 11400000, guid: ef3f828cfc6e8b645b105fec50cb12f0, type: 2}
  m_TileSpriteArray:
  - m_RefCount: 1
    m_Data: {fileID: 5299400320964040512, guid: 5fad4bf1bc675184da95be4a4ae683fb, type: 3}
  - m_RefCount: 1
    m_Data: {fileID: -7255497285719700247, guid: 5fad4bf1bc675184da95be4a4ae683fb, type: 3}
  - m_RefCount: 1
    m_Data: {fileID: 6891631753638271631, guid: 5fad4bf1bc675184da95be4a4ae683fb, type: 3}
  - m_RefCount: 1
    m_Data: {fileID: 475435623110610922, guid: 5fad4bf1bc675184da95be4a4ae683fb, type: 3}
  - m_RefCount: 1
    m_Data: {fileID: -1347532211411968617, guid: 5fad4bf1bc675184da95be4a4ae683fb, type: 3}
  - m_RefCount: 1
    m_Data: {fileID: -7645372005702169758, guid: 5fad4bf1bc675184da95be4a4ae683fb, type: 3}
  - m_RefCount: 1
    m_Data: {fileID: -7746973121676557249, guid: e7b39f53f390e4f48a91750462cb30e9, type: 3}
  - m_RefCount: 1
    m_Data: {fileID: 8054514196659142189, guid: e7b39f53f390e4f48a91750462cb30e9, type: 3}
  - m_RefCount: 1
    m_Data: {fileID: -835300670519728832, guid: e7b39f53f390e4f48a91750462cb30e9, type: 3}
  - m_RefCount: 1
    m_Data: {fileID: 1177882447611923154, guid: e7b39f53f390e4f48a91750462cb30e9, type: 3}
  - m_RefCount: 1
    m_Data: {fileID: 2311940087313822035, guid: e7b39f53f390e4f48a91750462cb30e9, type: 3}
  - m_RefCount: 1
    m_Data: {fileID: -5397573168801136404, guid: e7b39f53f390e4f48a91750462cb30e9, type: 3}
  - m_RefCount: 1
    m_Data: {fileID: 1113114319143636006, guid: e7b39f53f390e4f48a91750462cb30e9, type: 3}
  - m_RefCount: 1
    m_Data: {fileID: 9203586485821557984, guid: e7b39f53f390e4f48a91750462cb30e9, type: 3}
  - m_RefCount: 1
    m_Data: {fileID: 3649673460643959365, guid: e7b39f53f390e4f48a91750462cb30e9, type: 3}
  - m_RefCount: 1
    m_Data: {fileID: -3905034432879570366, guid: e7b39f53f390e4f48a91750462cb30e9, type: 3}
  - m_RefCount: 1
    m_Data: {fileID: -4949906954940877785, guid: e7b39f53f390e4f48a91750462cb30e9, type: 3}
  - m_RefCount: 1
    m_Data: {fileID: 4309086698426710061, guid: e7b39f53f390e4f48a91750462cb30e9, type: 3}
  m_TileMatrixArray:
  - m_RefCount: 18
    m_Data:
      e00: 1
      e01: 0
      e02: 0
      e03: 0
      e10: 0
      e11: 1
      e12: 0
      e13: 0
      e20: 0
      e21: 0
      e22: 1
      e23: 0
      e30: 0
      e31: 0
      e32: 0
      e33: 1
  m_TileColorArray:
  - m_RefCount: 18
    m_Data: {r: 1, g: 1, b: 1, a: 1}
  - m_RefCount: 0
    m_Data: {r: -7.74126e-26, g: -7.74126e-26, b: -7.74126e-26, a: -7.74126e-26}
  - m_RefCount: 0
    m_Data: {r: -7.74126e-26, g: -7.74126e-26, b: -7.74126e-26, a: -7.74126e-26}
  - m_RefCount: 0
    m_Data: {r: -7.74126e-26, g: -7.74126e-26, b: -7.74126e-26, a: -7.74126e-26}
  - m_RefCount: 0
    m_Data: {r: -7.74126e-26, g: -7.74126e-26, b: -7.74126e-26, a: -7.74126e-26}
  - m_RefCount: 0
    m_Data: {r: -7.74126e-26, g: -7.74126e-26, b: -7.74126e-26, a: -7.74126e-26}
  - m_RefCount: 0
    m_Data: {r: -7.74126e-26, g: -7.74126e-26, b: -7.74126e-26, a: -7.74126e-26}
  - m_RefCount: 0
    m_Data: {r: -3.4590195e-27, g: -3.4590195e-27, b: -3.4590195e-27, a: -3.4590195e-27}
  - m_RefCount: 0
    m_Data: {r: -3.4590195e-27, g: -3.4590195e-27, b: -3.4590195e-27, a: -3.4590195e-27}
  - m_RefCount: 0
    m_Data: {r: -3.4590195e-27, g: -3.4590195e-27, b: -3.4590195e-27, a: -3.4590195e-27}
  - m_RefCount: 0
    m_Data: {r: -3.4590195e-27, g: -3.4590195e-27, b: -3.4590195e-27, a: -3.4590195e-27}
  - m_RefCount: 0
    m_Data: {r: -3.4590195e-27, g: -3.4590195e-27, b: -3.4590195e-27, a: -3.4590195e-27}
  - m_RefCount: 0
    m_Data: {r: -3.4590195e-27, g: -3.4590195e-27, b: -3.4590195e-27, a: -3.4590195e-27}
  m_TileObjectToInstantiateArray: []
  m_AnimationFrameRate: 1
  m_Color: {r: 1, g: 1, b: 1, a: 1}
  m_Origin: {x: -4, y: -5, z: 0}
  m_Size: {x: 10, y: 6, z: 1}
  m_TileAnchor: {x: 0.5, y: 0.5, z: 0}
  m_TileOrientation: 0
  m_TileOrientationMatrix:
    e00: 1
    e01: 0
    e02: 0
    e03: 0
    e10: 0
    e11: 1
    e12: 0
    e13: 0
    e20: 0
    e21: 0
    e22: 1
    e23: 0
    e30: 0
    e31: 0
    e32: 0
    e33: 1
--- !u!483693784 &3842638576484630181
TilemapRenderer:
  m_ObjectHideFlags: 0
  m_CorrespondingSourceObject: {fileID: 0}
  m_PrefabInstance: {fileID: 0}
  m_PrefabAsset: {fileID: 0}
  m_GameObject: {fileID: 3368896708443511431}
  m_Enabled: 1
  m_CastShadows: 0
  m_ReceiveShadows: 0
  m_DynamicOccludee: 0
  m_MotionVectors: 1
  m_LightProbeUsage: 0
  m_ReflectionProbeUsage: 0
  m_RayTracingMode: 0
  m_RayTraceProcedural: 0
  m_RenderingLayerMask: 1
  m_RendererPriority: 0
  m_Materials:
  - {fileID: 10754, guid: 0000000000000000f000000000000000, type: 0}
  m_StaticBatchInfo:
    firstSubMesh: 0
    subMeshCount: 0
  m_StaticBatchRoot: {fileID: 0}
  m_ProbeAnchor: {fileID: 0}
  m_LightProbeVolumeOverride: {fileID: 0}
  m_ScaleInLightmap: 1
  m_ReceiveGI: 1
  m_PreserveUVs: 0
  m_IgnoreNormalsForChartDetection: 0
  m_ImportantGI: 0
  m_StitchLightmapSeams: 1
  m_SelectedEditorRenderState: 0
  m_MinimumChartSize: 4
  m_AutoUVMaxDistance: 0.5
  m_AutoUVMaxAngle: 89
  m_LightmapParameters: {fileID: 0}
  m_SortingLayerID: 0
  m_SortingLayer: 0
  m_SortingOrder: 0
  m_ChunkSize: {x: 32, y: 32, z: 32}
  m_ChunkCullingBounds: {x: 0, y: 0, z: 0}
  m_MaxChunkCount: 16
  m_MaxFrameAge: 16
  m_SortOrder: 0
  m_Mode: 0
  m_DetectChunkCullingBounds: 0
  m_MaskInteraction: 0
--- !u!1 &4666695098300578100
GameObject:
  m_ObjectHideFlags: 0
  m_CorrespondingSourceObject: {fileID: 0}
  m_PrefabInstance: {fileID: 0}
  m_PrefabAsset: {fileID: 0}
  serializedVersion: 6
  m_Component:
  - component: {fileID: 4817568383380006391}
  - component: {fileID: 6300486154638973830}
  m_Layer: 31
  m_Name: Farm
  m_TagString: Untagged
  m_Icon: {fileID: 0}
  m_NavMeshLayer: 0
  m_StaticEditorFlags: 0
  m_IsActive: 1
--- !u!4 &4817568383380006391
Transform:
  m_ObjectHideFlags: 0
  m_CorrespondingSourceObject: {fileID: 0}
  m_PrefabInstance: {fileID: 0}
  m_PrefabAsset: {fileID: 0}
  m_GameObject: {fileID: 4666695098300578100}
  m_LocalRotation: {x: 0, y: 0, z: 0, w: 1}
  m_LocalPosition: {x: 0, y: 0, z: 0}
  m_LocalScale: {x: 1, y: 1, z: 1}
  m_Children:
  - {fileID: 3355746163626256100}
  m_Father: {fileID: 0}
  m_RootOrder: 0
  m_LocalEulerAnglesHint: {x: 0, y: 0, z: 0}
--- !u!156049354 &6300486154638973830
Grid:
  m_ObjectHideFlags: 0
  m_CorrespondingSourceObject: {fileID: 0}
  m_PrefabInstance: {fileID: 0}
  m_PrefabAsset: {fileID: 0}
  m_GameObject: {fileID: 4666695098300578100}
  m_Enabled: 1
  m_CellSize: {x: 1, y: 1, z: 0}
  m_CellGap: {x: 0, y: 0, z: 0}
  m_CellLayout: 0
  m_CellSwizzle: 0
--- !u!114 &7396904007505001860
MonoBehaviour:
  m_ObjectHideFlags: 0
  m_CorrespondingSourceObject: {fileID: 0}
  m_PrefabInstance: {fileID: 0}
  m_PrefabAsset: {fileID: 0}
  m_GameObject: {fileID: 0}
  m_Enabled: 1
  m_EditorHideFlags: 0
  m_Script: {fileID: 12395, guid: 0000000000000000e000000000000000, type: 0}
  m_Name: Palette Settings
  m_EditorClassIdentifier: 
  cellSizing: 0
  m_TransparencySortMode: 0
  m_TransparencySortAxis: {x: 0, y: 0, z: 1}
