<?xml version="1.0" standalone="no"?>
<svg version="1.1" id="Layer_1" xmlns="http://www.w3.org/2000/svg" xmlns:xlink="http://www.w3.org/1999/xlink" x="0px" y="0px" width="595.28px" height="595.28px" viewBox="0 0 595.28 595.28" enable-background="new 0 0 595.28 595.28" xml:space="preserve">
<path id="color_x5F_2" fill="#ffdd2d" d="M274.77,477.021c-0.153,0.01-0.307,0.018-0.461,0.027l25.516-31.292
	c-4.299,5.699-8.928,11.162-13.505,16.661c-0.104,0.075-0.167,0.144-0.163,0.196C282.235,467.327,278.359,472.072,274.77,477.021z
	 M324.224,467.283c0.889,1.983,1.631,4.784,3.019,6.491c-0.023,0.002-0.047,0.005-0.071,0.008c0.129,0.072,0.214,0.167,0.242,0.281
	c5.016,0.565,9.999,1.434,14.981,2.316c-6.588-6.942-12.636-14.475-18.82-21.751c-3.333-3.92-6.656-7.847-9.988-11.766
	c1.58,3.718,3.172,7.431,4.785,11.134C320.304,458.434,322.245,462.867,324.224,467.283z M309.467,433.932l-0.086,0.105
	c0.064,0.003,0.127,0.009,0.188,0.016L309.467,433.932z M323.73,473.705c-0.985-1.758-1.649-3.956-2.404-5.646
	c-1.832-4.1-3.633-8.213-5.428-12.329c-0.012,0-0.021,0.003-0.033,0.003c-4,0-8,0-12,0c-1.966,0-1.407-2.135,0.254-2.135
	c3.614,0,7.229,0,10.844,0c-2.01-4.626-4.02-9.254-5.954-13.911c-0.142-0.342-0.488-0.966-0.832-1.672
	c-5.458,8.321-11.898,15.936-18.281,23.59c3.015,0,6.03,0,9.045,0c1.392,0-1.327,1.121-1.896,1.121c-2.693,0-5.387,0-8.081,0
	c-3.836,4.61-7.628,9.252-11.155,14.083c2.322-0.165,4.644-0.344,6.965-0.533c4.743-0.479,10.126-1.078,14.026-1.678
	c3.279-0.504,6.653-0.721,10.016-0.762c2.266-0.198,4.529-0.349,6.785-0.394C318.325,473.39,321.033,473.493,323.73,473.705z
	 M436.38,434.433c-0.425,0.603-0.856,1.201-1.282,1.803c-5.939-1.261-26.607-5.577-47.667-9.156
	c15.349,2.097,30.634,5.009,45.864,8.645c0.669,0.16,3.198-0.919,2.383-1.113c-25.795-6.158-51.772-10.312-77.962-11.832
	c-6.902-0.74-12.814-1.096-16.917-0.847c-1.125,0.068-2.256,0.141-3.388,0.215c-9.921-0.042-19.871,0.298-29.856,1.093
	c-12.559,0.998-25.051,2.471-37.539,3.519l-33.485,1.116c7.649-10.709,15.306-21.417,22.938-32.145c29.798,0,59.597,0,89.394,0
	c1.656,0,2.224-2.121,0.258-2.121c-29.382,0-58.764,0-88.145,0c5.268-7.409,10.518-14.832,15.75-22.268
	c7.182-9.914,14.729-20.531,22.16-31.333c28.516,0,57.029,0,85.544,0c1.102,0,3.079-1.672,1.119-1.672c-28.505,0-57.01,0-85.515,0
	c0.701-1.022,1.401-2.046,2.1-3.071c5.112-7.504,10.125-15.085,14.916-22.482c8.835,0,17.672,0,26.507,0
	c0.628,0,3.31-1.219,1.869-1.219c-9.195,0-18.392,0-27.587,0c0.572-0.885,1.14-1.767,1.705-2.646
	c12.693-19.114,25.07-38.436,36.951-58.074c0.746,2.339,1.973,4.811,2.168,5.299c3.908,9.808,8.046,19.525,12.171,29.244
	c12.228,28.807,24.72,57.503,37.32,86.147c7.303,16.601,14.628,33.194,22.163,49.69c1.898,4.155,3.79,8.318,5.82,12.411
	C436.07,433.928,436.143,434.222,436.38,434.433z M379.924,313.065c-5,0-9.999,0-14.998,0c-0.627,0-3.309,1.215-1.871,1.215
	c5,0,9.999,0,14.998,0C378.68,314.28,381.361,313.065,379.924,313.065z M399.857,367.225c1.651,0,2.229-2.107,0.262-2.107
	c-31.499,0-62.998,0-94.496,0c-1.651,0-2.229,2.107-0.262,2.107C336.86,367.225,368.359,367.225,399.857,367.225z M417.021,393.739
	c-12,0-23.999,0-35.998,0c-1.225,0-3.031,1.859-1.07,1.859c12,0,23.999,0,35.998,0C417.176,395.599,418.982,393.739,417.021,393.739
	z M456.41,466.513l6.389,0.752c0,0,4.844-1.273,9.959-2.246c-4.283,0.247-8.602,0.66-12.977,1.186
	C458.656,466.339,457.532,466.438,456.41,466.513z M420.376,462.22l8.7-13.573c2.903-4.013,5.803-8.03,8.668-12.07
	c0.691,0.802,2.806,0.373,2.891-0.744c0.025-0.333-0.135-0.552-0.388-0.679c-0.089-0.136-0.167-0.279-0.245-0.422
	c4.618,0,9.236,0,13.855,0c1.658,0,2.221-2.129,0.254-2.129c-4.525,0-9.052,0-13.578,0c4.65-6.648,9.172-13.384,13.454-20.275
	c0.738,1.825,1.804,3.67,2.436,5.171c2.562,6.087,5.189,12.147,7.826,18.202c2.627,6.032,5.274,12.056,7.968,18.06
	c0.945,2.108,1.962,6.354,3.751,7.951c0.704,0.628,2.261,0.362,2.703-0.504c0.003-0.006,0.006-0.012,0.009-0.018
	c0.205-0.4,0.094-0.665-0.173-0.819c-1.73-1.71-2.753-5.962-3.694-8.061c-2.593-5.779-5.135-11.58-7.666-17.386
	c-2.54-5.827-5.061-11.662-7.536-17.516c-0.072-0.17-0.142-0.342-0.213-0.512c0.329,0.386,0.661,0.77,0.989,1.156
	c4.839,5.688,9.662,11.392,14.499,17.081c1.202,1.414,2.399,2.836,3.596,4.262c-0.958,0.556-0.181,0.834,0.696,0.831
	c6.822,8.14,13.633,16.374,20.973,24.026c-11.402-1.924-22.777-1.833-34.561-0.596c-9.779,1.027-18.985,1.257-28.776,0.164
	C431.322,463.21,425.863,462.556,420.376,462.22z M439.907,452.429c8.999,0,17.999,0,26.998,0c1.005,0,3.112-1.525,1.158-1.525
	c-8.999,0-17.999,0-26.998,0C440.061,450.903,437.953,452.429,439.907,452.429z M503.944,435.117
	c1.309,0.093,2.62,0.209,3.934,0.347c-13.828-14.096-26.488-29.489-38.936-44.923c-0.368,0.142-0.712,0.241-0.892,0.241
	c-8,0-16,0-24,0c-1.443,0,1.234-1.227,1.867-1.227c7.41,0,14.82,0,22.23,0c-4.151-5.15-8.282-10.301-12.428-15.405
	c-2.18-2.685-4.344-5.382-6.519-8.071c-0.354,0.441-1.196,0.917-1.78,0.917c-5.5,0-10.999,0-16.498,0
	c-1.959,0,0.038-1.65,1.125-1.65c5.5,0,10.999,0,16.498,0c0.025,0,0.042,0.003,0.065,0.004
	c-19.994-24.737-39.764-49.653-59.498-74.597c-7.888-9.969-15.758-19.952-23.689-29.887c-1.191-1.492-2.383-2.984-3.58-4.473
	c1.339,3.272,2.774,6.512,4.115,9.738c4.968,11.961,10.05,23.875,15.158,35.777c12.493,29.107,25.151,58.145,37.993,87.1
	c4.883,11.01,9.777,22.017,14.802,32.963c1.47,3.203,2.942,6.407,4.48,9.579c5.153-7.391,10.161-14.879,14.827-22.589
	c0.112-0.328,0.556-0.598,0.804-0.718c0.005-0.003,0.011-0.005,0.017-0.008c0.475-0.231,2.223-0.299,2.1,0.503
	c2.042,1.199,4.365,5.114,5.45,6.389c4.864,5.71,9.706,11.439,14.564,17.155c1.651,1.943,3.294,3.903,4.937,5.866
	c4.578-1.963,9.249-2.861,13.978-3.139C498.088,434.239,501.224,434.497,503.944,435.117z M511.467,437.932l-0.379-0.466
	c-0.132,0.03-0.262,0.053-0.392,0.063C511.181,437.771,511.467,437.932,511.467,437.932z M491.396,413.276l-52.611-64.63
	c6.514,8.12,13.044,16.228,19.608,24.306C469.286,386.356,480.068,400.083,491.396,413.276z M287.162,426.187l7.637-0.255
	c0,0,9.622-1.069,22.263-2.191c-4.963,0.232-9.933,0.554-14.911,0.999C297.146,425.188,292.15,425.688,287.162,426.187z
	 M102.281,188.757c0.249-0.121,0.529-0.194,0.807-0.222l-0.291-0.6L102,188.234C102.164,188.366,102.261,188.552,102.281,188.757z
	 M95.442,239.218c-0.425-3.769-0.791-7.371,0.346-11.076c2.484-8.096,7.704-14.766,15.237-18.36
	c-3.914-6.271-7.638-12.712-9.508-19.796c-0.006-0.023-0.004-0.046-0.008-0.07c-0.09,0.047-0.186,0.089-0.29,0.126
	c-11.647,4.132-16.795,15.894-16.147,27.452c0.33,5.896,0.418,12.441-5.027,15.28c-0.35,0.282-0.703,0.431-1.048,0.485
	c4.374,6.743,9.886,12.752,13.979,19.679c0.33-0.175,0.617-0.39,0.883-0.622l2.091-5.016
	C96.197,244.479,95.681,241.327,95.442,239.218z M91.445,193.638c-1.526,1.16-3.155,2.591-4.648,4.298
	c-2.229,2.548-3.393,6.463-4.001,9.859c0.118-0.497,0.251-0.998,0.407-1.505C84.718,201.354,87.639,196.997,91.445,193.638z
	 M76.129,231.936l0.512,0.778c0.008-0.082,0.019-0.165,0.053-0.248C76.342,232.183,76.129,231.936,76.129,231.936z M213.843,206.249
	c-0.011-0.043-0.016-0.087-0.025-0.13l-0.015,0.097C213.816,206.228,213.83,206.237,213.843,206.249z M253.457,205.178
	c-0.016-0.025-0.021-0.051-0.033-0.076c-0.791-0.196-1.578-0.401-2.359-0.621c-0.27-0.076-0.433-0.184-0.525-0.306
	c-0.17,0.003-0.322-0.018-0.436-0.076c-7.498-3.886-17.023-9.227-26.089-9.213c0.196,0.057,0.343,0.16,0.401,0.324
	c4.297,12.005,9.859,23.558,18.394,33.166c0.198,0.224,0.402,0.438,0.603,0.658c-1.717-5.819-4.323-11.35-6.395-17.049
	c-0.406-1.119,2.472-1.948,2.898-0.775c1.461,4.02,3.254,8.134,4.743,12.291l3.47,0.434l3.084-4.626
	c0.529-1.576,0.928-3.161,1.257-4.517C253.006,212.577,254.809,207.35,253.457,205.178z M216.459,195.241
	c0.709-0.248,1.418-0.459,2.128-0.64c-0.856,0-1.622,0-2.243,0c-0.072,0.251-0.135,0.503-0.188,0.758
	C216.244,195.321,216.344,195.281,216.459,195.241z M232.984,260.651c1.17-1.844,2.437-3.65,3.814-5.407
	c5.111-6.513,8.85-13.329,7.689-21.547c-3.514-3.369-6.863-6.898-9.751-11.05c-5.726-8.232-9.848-17.242-13.22-26.662
	c-0.158-0.44,0.626-0.895,1.422-1.072c-1.852,0.092-3.682,0.416-5.465,1.041c-0.468,0.164-1.058,0.185-1.449,0.105
	c-0.083,0.619-0.104,1.251-0.062,1.896c0.289-0.022,0.542,0.009,0.694,0.129c2.279,1.788,10.526,9.845,6.665,12.733
	c-2.111,1.58-5.296,1.178-7.212-0.475c0.089,2.077-1.16,4.169-2.988,5.845c-6.765,6.204-10.613-9.13-12.997-12.506
	c-0.137-0.194-0.149-0.387-0.075-0.565c-0.021-0.039-0.034-0.082-0.033-0.131c0.004-0.256,0.018-0.511,0.024-0.766
	c-0.853,0.011-1.684,0.072-2.49,0.19c0.994,10.102,7.304,20.71,12.22,29.054C215.888,241.845,223.289,253.031,232.984,260.651z
	 M209.31,214.741c1.503,1.556,2.263,0.323,3.196-1.286c2.099-3.619-0.82-5.823-3.703-7.654c-2.016-1.281-4.233-2.542-5.865-4.325
	c-0.007,0.244-0.018,0.49-0.021,0.734c-0.002,0.111-0.042,0.215-0.103,0.313c1.667,2.364,2.589,5.211,3.831,7.803
	C207.373,211.843,208.124,213.514,209.31,214.741z M189.885,242.751c0.065,0.015,0.133,0.03,0.195,0.045
	c0.303-0.002,0.563,0.051,0.72,0.166c0.309,0.071,0.548,0.126,0.729,0.168c0.022-0.219,0.051-0.436,0.072-0.654
	C191.035,242.59,190.461,242.677,189.885,242.751z M180.797,278.602l-0.037,0.256c1.777-2.642,3.141-5.647,4.269-8.72
	C182.814,274.567,180.797,278.602,180.797,278.602z M209.527,236.613c-4.079-6.532-7.826-13.332-10.793-20.449
	c-1.715-4.115-3.548-8.573-4.069-13.09c-12.191,3.854-18.894,19.789-24.138,30.378c4.854,6.007,13.709,9.086,21.219,7.379
	c0.154-1.998,0.252-4.014,0.268-6.068c0.008-1.033,2.916-1.621,2.906-0.33c-0.076,10.528-2.055,20.348-5.344,30.303
	c-1.94,5.875-4.165,12.425-8.369,17.18c0.037,0.031,0.074,0.063,0.102,0.102c8.448,11.887,30.533,16.983,43.74,11.078
	c-0.012-0.035-0.027-0.068-0.031-0.109c-0.896-8.037,0.289-15.65,3.078-22.755l0.033-0.296c0,0,0.098-0.166,0.27-0.452
	c0.922-2.247,2-4.445,3.23-6.586C222.402,256.257,215.222,245.734,209.527,236.613z M216.482,204.063
	c0.182,1.19,0.5,2.349,1.012,3.381c0.643,1.295,1.753,2.891,3.377,2.979c0.902,0.049,0.561-1.282,0.362-1.843
	c-0.792-2.238-2.333-4.515-4.102-6.47c0.056,0.113,0.099,0.225,0.158,0.339C217.652,203.14,217.152,203.761,216.482,204.063z
	 M200.075,194.462c0.163,0.003,0.286,0.042,0.417,0.074c0.195-2.637,0.379-5.273,0.398-7.918c-0.267,0.233-0.64,0.409-1.081,0.435
	c-3.899,0.22-8.185-0.473-12.2-1.944C188.611,191.051,194.073,194.343,200.075,194.462z"></path>
<path id="color_x5F_1" d="M225.328,156.092c2.999,3.622,4.43,8.233-0.243,11.081c-0.596,0.363-1.346,0.597-2.049,0.549
	c-0.539-0.036-0.681-0.399-0.188-0.699c4.129-2.517,2.233-6.926-0.243-9.919C222.105,156.501,224.848,155.511,225.328,156.092z
	 M221.859,170.267c0.189,0.707-0.589,1.262-1.175,1.413c-0.048,0.013-0.077,0.019-0.104,0.023c-0.007,0.021-0.116,0.097-0.083,0.037
	c-0.037,0.051-0.074,0.106-0.078,0.124c-0.089,0.448-0.044,0.844,0.053,1.287c0.306,1.403-2.596,2.162-2.898,0.777
	c-0.176-0.811-0.301-1.843,0.154-2.595c0.553-0.913,1.378-1.439,2.407-1.705C220.721,169.479,221.668,169.551,221.859,170.267z
	 M220.549,171.708c-0.005,0-0.008,0-0.011,0c-0.009,0.006-0.017,0.01-0.028,0.017c-0.01,0.005-0.012,0.007-0.022,0.013
	c0.009-0.005,0.012-0.006,0.02-0.01c0.001,0,0.002-0.002,0.003-0.003c-0.001,0.001-0.002,0.002-0.002,0.003
	C220.523,171.72,220.538,171.712,220.549,171.708z M212.099,154.549c-1.599,0.001-3.192,0.384-4.016,1.889
	c-0.351,0.643,0.307,1.137,0.88,1.203c0.714,0.083,1.533-0.234,1.888-0.883c0.009-0.017,0.026-0.038,0.046-0.06
	c0.095-0.016,0.225-0.037,0.263-0.04c0.225-0.015,0.451-0.012,0.676-0.012c0.629,0,1.513-0.477,1.599-1.162
	C213.528,154.728,212.656,154.548,212.099,154.549z M357.396,480.234c-3.537-0.368-7.083-0.943-10.636-1.585
	c-0.691,0.354-1.703,0.483-2.143,0.039c-0.172-0.174-0.338-0.354-0.509-0.527c-5.91-1.11-11.838-2.313-17.776-2.994
	c-0.616,0.243-1.36,0.301-1.759-0.183c-3.981-0.384-7.968-0.513-11.955-0.183c-15.449,1.281-30.825,3.112-46.316,3.923
	c-1.928,0.101,0.402-1.228,1.227-1.271c2.262-0.118,4.521-0.257,6.779-0.404c0.154-0.01,0.308-0.018,0.461-0.027
	c3.59-4.949,7.466-9.694,11.387-14.407c-0.004-0.053,0.059-0.121,0.163-0.196c4.577-5.499,9.206-10.962,13.505-16.661
	c2.678-3.549,5.229-7.188,7.555-10.988c0.009,0.002,0.018,0.003,0.025,0.004c0.039-0.088,0.089-0.17,0.154-0.239
	c0.286-0.304,1.149-0.525,1.822-0.496c0.064,0.003,0.127,0.009,0.188,0.016c0.422,0.054,0.725,0.227,0.676,0.571
	c1.842,1.285,3.447,4.019,4.812,5.622c3.735,4.391,7.457,8.793,11.191,13.184c6.788,7.981,13.403,16.277,20.755,23.759
	c4.069,0.701,8.146,1.35,12.25,1.776C360.751,479.121,358.074,480.305,357.396,480.234z M342.395,476.38
	c-6.588-6.942-12.636-14.475-18.82-21.751c-3.333-3.92-6.656-7.847-9.988-11.766c1.58,3.718,3.172,7.431,4.785,11.134
	c1.933,4.437,3.874,8.87,5.853,13.286c0.889,1.983,1.631,4.784,3.019,6.491c-0.023,0.002-0.047,0.005-0.071,0.008
	c0.129,0.072,0.214,0.167,0.242,0.281C332.429,474.629,337.412,475.497,342.395,476.38z M308.814,473.837
	c2.266-0.198,4.529-0.349,6.785-0.394c2.726-0.054,5.434,0.05,8.131,0.262c-0.985-1.758-1.649-3.956-2.404-5.646
	c-1.832-4.1-3.633-8.213-5.428-12.329c-0.012,0-0.021,0.003-0.033,0.003c-4,0-8,0-12,0c-1.966,0-1.407-2.135,0.254-2.135
	c3.614,0,7.229,0,10.844,0c-2.01-4.626-4.02-9.254-5.954-13.911c-0.142-0.342-0.488-0.966-0.832-1.672
	c-5.458,8.321-11.898,15.936-18.281,23.59c3.015,0,6.03,0,9.045,0c1.392,0-1.327,1.121-1.896,1.121c-2.693,0-5.387,0-8.081,0
	c-3.836,4.61-7.628,9.252-11.155,14.083c2.322-0.165,4.644-0.344,6.965-0.533c2.643-0.215,5.284-0.443,7.924-0.691
	C298.034,475.085,303.43,474.31,308.814,473.837z M522.074,438.884c-3.563-0.382-7.187-0.943-10.826-1.45
	c-0.053,0.015-0.106,0.021-0.16,0.032c-0.132,0.03-0.262,0.053-0.392,0.063c-0.421,0.036-0.817-0.029-1.051-0.264
	c-0.019-0.02-0.038-0.039-0.058-0.058c-9.383-1.251-18.828-1.902-27.594,2.021c7.39,8.842,14.792,17.76,22.862,25.931
	c1.929,0.422,3.86,0.902,5.797,1.451c1.717,0.486-0.598,2.119-1.713,1.803c-12.144-3.439-24.026-4.098-36.183-3.395
	c-4.283,0.247-8.602,0.66-12.977,1.186c-1.125,0.135-2.249,0.233-3.371,0.309c-15.314,1.036-30.395-3.071-45.732-2.574
	c-1.984,0.063-1.258-1.867,0.313-1.918c2.016-0.065,4.022-0.049,6.025,0.018c-0.18-0.144-0.213-0.363,0.006-0.669
	c6-8.388,12.109-16.712,18.076-25.134c0.426-0.602,0.857-1.2,1.282-1.803c-0.237-0.211-0.31-0.505-0.243-0.798
	c-2.03-4.093-3.922-8.256-5.82-12.411c-7.535-16.496-14.86-33.09-22.163-49.69c-12.601-28.645-25.093-57.341-37.32-86.147
	c-4.125-9.719-8.263-19.437-12.171-29.244c-0.195-0.488-1.422-2.96-2.168-5.299c-11.881,19.639-24.258,38.96-36.951,58.074
	c-0.585,0.881-1.16,1.768-1.746,2.646c0.014,0,0.027,0,0.041,0c9.195,0,18.392,0,27.587,0c1.44,0-1.241,1.219-1.869,1.219
	c-8.835,0-17.672,0-26.507,0c-0.021,0-0.041,0-0.063,0c-5.709,8.555-11.476,17.072-17.295,25.554c0.113,0,0.228,0,0.342,0
	c28.505,0,57.01,0,85.515,0c1.96,0-0.018,1.672-1.119,1.672c-28.515,0-57.028,0-85.544,0c-0.113,0-0.227,0-0.34,0
	c-7.209,10.488-14.494,20.925-21.82,31.333c-5.232,7.436-10.482,14.858-15.75,22.268c29.381,0,58.763,0,88.145,0
	c1.966,0,1.398,2.121-0.258,2.121c-29.797,0-59.596,0-89.394,0c-7.632,10.728-15.288,21.436-22.938,32.145
	c-0.005,0.007-0.011,0.015-0.016,0.021c11.191,0.396,22.345-0.201,33.501-1.138c12.488-1.048,24.98-2.521,37.539-3.519
	c9.985-0.795,19.936-1.135,29.856-1.093c6.782,0.029,13.551,0.24,20.305,0.632c26.189,1.521,52.167,5.674,77.962,11.832
	c0.815,0.194-1.714,1.273-2.383,1.113c-15.23-3.636-30.516-6.548-45.864-8.645c-23.297-3.183-46.74-4.445-70.369-3.339
	c-4.963,0.232-9.933,0.554-14.911,0.999c-5.005,0.448-10,0.948-14.988,1.447c-17.188,1.718-34.301,3.418-51.495,2.896
	c-0.04,0.055-0.079,0.11-0.118,0.165c-0.635,0.89-3.587,0.994-2.734-0.199c0.018-0.024,0.034-0.048,0.052-0.072
	c-5.357-0.24-10.724-0.715-16.104-1.479c-0.185,0.925-0.364,1.851-0.553,2.774c-1.077,5.279-2.154,10.562-3.358,15.814
	c-0.336,1.469-0.466,4.328-1.514,5.539c-0.193,0.224-0.484,0.427-0.813,0.574c-5.529,4.777-12.43,6.509-19.176,4.448
	c-1.678,6.083-2.878,13.569,0.369,19.364c4.274,7.628,13.474,8.181,21.205,6.277c2.769-0.682,8.36-1.932,7.369-5.977
	c-0.552-2.253-1.874-4.182-3.265-6.007c-3.563-4.676-7.438-9.078-10.177-14.318c-0.411-0.788,2.394-1.743,2.898-0.777
	c2.212,4.232,5.189,7.894,8.141,11.62c1.854,2.343,4.414,5.087,5.149,8.088c1.541,6.292-6.752,8.135-11.244,9.081
	c-6.942,1.461-16.601,1.624-21.373-4.733c-2.97-3.955-3.79-8.661-3.52-13.404c-5.582,9.804-11.772,23.457-24.064,21.158
	c-7.388-1.382-13.521-6.95-9.773-14.582c3.962-8.068,11.321-14.39,14.167-23.003c-1.219-1.227-2.164-2.692-2.715-4.449
	c-0.09-0.286,0.456-0.611,1.098-0.82c0.878-3.26,1.695-6.528,2.453-9.804c-0.387,0.424-1.079,0.82-1.64,0.82
	c-31.558,0.013-63.111,0.654-94.668,0.666c-1.962,0.001-0.13-1.832,1.076-1.832c31.558-0.013,63.111-0.654,94.668-0.666
	c0.393,0,0.628,0.075,0.752,0.192c6.372-27.944,8.161-56.408,2.345-84.874c-4.192-20.522-13.436-48.798,5.467-64.153
	c-0.186-0.155-0.169-0.387,0.225-0.7c1.745-1.393,3.208-3.085,4.467-4.957c1.777-2.642,3.141-5.647,4.269-8.72
	c1.091-2.968,1.97-5.992,2.798-8.797c1.799-6.09,3.062-12.06,3.702-18.211c0.022-0.219,0.051-0.436,0.072-0.654
	c-0.565,0.114-1.14,0.201-1.716,0.275c-6.207,0.796-12.99-0.722-18.099-4.411c-3.341,6.683-8.782,15.601-16.646,17.517
	c-7.928,1.933-12.356-4.234-15.012-10.789c-0.679,0.038-1.257-0.207-1.124-0.841c0.701-3.342,2.008-6.853,1.938-10.303
	c-0.089-4.48-3.943-7.831-8.546-7.181c-2.611,0.369-5.172,2.467-5.039,5.329c0.512,0.938,1.023,1.874,1.533,2.812
	c1.136,0.723,2.734,0.866,4.223,0.72c1.984-0.195,1.275,1.834-0.293,1.988c-0.791,0.078-1.62,0.094-2.438,0.03
	c2.962,5.452,5.919,10.907,8.912,16.339c0.732,1.33-2.031,2.403-2.654,1.273c-3.433-6.229-6.764-12.546-10.146-18.83
	c-0.329-0.228-0.628-0.493-0.892-0.797c-0.018,0.221-0.035,0.442-0.07,0.675c-0.259,1.717-1.008,3.254-2.07,4.554
	c0.027-0.002,0.057-0.008,0.083-0.009c0.645-0.032,1.294-0.053,1.938-0.004c2.259,0.173,5.05,1.123,3.693,3.878
	c-0.386,0.783-0.918,1.504-1.526,2.177c2.215-0.203,4.655,0.274,4.466,3.018c-0.158,2.293-1.58,4.832-3.403,6.468
	c7.514,11.018,22.212,26.157,36.545,19.188c11.841-5.758,18.32-20.119,22.757-31.793c0.226-0.592,1.282-0.958,2.067-0.963
	c0.303-0.002,0.563,0.051,0.72,0.166c0.144,0.105,0.203,0.26,0.121,0.475c-4.948,13.021-12.462,29.324-26.631,34.281
	c-15.46,5.408-29.807-7.936-38.006-19.811c-2.319,1.008-5.145,1.292-7.485,0.431c-2.582-0.95-2.906-3.217-2.107-5.419
	c-0.907,0.095-1.801,0.033-2.631-0.271c-3.011-1.103-1.597-5.24-0.689-7.484c-3.328-0.414-5.347-2.957-4.866-6.933
	c0.036-0.293,0.24-0.541,0.524-0.729c1.773-3.576,5.611-6.474,9.408-7.367c1.913-0.45,3.602-0.293,4.864,0.399
	c-2.057-3.746-4.146-7.471-6.311-11.141c-1.563-2.65-3.247-5.288-4.923-7.947c-5.766,2.771-10.35,8.018-12.535,14.022
	c-1.782,4.896-1.604,9.001-1.07,14.065c0.646,6.154,1.188,13.487-5.909,15.674c-0.44,0.136-0.801,0.12-1.067,0.012
	c-0.355-0.03-0.67-0.176-0.844-0.477c-4.182-7.257-9.986-13.462-14.5-20.5c-0.36-0.562-0.049-1.089,0.479-1.417
	c-0.001-0.036,0.016-0.074,0.02-0.112c0.008-0.082,0.019-0.165,0.053-0.248c0.132-0.326,0.457-0.64,1.021-0.812
	c5.27-1.613,4.737-8.43,4.493-12.796c-0.218-3.881-0.296-7.36,0.589-11.063c0.118-0.497,0.251-0.998,0.407-1.505
	c1.515-4.936,4.436-9.293,8.242-12.652c2.701-2.384,5.847-4.27,9.269-5.483c0.585-0.207,1.022-0.133,1.286,0.08
	c0.164,0.132,0.261,0.317,0.281,0.522c0.249-0.121,0.529-0.194,0.807-0.222c0.604-0.061,1.183,0.124,1.328,0.675
	c1.848,7.002,5.533,13.268,9.386,19.42c1.442-0.451,1.95,0.84,1.001,1.594c1.916,3.038,3.838,6.063,5.562,9.146
	c1.751,3.132,3.482,6.276,5.206,9.425c1.07-1.54,2.734-2.745,4.389-3.401c3.975-1.578,10.598-0.548,12.777,3.563
	c2.235,4.217,0.623,9.079-0.461,13.514c0.057,0.069,0.107,0.147,0.141,0.239c2.179,6.013,7.146,15.179,14.825,10.117
	c5.405-3.563,9.01-9.162,11.85-14.86c0.196-0.394,0.722-0.655,1.269-0.756c-1.211-1.044-2.307-2.216-3.234-3.534
	c-0.377-0.534,0.227-1.06,0.966-1.315c1.407-2.851,2.913-5.963,4.574-9.099c-0.065-0.078-0.12-0.166-0.147-0.275
	c-1.976-7.808-1.799-19.674,2.731-27.767c0.414-0.938,0.827-1.633,1.216-1.956c0.021-0.018,0.045-0.037,0.066-0.055
	c2.083-2.899,4.863-5.115,8.484-6.164c-0.288-1.01-0.471-2.091-0.514-3.258c-1.291-0.634-2.53-1.353-3.693-2.152
	c-0.021,0.007-0.037,0.017-0.058,0.023c-6.569,2.192-26.082,3.75-20.254-7.299c-0.007-0.133,0.013-0.28,0.079-0.449
	c2.448-6.202,5.529-12.1,8.677-17.967c-0.125-0.112-0.214-0.26-0.235-0.459c-1.736-16.071,4.918-30.622,20.932-35.838
	c6.391-2.082,13.811-3.271,20.133-0.449c3.879,1.73,6.836,4.987,10.322,7.371c0.598,0,0.873,0.258,0.908,0.593
	c0.944,0.583,1.932,1.094,2.993,1.483c5.499,2.021,11.428,2.18,16.998,3.979c0.859,0.277,0.764,0.852,0.299,1.314
	c6.738,3.14-2.896,13.7-7.659,17.38c-0.111,0.087-0.235,0.149-0.362,0.201c-0.054,1.797-0.138,3.575-0.153,5.276
	c0,0.06-0.014,0.115-0.028,0.172c3.394,5.668,5.469,11.389,1.313,17.35c-4.445,6.377-16.077,12.336-18.369,20.284
	c-0.072,0.251-0.135,0.503-0.188,0.758c0.089-0.038,0.188-0.078,0.304-0.118c0.709-0.248,1.418-0.459,2.128-0.64
	c11.566-2.95,23.191,2.777,33.405,8.062c0.277-0.068,0.549-0.085,0.775-0.021c10.118,2.854,22.201,3.989,29.273-5.516
	c5.011-6.734,6.831-15.013,7.271-23.259c0.001-0.012,0.006-0.022,0.007-0.034c-3.947-2.509-8.88-6.905-5.479-11.714
	c1.465-2.07,4.221-4.393,7.158-5.497c-0.09-0.024-0.146-0.06-0.145-0.11c0.023-1.766,0.255-3.525,0.551-5.266
	c0.09-0.52,0.553-1.755,0.541-2.461c-0.076-0.038-0.115-0.089-0.096-0.157c0.024-0.084,0.045-0.17,0.076-0.252
	c0.071-0.192,0.486-0.421,0.98-0.598c-1.014-0.059-1.836-0.121-2.24-0.123c-1.118-0.005-7.887,0.447-10.809-0.527
	c-0.699,0.196-1.498,0.167-1.76-0.327c-3.527-6.644-7.875-14.405-4.711-21.986c0.004-0.01,0.012-0.019,0.017-0.028
	c-0.408-0.029-0.576-0.165-0.093-0.48c9.974-6.495,21.529-11.295,32.174-16.555c7.264-3.589,14.547-7.156,21.939-10.478
	c3.467-1.558,7.02-3.304,10.703-4.396c0.395-0.435,2.063-1.114,2.699-0.778c8.585,4.53,13.789,14.386,14.947,23.787
	c1.473,11.949-2.342,23.106-10,32.292c0,0.001-0.002,0.001-0.002,0.002c-0.132,0.462-0.717,0.942-1.493,0.962
	c-6.18,0.16-12.372-0.069-18.546-0.343c-2.874-0.127-6.072,0.038-9.029-0.338c-0.12,0.163-0.389,0.313-0.718,0.436
	c1.384,0.871,2.602,1.974,3.464,3.357c1.777,2.849-0.168,5.166-2.536,6.64c0.706,1.614,0.703,3.553-0.331,5.584
	c-2.086,4.102-5.993,8.158-10.279,10.19c0.402,1.98,0.098,4.438,0.143,6.03c0.16,5.791,0.053,11.646-0.84,17.385
	c-1.307,8.408-4.75,16.388-11.445,21.924c-12.558,10.38-30.611,10.829-46.079,7.3c-0.716,0.142-1.575-0.023-1.708-0.409
	c-0.206-0.051-0.412-0.103-0.616-0.156c0.628,2.054,1.134,4.114,1.442,6.179c2.49,2.401,5.087,4.665,7.725,6.979
	c2.98,2.614,6.811,6.081,7.221,10.332c0.082,0.852,0.084,1.688,0.026,2.511c0.858-1.202,1.717-2.403,2.575-3.605
	c0.391-0.548,1.23-0.702,1.869-0.545c0.438-0.132,0.876-0.18,1.162-0.069c4.127,1.594,8.162,3.519,11.921,5.86
	c1.093,0.681,3.276,1.676,3.945,2.967c0.11,0.072,0.159,0.175,0.13,0.31c0.034,0.226-0.078,0.438-0.282,0.62
	c-3.462,7.419-8.669,13.817-12.851,20.825c0.143,0.165-0.037,0.378-0.362,0.577c-0.501,0.694-2.699,0.976-2.766,0.242
	c-6.077-2.674-11.967-5.746-18.058-8.392c-0.341-0.148-0.239-0.375,0.061-0.596c-0.048-0.223,0.008-0.489,0.23-0.8
	c0.83-1.163,1.66-2.325,2.491-3.487c-3.983,1.9-8.63,2.339-12.909,0.591c-1.97-0.804-3.85-1.819-5.663-2.971
	c-0.834,1.415-1.603,2.877-2.263,4.419c-3.242,7.571-4.4,15.325-3.486,23.52c0.004,0.035-0.003,0.068-0.004,0.104
	c0.023,0.02,0.05,0.036,0.068,0.06c20.313,25.216,6.439,59.612-1.023,87.038c-4.191,15.402-6.841,31.143-9.937,46.791
	c0.191-0.04,0.358-0.059,0.472-0.041c5.424,0.83,10.832,1.342,16.23,1.614c7.657-10.718,15.313-21.437,22.943-32.173
	c-1.071-0.452-0.457-1.994,0.957-1.994c0.154,0,0.309,0,0.463,0c0.482-0.68,0.968-1.357,1.45-2.037
	c18.271-25.744,36.394-51.6,53.933-77.851c0.209-0.313,0.415-0.626,0.624-0.938c-0.179,0-0.356,0-0.535,0
	c-1.136,0,0.288-0.755,1.25-1.076c8.286-12.426,16.462-24.925,24.433-37.556c4.305-6.821,8.568-13.667,12.753-20.562
	c0.374-0.615,2.038-3.406,3.644-5.193c0.051-0.136,0.15-0.238,0.287-0.313c-0.04-1.3,0.482-2.083,2.111-1.589
	c0.417,0.127,0.742,0.49,0.534,0.92c0.054,0.105,0.104,0.223,0.146,0.362c0.081,0.268,0.173,0.533,0.257,0.8
	c0.133,0.089,0.251,0.182,0.336,0.279c2.123,2.445,4.132,4.995,6.157,7.521c8.833,11.013,17.564,22.107,26.323,33.179
	c15.616,19.736,31.247,39.462,46.997,59.092c6.514,8.12,13.044,16.228,19.608,24.306c10.893,13.404,21.675,27.131,33.003,40.324
	c6.707,7.813,13.605,15.438,20.832,22.697c3.881,0.493,7.772,1.061,11.658,1.477C525.464,437.619,522.873,438.97,522.074,438.884z
	 M95.95,247.3c0.247-2.82-0.27-5.973-0.508-8.082c-0.425-3.769-0.791-7.371,0.346-11.076c2.484-8.096,7.704-14.766,15.237-18.36
	c-3.914-6.271-7.638-12.712-9.508-19.796c-0.006-0.023-0.004-0.046-0.008-0.07c-0.09,0.047-0.186,0.089-0.29,0.126
	c-11.647,4.132-16.795,15.894-16.147,27.452c0.33,5.896,0.418,12.441-5.027,15.28c-0.331,0.173-0.678,0.336-1.052,0.48
	c0.001,0.002,0.003,0.004,0.004,0.005c4.374,6.743,9.886,12.752,13.979,19.679c0.33-0.175,0.617-0.39,0.883-0.622
	C95.203,251.146,95.774,249.312,95.95,247.3z M122.607,236.55c0.896-8.912-9.551-2.807-11.179,1.914
	c-0.012,0.033-0.032,0.063-0.048,0.096C110.922,246.522,121.982,242.777,122.607,236.55z M126.203,248.979
	c-0.375,0.099-0.678,0.083-0.928,0.015c-0.855,0.631-1.748,1.192-2.602,1.676c-0.817,0.464-1.769,0.962-2.776,1.377
	c-0.017,0.053-0.031,0.104-0.061,0.161c-0.795,1.566-1.188,3.781,0.942,4.433c1.375,0.421,3.113,0.363,4.469-0.271
	c-0.039-0.061-0.082-0.122-0.121-0.183c-0.57-0.879,1.158-1.689,2.146-1.493c0.889-1.083,1.577-2.449,1.809-3.66
	C129.515,248.77,128.166,248.46,126.203,248.979z M122.39,242.368c-0.119,0.006-0.263-0.012-0.399-0.05
	c-1.66,1.396-3.725,2.35-5.847,2.733c-0.751,1.869-2.022,5.538,0.239,6.255c0.59,0.188,1.359,0.007,2.037-0.238
	c1.165-0.421,2.262-0.983,3.306-1.65c1.741-1.111,4.143-2.789,4.796-4.877C127.268,242.155,123.849,242.294,122.39,242.368z
	 M252.49,270.633c5.393,2.376,10.648,5.045,16.02,7.469c4.082-6.634,9.051-12.772,12.289-19.885
	c-0.706-1.458-4.412-2.995-5.664-3.686c-2.695-1.487-5.457-2.814-8.301-3.979C262.053,257.245,257.271,263.939,252.49,270.633z
	 M244.356,248.687c-2.831,4.728-6.389,8.89-9.374,13.459c0.356,0.253,0.707,0.515,1.068,0.758c4.285,2.878,10.805,6.2,15.667,2.629
	c7.458-5.479,10.224-15.173,3.167-22.088c-2.431-2.383-4.916-4.635-7.366-6.9C247.613,240.604,246.765,244.665,244.356,248.687z
	 M251.213,219.309c0.529-1.576,0.928-3.161,1.257-4.517c0.536-2.215,2.339-7.442,0.987-9.614c-0.016-0.025-0.021-0.051-0.033-0.076
	c-0.791-0.196-1.578-0.401-2.359-0.621c-0.27-0.076-0.433-0.184-0.525-0.306c-0.17,0.003-0.322-0.018-0.436-0.076
	c-7.498-3.886-17.023-9.227-26.089-9.213c0.196,0.057,0.343,0.16,0.401,0.324c4.297,12.005,9.859,23.558,18.394,33.166
	c0.198,0.224,0.402,0.438,0.603,0.658c-1.717-5.819-4.323-11.35-6.395-17.049c-0.406-1.119,2.472-1.948,2.898-0.775
	c1.461,4.02,3.254,8.134,4.743,12.291c0.188,0.523,0.389,1.045,0.564,1.57c0.37-0.102,0.714-0.148,0.919-0.091
	c0.531,0.15,1.07,0.297,1.614,0.438C249.369,223.91,250.437,221.62,251.213,219.309z M302.696,161.12
	c0.326-2.077,1.542-3.969,3.231-5.16c-0.342,0.063-0.666,0.06-0.895-0.048c-2.459-1.153-5.911-3.78-3.561-6.718
	c0.25-0.313,0.533-0.593,0.838-0.846c-0.775-0.191-1.5-0.511-1.902-1.052c-1.341,0.542-3.564,0.62-5.584,0.566
	c0.101,0.665-0.429,2.042-0.521,2.607c-0.287,1.743-0.527,3.497-0.551,5.267c-0.002,0.097-0.048,0.188-0.127,0.271
	c1.02-0.086,2.022,0.015,2.962,0.388c2.734,1.085,4.015,4.261,2.727,6.965c-1.016,2.133-2.847,3.3-4.933,3.753
	c-0.44,3.481-0.326,7.157-0.047,10.635c0.108,1.355,0.002,2.275,1.264,3.013c2.154,1.258,4.934,2.321,6.688-0.184
	c0.107-0.153,0.315-0.285,0.567-0.393c-0.28-0.045-0.476-0.163-0.494-0.371c-0.188-2.104-0.044-4.187,0.193-6.264
	c-0.119-0.14-0.23-0.286-0.379-0.396c-0.234-0.173,0.046-0.461,0.508-0.71c0.302-2.36,0.678-4.718,0.796-7.099
	c0.01-0.198,0.175-0.383,0.417-0.538C302.951,164.068,302.417,162.897,302.696,161.12z M299.219,147.202
	c-0.348-0.148-0.518-0.336-0.571-0.534C298.655,146.844,298.804,147.025,299.219,147.202z M304.382,147.18
	c1.815-0.679,3.924-0.771,5.709-0.475c1.193,0.198,2.405,0.541,3.571,1.01c-0.418-2.191-1.273-4.507-3.277-5.611
	c-1.469-0.81-3.104-0.909-4.569-0.063c-1.126,0.65-2.827,1.901-2.847,3.378C302.955,146.376,303.589,146.892,304.382,147.18z
	 M312.793,158.046c-2.771-1.816-6.497-1.37-7.092,2.42c-0.544,3.457,2.194,3.75,4.916,2.853c1.771-0.585,2.273,1.412,0.531,1.986
	c-1.403,0.464-3.237,0.698-4.848,0.453c-0.17,2.306-0.539,4.595-0.814,6.889C310.146,169.867,318.551,161.821,312.793,158.046z
	 M310.087,148.784c-1.733-0.41-5.249-1.037-6.255,1.1c-1.043,2.215,1.896,3.778,3.479,4.521c0.398,0.187,0.428,0.442,0.254,0.693
	c0.957-0.357,1.996-0.513,3.073-0.389c2.198,0.254,4.069,1.215,5.285,2.615C319.896,154.202,313.424,149.573,310.087,148.784z
	 M296.829,145.61c0.672-0.023,1.345-0.044,2.016-0.088c0.333-0.021,0.54-0.022,0.667-0.006c0.245-0.122,0.514-0.205,0.775-0.23
	c0.632-1.671,2.572-2.913,4.051-3.621c2.256-1.08,5.149-1.815,7.607-1.025c2.63,0.844,3.881,3.232,4.481,5.75
	c0.023,0.004,0.05,0.004,0.072,0.009c3.28,0.771,7.917,0.471,11.492,0.614c5.288,0.213,10.594,0.424,15.889,0.318
	c7.376-9.32,11.228-21.295,8.564-33.154c-1.842-8.204-6.068-16.218-13.489-20.546c-4.799,1.203-9.545,3.887-13.967,5.947
	c-6.961,3.243-13.863,6.612-20.736,10.036c-9.274,4.621-19.328,8.82-28.092,14.42c0.148,0.094,0.212,0.233,0.129,0.432
	c-2.88,6.898,0.66,13.95,3.943,20.126c0.604-0.066,1.146,0.106,1.184,0.618c0.025,0.352,8.393,0.469,9.539,0.474
	C292.913,145.69,294.872,145.679,296.829,145.61z M291.262,171.945c0.003-1.554,0.055-3.11,0.252-4.643
	c-0.316-0.02-0.633-0.037-0.947-0.081c-1.948-0.271-0.529-2.434,0.973-2.225c2.113,0.294,4.786-0.188,5.213-2.715
	c0.268-1.586-0.293-3.7-2.192-3.93c-3.245-0.392-8.831,3.113-8.869,6.564C285.654,168.104,288.633,170.335,291.262,171.945z
	 M256.756,205.84c0.438,3.015-0.983,7.28-1.632,9.565c-1.021,3.597-2.292,7.861-5.081,10.572
	c15.871,3.661,35.887,3.275,46.175-10.835c5.183-7.108,6.856-15.411,7.251-24.08c0.136-2.98,0.117-5.949,0.089-8.925
	c-1.45,1.158-3.259,1.653-5.254,1.613c-1.903-0.039-5.29-0.979-6.415-2.688c-0.148-0.225-0.26-0.494-0.354-0.782
	c-1.309,8.294-4.474,16.829-11.271,21.756C273.229,207.136,264.883,207.393,256.756,205.84z M216.025,196.06
	c-0.083,0.619-0.104,1.251-0.062,1.896c0.289-0.022,0.542,0.009,0.694,0.129c2.279,1.788,10.526,9.845,6.665,12.733
	c-2.111,1.58-5.296,1.178-7.212-0.475c0.089,2.077-1.16,4.169-2.988,5.845c-6.765,6.204-10.613-9.13-12.997-12.506
	c-0.137-0.194-0.149-0.387-0.075-0.565c-0.021-0.039-0.034-0.082-0.033-0.131c0.004-0.256,0.018-0.511,0.024-0.766
	c-0.853,0.011-1.684,0.072-2.49,0.19c0.994,10.102,7.304,20.71,12.22,29.054c6.116,10.381,13.518,21.567,23.213,29.188
	c1.17-1.844,2.437-3.65,3.814-5.407c5.111-6.513,8.85-13.329,7.689-21.547c-3.514-3.369-6.863-6.898-9.751-11.05
	c-5.726-8.232-9.848-17.242-13.22-26.662c-0.158-0.44,0.626-0.895,1.422-1.072c-1.852,0.092-3.682,0.416-5.465,1.041
	C217.007,196.118,216.417,196.139,216.025,196.06z M200.876,185.236c-0.001-0.075-0.001-0.15-0.002-0.226l-0.086,0.193
	C200.819,185.214,200.848,185.226,200.876,185.236z M200.075,194.462c0.163,0.003,0.286,0.042,0.417,0.074
	c0.195-2.637,0.379-5.273,0.398-7.918c-0.267,0.233-0.64,0.409-1.081,0.435c-3.899,0.22-8.185-0.473-12.2-1.944
	C188.611,191.051,194.073,194.343,200.075,194.462z M208.803,205.801c-2.016-1.281-4.233-2.542-5.865-4.325
	c-0.007,0.244-0.018,0.49-0.021,0.734c-0.002,0.111-0.042,0.215-0.103,0.313c1.667,2.364,2.589,5.211,3.831,7.803
	c0.729,1.518,1.479,3.188,2.665,4.416c1.503,1.556,2.263,0.323,3.196-1.286C214.604,209.836,211.686,207.632,208.803,205.801z
	 M216.482,204.063c0.182,1.19,0.5,2.349,1.012,3.381c0.643,1.295,1.753,2.891,3.377,2.979c0.902,0.049,0.561-1.282,0.362-1.843
	c-0.792-2.238-2.333-4.515-4.102-6.47c0.056,0.113,0.099,0.225,0.158,0.339C217.652,203.14,217.152,203.761,216.482,204.063z
	 M230.205,157.515c-1.231-1.968-2.616-3.928-3.932-5.934c-0.414,0.466-1.203,0.695-1.815,0.715
	c-0.017,0.027-0.035,0.052-0.052,0.084c-0.298,0.568-1.084,0.802-1.672,0.891c-0.183,0.027-1.495,0.096-1.207-0.455
	c0.801-1.528,2.412-1.923,4.034-1.924c0.077,0,0.177,0.009,0.28,0.024c-2.608-4.052-4.834-8.311-4.846-13.219
	c0-0.01,0.004-0.019,0.004-0.029c-4.435,1.124-8.797,2.576-12.997,4.347c3.168,10.046-1.86,16.285-7.034,24.564
	c-0.12,0.192-0.421,0.359-0.78,0.48c-0.65,0.845-1.058,1.205-1.058,1.205s-0.061-0.388-0.197-0.91
	c-0.351,0.021-0.656-0.037-0.818-0.213c-1.324-1.435-2.691-1.85-3.878-1.602c-0.533,0.258-1.101,0.556-1.664,0.876
	c-1.495,1.354-2.226,3.946-1.264,6.368c1.222,3.078,4.179,1.627,6.636,1.349c2.361-0.268,4.44,0.67,5.07,3.082
	c1.763,6.741,0.598,13.993,0.095,20.971c0.521-0.082,1.016-0.001,1.197,0.328c2.082,3.762,6.399,5.018,9.495,7.702
	c0.014,0.012,0.027,0.021,0.04,0.033c-0.011-0.043-0.016-0.087-0.025-0.13c-0.423-1.751-0.482-3.639-0.362-5.359
	c-2.781-10.14,8.763-16.657,15.296-23.223c2.16-2.172,4.748-4.852,5.146-8.05C234.432,165.207,232.414,161.046,230.205,157.515z
	 M231.005,135.68c-0.317,0.045-0.635,0.106-0.952,0.154c2.922,3.566,3.538,8.126,3.567,12.754c3.296-2.686,8.915-7.814,7.732-11.347
	C240.287,134.061,233.388,135.341,231.005,135.68z M178.65,179.978c-4.508-3.861-7.316-9.148-6.457-15.5
	c-1.386,1.276-2.727,2.593-4.005,3.96c-1.454,1.556-3.595,3.67-4.886,5.946c-0.022,0.043-0.042,0.087-0.07,0.126
	c-0.645,1.17-1.063,2.381-1.033,3.581C162.33,183.403,173.972,181.2,178.65,179.978z M201.126,142.74
	c9.407-4.686,20.928-9.015,31.806-9.632c-2.982-0.484-5.973-0.925-8.796-1.962c-1.78-0.654-3.397-1.49-4.942-2.438
	c-4.281,0.632-8.273,2.332-12.475,3.332c-1.783,0.424-2.305-1.456-0.504-1.885c3.607-0.858,7.06-2.165,10.654-2.986
	c-1.105-0.785-2.195-1.615-3.297-2.478c-6.365-4.98-12.867-5.937-20.537-3.832c-15.31,4.201-22.264,16.904-21.257,32.01
	c6.793-7.93,15.176-14.388,25.144-17.763c1.228-0.415,3.027,0.326,1.09,0.982c-9.704,3.286-17.701,9.685-24.211,17.484
	c-0.153,0.184-0.505,0.338-0.906,0.445c0.123,0.189,0.137,0.441-0.037,0.766c-1.939,3.603-3.866,7.211-5.66,10.883
	C176.536,155.877,189.655,148.452,201.126,142.74z M181.207,281.915c0.037,0.031,0.074,0.063,0.102,0.102
	c8.448,11.887,30.533,16.983,43.74,11.078c-0.012-0.035-0.027-0.068-0.031-0.109c-0.896-8.037,0.289-15.65,3.078-22.755
	c0.099-0.251,0.2-0.499,0.303-0.748c0.922-2.247,2-4.445,3.23-6.586c-9.227-6.64-16.407-17.162-22.102-26.283
	c-4.079-6.532-7.826-13.332-10.793-20.449c-1.715-4.115-3.548-8.573-4.069-13.09c-12.191,3.854-18.894,19.789-24.138,30.378
	c4.854,6.007,13.709,9.086,21.219,7.379c0.154-1.998,0.252-4.014,0.268-6.068c0.008-1.033,2.916-1.621,2.906-0.33
	c-0.076,10.528-2.055,20.348-5.344,30.303C187.636,270.61,185.411,277.16,181.207,281.915z M189.551,456.009
	c-0.334-0.137-0.668-0.287-1.001-0.443c-0.312,0.027-0.593,0.013-0.786-0.052c-5.625-0.131-13.381-0.946-18.49-4.403
	c-2.557,5.859-7.117,10.762-10.58,16.071c-4.145,6.353-6.326,12.888,1.831,17.033c14.119,7.176,20.651-14.778,27.035-23.409
	c0.269-1.363,0.595-2.71,0.96-4.019C188.615,456.446,189.048,456.175,189.551,456.009z M223.63,381.388
	c7.378-27.116,21.651-61.683,2.396-86.916c-14.025,6.172-37.093,1.912-46.756-10.446c-21.044,15.915-8.459,47.205-4.871,68.633
	c5.194,31.019,2.167,61.223-5.994,91.383c-0.07,0.262-0.403,0.484-0.819,0.641c0.413,1.129,0.996,2.13,1.72,3.014
	c0.639-0.072,1.185,0.013,1.095,0.327c-0.062,0.215-0.136,0.424-0.203,0.636c4.242,4.105,11.751,5.298,17.666,5.593
	c7.746-20.45,13.666-41.48,16.29-63.23c2.356-19.546,2.801-39.262,4.374-58.875c0.067-0.832,2.962-1.436,2.881-0.428
	c-1.573,19.605-1.923,39.348-4.375,58.875c-2.75,21.904-8.604,43.011-16.437,63.621c6.303,3.209,12.729,2.41,18.016-2.52
	c0.026-0.037,0.057-0.075,0.094-0.113c-0.019,0.006-0.037,0.011-0.057,0.016c0.993-1.148,1.298-5.048,1.658-6.679
	c1.152-5.202,2.234-10.42,3.29-15.643C216.825,413.296,219.346,397.13,223.63,381.388z M500.15,464.253
	c-7.34-7.652-14.15-15.887-20.973-24.026c-0.877,0.003-1.654-0.275-0.696-0.831c-1.196-1.426-2.394-2.848-3.596-4.262
	c-4.837-5.689-9.66-11.393-14.499-17.081c-0.328-0.387-0.66-0.771-0.989-1.156c0.071,0.17,0.141,0.342,0.213,0.512
	c2.476,5.854,4.996,11.688,7.536,17.516c2.531,5.806,5.073,11.606,7.666,17.386c0.941,2.099,1.964,6.351,3.694,8.061
	c0.267,0.154,0.378,0.419,0.173,0.819c-0.003,0.006-0.006,0.012-0.009,0.018c-0.442,0.866-1.999,1.132-2.703,0.504
	c-1.789-1.597-2.806-5.843-3.751-7.951c-2.693-6.004-5.341-12.027-7.968-18.06c-2.637-6.055-5.265-12.115-7.826-18.202
	c-0.632-1.501-1.697-3.346-2.436-5.171c-4.282,6.892-8.804,13.627-13.454,20.275c4.526,0,9.053,0,13.578,0
	c1.967,0,1.404,2.129-0.254,2.129c-4.619,0-9.237,0-13.855,0c0.078,0.143,0.156,0.286,0.245,0.422
	c0.253,0.127,0.413,0.346,0.388,0.679c-0.085,1.117-2.199,1.546-2.891,0.744c-2.865,4.04-5.765,8.058-8.668,12.07
	c-3.113,4.305-6.231,8.604-9.32,12.922c-0.178,0.249-0.539,0.434-0.946,0.548c0.522,0.025,1.044,0.071,1.566,0.104
	c5.487,0.336,10.946,0.99,16.438,1.602c9.791,1.093,18.997,0.863,28.776-0.164C477.373,462.42,488.748,462.329,500.15,464.253z
	 M503.944,435.117c1.309,0.093,2.62,0.209,3.934,0.347c-13.828-14.096-26.488-29.489-38.936-44.923
	c-0.368,0.142-0.712,0.241-0.892,0.241c-8,0-16,0-24,0c-1.443,0,1.234-1.227,1.867-1.227c7.41,0,14.82,0,22.23,0
	c-4.151-5.15-8.282-10.301-12.428-15.405c-2.18-2.685-4.344-5.382-6.519-8.071c-0.354,0.441-1.196,0.917-1.78,0.917
	c-5.5,0-10.999,0-16.498,0c-1.959,0,0.038-1.65,1.125-1.65c5.5,0,10.999,0,16.498,0c0.025,0,0.042,0.003,0.065,0.004
	c-19.994-24.737-39.764-49.653-59.498-74.597c-7.888-9.969-15.758-19.952-23.689-29.887c-1.191-1.492-2.383-2.984-3.58-4.473
	c1.339,3.272,2.774,6.512,4.115,9.738c4.968,11.961,10.05,23.875,15.158,35.777c12.493,29.107,25.151,58.145,37.993,87.1
	c4.883,11.01,9.777,22.017,14.802,32.963c1.47,3.203,2.942,6.407,4.48,9.579c5.153-7.391,10.161-14.879,14.827-22.589
	c0.112-0.328,0.556-0.598,0.804-0.718c0.005-0.003,0.011-0.005,0.017-0.008c0.475-0.231,2.223-0.299,2.1,0.503
	c2.042,1.199,4.365,5.114,5.45,6.389c4.864,5.71,9.706,11.439,14.564,17.155c1.651,1.943,3.294,3.903,4.937,5.866
	c4.578-1.963,9.249-2.861,13.978-3.139C498.008,434.839,500.969,434.906,503.944,435.117z M364.926,313.065
	c-0.627,0-3.309,1.215-1.871,1.215c5,0,9.999,0,14.998,0c0.627,0,3.309-1.215,1.871-1.215
	C374.924,313.065,369.925,313.065,364.926,313.065z M400.119,365.117c-31.499,0-62.998,0-94.496,0c-1.651,0-2.229,2.107-0.262,2.107
	c31.499,0,62.998,0,94.496,0C401.509,367.225,402.086,365.117,400.119,365.117z M379.953,395.599c12,0,23.999,0,35.998,0
	c1.225,0,3.031-1.859,1.07-1.859c-12,0-23.999,0-35.998,0C379.799,393.739,377.992,395.599,379.953,395.599z M468.063,450.903
	c-8.999,0-17.999,0-26.998,0c-1.005,0-3.112,1.525-1.158,1.525c8.999,0,17.999,0,26.998,0
	C467.91,452.429,470.018,450.903,468.063,450.903z" fill="#8061d7"></path>
</svg>