<?xml version="1.0" encoding="utf-8"?>
<!DOCTYPE eagle SYSTEM "eagle.dtd">
<eagle version="9.6.2">
<drawing>
<settings>
<setting alwaysvectorfont="no"/>
<setting verticaltext="up"/>
</settings>
<grid distance="0.25" unitdist="mm" unit="mm" style="lines" multiple="1" display="yes" altdistance="5" altunitdist="mil" altunit="mil"/>
<layers>
<layer number="1" name="Top" color="4" fill="1" visible="yes" active="yes"/>
<layer number="2" name="Route2" color="16" fill="1" visible="no" active="no"/>
<layer number="3" name="Route3" color="17" fill="1" visible="no" active="no"/>
<layer number="4" name="Route4" color="18" fill="1" visible="no" active="no"/>
<layer number="5" name="Route5" color="19" fill="1" visible="no" active="no"/>
<layer number="6" name="Route6" color="25" fill="1" visible="no" active="no"/>
<layer number="7" name="Route7" color="26" fill="1" visible="no" active="no"/>
<layer number="8" name="Route8" color="27" fill="1" visible="no" active="no"/>
<layer number="9" name="Route9" color="28" fill="1" visible="no" active="no"/>
<layer number="10" name="Route10" color="29" fill="1" visible="no" active="no"/>
<layer number="11" name="Route11" color="30" fill="1" visible="no" active="no"/>
<layer number="12" name="Route12" color="20" fill="1" visible="no" active="no"/>
<layer number="13" name="Route13" color="21" fill="1" visible="no" active="no"/>
<layer number="14" name="Route14" color="22" fill="1" visible="no" active="no"/>
<layer number="15" name="Route15" color="23" fill="1" visible="no" active="no"/>
<layer number="16" name="Bottom" color="1" fill="1" visible="yes" active="yes"/>
<layer number="17" name="Pads" color="2" fill="1" visible="yes" active="yes"/>
<layer number="18" name="Vias" color="2" fill="1" visible="yes" active="yes"/>
<layer number="19" name="Unrouted" color="6" fill="1" visible="yes" active="yes"/>
<layer number="20" name="Dimension" color="24" fill="1" visible="yes" active="yes"/>
<layer number="21" name="tPlace" color="7" fill="1" visible="yes" active="yes"/>
<layer number="22" name="bPlace" color="7" fill="1" visible="yes" active="yes"/>
<layer number="23" name="tOrigins" color="15" fill="1" visible="yes" active="yes"/>
<layer number="24" name="bOrigins" color="15" fill="1" visible="yes" active="yes"/>
<layer number="25" name="tNames" color="7" fill="1" visible="yes" active="yes"/>
<layer number="26" name="bNames" color="7" fill="1" visible="yes" active="yes"/>
<layer number="27" name="tValues" color="7" fill="1" visible="yes" active="yes"/>
<layer number="28" name="bValues" color="7" fill="1" visible="yes" active="yes"/>
<layer number="29" name="tStop" color="7" fill="3" visible="no" active="yes"/>
<layer number="30" name="bStop" color="7" fill="6" visible="no" active="yes"/>
<layer number="31" name="tCream" color="7" fill="4" visible="no" active="yes"/>
<layer number="32" name="bCream" color="7" fill="5" visible="no" active="yes"/>
<layer number="33" name="tFinish" color="6" fill="3" visible="no" active="yes"/>
<layer number="34" name="bFinish" color="6" fill="6" visible="no" active="yes"/>
<layer number="35" name="tGlue" color="7" fill="4" visible="no" active="yes"/>
<layer number="36" name="bGlue" color="7" fill="5" visible="no" active="yes"/>
<layer number="37" name="tTest" color="7" fill="1" visible="no" active="yes"/>
<layer number="38" name="bTest" color="7" fill="1" visible="no" active="yes"/>
<layer number="39" name="tKeepout" color="4" fill="11" visible="yes" active="yes"/>
<layer number="40" name="bKeepout" color="1" fill="11" visible="yes" active="yes"/>
<layer number="41" name="tRestrict" color="4" fill="10" visible="yes" active="yes"/>
<layer number="42" name="bRestrict" color="1" fill="10" visible="yes" active="yes"/>
<layer number="43" name="vRestrict" color="2" fill="10" visible="yes" active="yes"/>
<layer number="44" name="Drills" color="7" fill="1" visible="no" active="yes"/>
<layer number="45" name="Holes" color="7" fill="1" visible="yes" active="yes"/>
<layer number="46" name="Milling" color="3" fill="1" visible="no" active="yes"/>
<layer number="47" name="Measures" color="7" fill="1" visible="no" active="yes"/>
<layer number="48" name="Document" color="7" fill="1" visible="yes" active="yes"/>
<layer number="49" name="Reference" color="7" fill="1" visible="yes" active="yes"/>
<layer number="50" name="ReferenceLS" color="7" fill="1" visible="no" active="no"/>
<layer number="51" name="tDocu" color="7" fill="1" visible="yes" active="yes"/>
<layer number="52" name="bDocu" color="7" fill="1" visible="yes" active="yes"/>
<layer number="53" name="tGND_GNDA" color="7" fill="1" visible="no" active="no"/>
<layer number="54" name="bGND_GNDA" color="7" fill="1" visible="no" active="no"/>
<layer number="56" name="wert" color="7" fill="1" visible="no" active="no"/>
<layer number="57" name="tCAD" color="7" fill="1" visible="no" active="no"/>
<layer number="59" name="tCarbon" color="7" fill="1" visible="no" active="no"/>
<layer number="60" name="bCarbon" color="7" fill="1" visible="no" active="no"/>
<layer number="88" name="SimResults" color="9" fill="1" visible="no" active="no"/>
<layer number="89" name="SimProbes" color="9" fill="1" visible="no" active="no"/>
<layer number="90" name="Modules" color="5" fill="1" visible="no" active="no"/>
<layer number="91" name="Nets" color="2" fill="1" visible="no" active="no"/>
<layer number="92" name="Busses" color="1" fill="1" visible="no" active="no"/>
<layer number="93" name="Pins" color="2" fill="1" visible="no" active="no"/>
<layer number="94" name="Symbols" color="4" fill="1" visible="no" active="no"/>
<layer number="95" name="Names" color="7" fill="1" visible="no" active="no"/>
<layer number="96" name="Values" color="7" fill="1" visible="no" active="no"/>
<layer number="97" name="Info" color="7" fill="1" visible="no" active="no"/>
<layer number="98" name="Guide" color="6" fill="1" visible="no" active="no"/>
<layer number="99" name="SpiceOrder" color="7" fill="1" visible="no" active="no"/>
<layer number="100" name="Muster" color="7" fill="1" visible="yes" active="yes"/>
<layer number="101" name="Patch_Top" color="7" fill="1" visible="yes" active="yes"/>
<layer number="102" name="Vscore" color="7" fill="1" visible="yes" active="yes"/>
<layer number="103" name="tMap" color="7" fill="1" visible="yes" active="yes"/>
<layer number="104" name="Name" color="7" fill="1" visible="yes" active="yes"/>
<layer number="105" name="tPlate" color="7" fill="1" visible="yes" active="yes"/>
<layer number="106" name="bPlate" color="7" fill="1" visible="yes" active="yes"/>
<layer number="107" name="Crop" color="7" fill="1" visible="yes" active="yes"/>
<layer number="108" name="fp8" color="7" fill="1" visible="yes" active="yes"/>
<layer number="109" name="fp9" color="7" fill="1" visible="yes" active="yes"/>
<layer number="110" name="110" color="7" fill="1" visible="yes" active="yes"/>
<layer number="111" name="111" color="7" fill="1" visible="yes" active="yes"/>
<layer number="112" name="tSilk" color="7" fill="1" visible="yes" active="yes"/>
<layer number="113" name="ReferenceLS" color="7" fill="1" visible="no" active="no"/>
<layer number="114" name="Badge_Outline" color="7" fill="1" visible="yes" active="yes"/>
<layer number="115" name="ReferenceISLANDS" color="7" fill="1" visible="yes" active="yes"/>
<layer number="116" name="Patch_BOT" color="7" fill="1" visible="yes" active="yes"/>
<layer number="117" name="PM_Ref" color="7" fill="1" visible="yes" active="yes"/>
<layer number="118" name="Rect_Pads" color="7" fill="1" visible="yes" active="yes"/>
<layer number="119" name="PF_Ref" color="7" fill="1" visible="yes" active="yes"/>
<layer number="120" name="WFL_Ref" color="7" fill="1" visible="yes" active="yes"/>
<layer number="121" name="_tsilk" color="7" fill="1" visible="yes" active="yes"/>
<layer number="122" name="_bsilk" color="7" fill="1" visible="yes" active="yes"/>
<layer number="123" name="tTestmark" color="7" fill="1" visible="yes" active="yes"/>
<layer number="124" name="bTestmark" color="7" fill="1" visible="yes" active="yes"/>
<layer number="125" name="_tNames" color="7" fill="1" visible="yes" active="yes"/>
<layer number="126" name="_bNames" color="7" fill="1" visible="yes" active="yes"/>
<layer number="127" name="_tValues" color="7" fill="1" visible="yes" active="yes"/>
<layer number="128" name="_bValues" color="7" fill="1" visible="yes" active="yes"/>
<layer number="129" name="Mask" color="7" fill="1" visible="yes" active="yes"/>
<layer number="131" name="tAdjust" color="7" fill="1" visible="yes" active="yes"/>
<layer number="132" name="bAdjust" color="7" fill="1" visible="yes" active="yes"/>
<layer number="144" name="Drill_legend" color="7" fill="1" visible="yes" active="yes"/>
<layer number="150" name="Notes" color="7" fill="1" visible="yes" active="yes"/>
<layer number="151" name="HeatSink" color="7" fill="1" visible="yes" active="yes"/>
<layer number="152" name="_bDocu" color="7" fill="1" visible="yes" active="yes"/>
<layer number="153" name="FabDoc1" color="7" fill="1" visible="yes" active="yes"/>
<layer number="154" name="FabDoc2" color="7" fill="1" visible="yes" active="yes"/>
<layer number="155" name="FabDoc3" color="7" fill="1" visible="yes" active="yes"/>
<layer number="199" name="Contour" color="7" fill="1" visible="yes" active="yes"/>
<layer number="200" name="200bmp" color="7" fill="1" visible="yes" active="yes"/>
<layer number="201" name="201bmp" color="7" fill="1" visible="yes" active="yes"/>
<layer number="202" name="202bmp" color="7" fill="1" visible="yes" active="yes"/>
<layer number="203" name="203bmp" color="7" fill="1" visible="yes" active="yes"/>
<layer number="204" name="204bmp" color="7" fill="1" visible="yes" active="yes"/>
<layer number="205" name="205bmp" color="7" fill="1" visible="yes" active="yes"/>
<layer number="206" name="206bmp" color="7" fill="1" visible="yes" active="yes"/>
<layer number="207" name="207bmp" color="7" fill="1" visible="yes" active="yes"/>
<layer number="208" name="208bmp" color="7" fill="1" visible="yes" active="yes"/>
<layer number="209" name="209bmp" color="7" fill="1" visible="yes" active="yes"/>
<layer number="210" name="210bmp" color="7" fill="1" visible="yes" active="yes"/>
<layer number="211" name="211bmp" color="7" fill="1" visible="yes" active="yes"/>
<layer number="212" name="212bmp" color="7" fill="1" visible="yes" active="yes"/>
<layer number="213" name="213bmp" color="7" fill="1" visible="yes" active="yes"/>
<layer number="214" name="214bmp" color="7" fill="1" visible="yes" active="yes"/>
<layer number="215" name="215bmp" color="7" fill="1" visible="yes" active="yes"/>
<layer number="216" name="216bmp" color="7" fill="1" visible="yes" active="yes"/>
<layer number="217" name="217bmp" color="7" fill="1" visible="yes" active="yes"/>
<layer number="218" name="218bmp" color="7" fill="1" visible="yes" active="yes"/>
<layer number="219" name="219bmp" color="7" fill="1" visible="yes" active="yes"/>
<layer number="220" name="220bmp" color="7" fill="1" visible="yes" active="yes"/>
<layer number="221" name="221bmp" color="7" fill="1" visible="yes" active="yes"/>
<layer number="222" name="222bmp" color="7" fill="1" visible="yes" active="yes"/>
<layer number="223" name="223bmp" color="7" fill="1" visible="yes" active="yes"/>
<layer number="224" name="224bmp" color="7" fill="1" visible="yes" active="yes"/>
<layer number="225" name="225bmp" color="7" fill="1" visible="yes" active="yes"/>
<layer number="226" name="226bmp" color="7" fill="1" visible="yes" active="yes"/>
<layer number="227" name="227bmp" color="7" fill="1" visible="yes" active="yes"/>
<layer number="228" name="228bmp" color="7" fill="1" visible="yes" active="yes"/>
<layer number="229" name="229bmp" color="7" fill="1" visible="yes" active="yes"/>
<layer number="230" name="230bmp" color="7" fill="1" visible="yes" active="yes"/>
<layer number="231" name="Eagle3D_PG1" color="7" fill="1" visible="yes" active="yes"/>
<layer number="232" name="Eagle3D_PG2" color="7" fill="1" visible="yes" active="yes"/>
<layer number="233" name="Eagle3D_PG3" color="7" fill="1" visible="yes" active="yes"/>
<layer number="248" name="Housing" color="7" fill="1" visible="yes" active="yes"/>
<layer number="249" name="Edge" color="7" fill="1" visible="yes" active="yes"/>
<layer number="250" name="Descript" color="7" fill="1" visible="yes" active="yes"/>
<layer number="251" name="SMDround" color="7" fill="1" visible="yes" active="yes"/>
<layer number="254" name="cooling" color="7" fill="1" visible="yes" active="yes"/>
<layer number="255" name="routoute" color="7" fill="1" visible="yes" active="yes"/>
</layers>
<board>
<plain>
<text x="5.207" y="6.508" size="1" layer="22" font="vector" ratio="17" rot="MR0">Fingertip</text>
<text x="5.207" y="4.984" size="1" layer="22" font="vector" ratio="17" rot="MR0">0x76</text>
<text x="5.207" y="0.508" size="1" layer="22" font="vector" ratio="17" rot="MR0">Fingertip</text>
<text x="5.207" y="-1.016" size="1" layer="22" font="vector" ratio="17" rot="MR0">0x76</text>
<hole x="0" y="3" drill="0.5"/>
<hole x="0.75" y="3" drill="0.5"/>
<hole x="1.5" y="3" drill="0.5"/>
<hole x="2.25" y="3" drill="0.5"/>
<hole x="-0.75" y="3" drill="0.5"/>
<hole x="-1.5" y="3" drill="0.5"/>
<hole x="-2.25" y="3" drill="0.5"/>
<wire x1="-5.5" y1="3.5" x2="-5.5" y2="8.5" width="0" layer="20"/>
<wire x1="-5.5" y1="8.5" x2="5.5" y2="8.5" width="0" layer="20"/>
<wire x1="5.5" y1="8.5" x2="5.5" y2="3.5" width="0" layer="20"/>
<wire x1="5.5" y1="2.5" x2="5.5" y2="-2.5" width="0" layer="20"/>
<wire x1="5.5" y1="-2.5" x2="-5.5" y2="-2.5" width="0" layer="20"/>
<wire x1="-5.5" y1="-2.5" x2="-5.5" y2="2.5" width="0" layer="20"/>
<wire x1="-3.25" y1="3.5" x2="-3.25" y2="2.5" width="0" layer="20" curve="-180"/>
<wire x1="3.25" y1="2.5" x2="3.25" y2="3.5" width="0" layer="20" curve="-180"/>
<wire x1="-5.5" y1="3.5" x2="-3.25" y2="3.5" width="0" layer="20"/>
<wire x1="-3.25" y1="2.5" x2="-5.5" y2="2.5" width="0" layer="20"/>
<wire x1="3.25" y1="3.5" x2="5.5" y2="3.5" width="0" layer="20"/>
<wire x1="3.25" y1="2.5" x2="5.5" y2="2.5" width="0" layer="20"/>
</plain>
<libraries>
<library name="rcl" urn="urn:adsk.eagle:library:334">
<description>&lt;b&gt;Resistors, Capacitors, Inductors&lt;/b&gt;&lt;p&gt;
Based on the previous libraries:
&lt;ul&gt;
&lt;li&gt;r.lbr
&lt;li&gt;cap.lbr 
&lt;li&gt;cap-fe.lbr
&lt;li&gt;captant.lbr
&lt;li&gt;polcap.lbr
&lt;li&gt;ipc-smd.lbr
&lt;/ul&gt;
All SMD packages are defined according to the IPC specifications and  CECC&lt;p&gt;
&lt;author&gt;Created by librarian@cadsoft.de&lt;/author&gt;&lt;p&gt;
&lt;p&gt;
for Electrolyt Capacitors see also :&lt;p&gt;
www.bccomponents.com &lt;p&gt;
www.panasonic.com&lt;p&gt;
www.kemet.com&lt;p&gt;
http://www.secc.co.jp/pdf/os_e/2004/e_os_all.pdf &lt;b&gt;(SANYO)&lt;/b&gt;
&lt;p&gt;
for trimmer refence see : &lt;u&gt;www.electrospec-inc.com/cross_references/trimpotcrossref.asp&lt;/u&gt;&lt;p&gt;

&lt;table border=0 cellspacing=0 cellpadding=0 width="100%" cellpaddding=0&gt;
&lt;tr valign="top"&gt;

&lt;! &lt;td width="10"&gt;&amp;nbsp;&lt;/td&gt;
&lt;td width="90%"&gt;

&lt;b&gt;&lt;font color="#0000FF" size="4"&gt;TRIM-POT CROSS REFERENCE&lt;/font&gt;&lt;/b&gt;
&lt;P&gt;
&lt;TABLE BORDER=0 CELLSPACING=1 CELLPADDING=2&gt;
  &lt;TR&gt;
    &lt;TD COLSPAN=8&gt;
      &lt;FONT SIZE=3 FACE=ARIAL&gt;&lt;B&gt;RECTANGULAR MULTI-TURN&lt;/B&gt;&lt;/FONT&gt;
    &lt;/TD&gt;
  &lt;/TR&gt;
  &lt;TR&gt;
    &lt;TD ALIGN=CENTER&gt;
      &lt;B&gt;
      &lt;FONT SIZE=3 FACE=ARIAL color="#FF0000"&gt;BOURNS&lt;/FONT&gt;
      &lt;/B&gt;
    &lt;/TD&gt;
    &lt;TD ALIGN=CENTER&gt;
      &lt;B&gt;
      &lt;FONT SIZE=3 FACE=ARIAL color="#FF0000"&gt;BI&amp;nbsp;TECH&lt;/FONT&gt;
      &lt;/B&gt;
    &lt;/TD&gt;
    &lt;TD ALIGN=CENTER&gt;
      &lt;B&gt;
      &lt;FONT SIZE=3 FACE=ARIAL color="#FF0000"&gt;DALE-VISHAY&lt;/FONT&gt;
      &lt;/B&gt;
    &lt;/TD&gt;
    &lt;TD ALIGN=CENTER&gt;
      &lt;B&gt;
      &lt;FONT SIZE=3 FACE=ARIAL color="#FF0000"&gt;PHILIPS/MEPCO&lt;/FONT&gt;
      &lt;/B&gt;
    &lt;/TD&gt;
    &lt;TD ALIGN=CENTER&gt;
      &lt;B&gt;
      &lt;FONT SIZE=3 FACE=ARIAL color="#FF0000"&gt;MURATA&lt;/FONT&gt;
      &lt;/B&gt;
    &lt;/TD&gt;
    &lt;TD ALIGN=CENTER&gt;
      &lt;B&gt;
      &lt;FONT SIZE=3 FACE=ARIAL color="#FF0000"&gt;PANASONIC&lt;/FONT&gt;
      &lt;/B&gt;
    &lt;/TD&gt;
    &lt;TD ALIGN=CENTER&gt;
      &lt;B&gt;
      &lt;FONT SIZE=3 FACE=ARIAL color="#FF0000"&gt;SPECTROL&lt;/FONT&gt;
      &lt;/B&gt;
    &lt;/TD&gt;
    &lt;TD ALIGN=CENTER&gt;
      &lt;B&gt;
      &lt;FONT SIZE=3 FACE=ARIAL color="#FF0000"&gt;MILSPEC&lt;/FONT&gt;
      &lt;/B&gt;
    &lt;/TD&gt;&lt;TD&gt;&amp;nbsp;&lt;/TD&gt;
  &lt;/TR&gt;
  &lt;TR&gt;
    &lt;TD BGCOLOR="#cccccc" ALIGN=CENTER&gt;&lt;FONT FACE=ARIAL SIZE=3 &gt;
      3005P&lt;BR&gt;
      3006P&lt;BR&gt;
      3006W&lt;BR&gt;
      3006Y&lt;BR&gt;
      3009P&lt;BR&gt;
      3009W&lt;BR&gt;
      3009Y&lt;BR&gt;
      3057J&lt;BR&gt;
      3057L&lt;BR&gt;
      3057P&lt;BR&gt;
      3057Y&lt;BR&gt;
      3059J&lt;BR&gt;
      3059L&lt;BR&gt;
      3059P&lt;BR&gt;
      3059Y&lt;BR&gt;&lt;/FONT&gt;
    &lt;/TD&gt;
    &lt;TD BGCOLOR="#cccccc" ALIGN=CENTER&gt;&lt;FONT FACE=ARIAL SIZE=3&gt;
      -&lt;BR&gt;
      89P&lt;BR&gt;
      89W&lt;BR&gt;
      89X&lt;BR&gt;
      89PH&lt;BR&gt;
      76P&lt;BR&gt;
      89XH&lt;BR&gt;
      78SLT&lt;BR&gt;
      78L&amp;nbsp;ALT&lt;BR&gt;
      56P&amp;nbsp;ALT&lt;BR&gt;
      78P&amp;nbsp;ALT&lt;BR&gt;
      T8S&lt;BR&gt;
      78L&lt;BR&gt;
      56P&lt;BR&gt;
      78P&lt;BR&gt;&lt;/FONT&gt;
    &lt;/TD&gt;
    &lt;TD BGCOLOR="#cccccc" ALIGN=CENTER&gt;&lt;FONT FACE=ARIAL SIZE=3&gt;
      -&lt;BR&gt;
      T18/784&lt;BR&gt;
      783&lt;BR&gt;
      781&lt;BR&gt;
      -&lt;BR&gt;
      -&lt;BR&gt;
      -&lt;BR&gt;
      2199&lt;BR&gt;
      1697/1897&lt;BR&gt;
      1680/1880&lt;BR&gt;
      2187&lt;BR&gt;
      -&lt;BR&gt;
      -&lt;BR&gt;
      -&lt;BR&gt;
      -&lt;BR&gt;&lt;/FONT&gt;
    &lt;/TD&gt;
    &lt;TD BGCOLOR="#cccccc" ALIGN=CENTER&gt;&lt;FONT FACE=ARIAL SIZE=3&gt;
      -&lt;BR&gt;
      8035EKP/CT20/RJ-20P&lt;BR&gt;
      -&lt;BR&gt;
      RJ-20X&lt;BR&gt;
      -&lt;BR&gt;
      -&lt;BR&gt;
      -&lt;BR&gt;
      1211L&lt;BR&gt;
      8012EKQ&amp;nbsp;ALT&lt;BR&gt;
      8012EKR&amp;nbsp;ALT&lt;BR&gt;
      1211P&lt;BR&gt;
      8012EKJ&lt;BR&gt;
      8012EKL&lt;BR&gt;
      8012EKQ&lt;BR&gt;
      8012EKR&lt;BR&gt;&lt;/FONT&gt;
    &lt;/TD&gt;
    &lt;TD BGCOLOR="#cccccc" ALIGN=CENTER&gt;&lt;FONT FACE=ARIAL SIZE=3&gt;
      -&lt;BR&gt;
      2101P&lt;BR&gt;
      2101W&lt;BR&gt;
      2101Y&lt;BR&gt;
      -&lt;BR&gt;
      -&lt;BR&gt;
      -&lt;BR&gt;
      -&lt;BR&gt;
      -&lt;BR&gt;
      -&lt;BR&gt;
      -&lt;BR&gt;
      -&lt;BR&gt;
      2102L&lt;BR&gt;
      2102S&lt;BR&gt;
      2102Y&lt;BR&gt;&lt;/FONT&gt;
    &lt;/TD&gt;
    &lt;TD BGCOLOR="#cccccc" ALIGN=CENTER&gt;&lt;FONT FACE=ARIAL SIZE=3&gt;
      -&lt;BR&gt;
      EVMCOG&lt;BR&gt;
      -&lt;BR&gt;
      -&lt;BR&gt;
      -&lt;BR&gt;
      -&lt;BR&gt;
      -&lt;BR&gt;
      -&lt;BR&gt;
      -&lt;BR&gt;
      -&lt;BR&gt;
      -&lt;BR&gt;
      -&lt;BR&gt;
      -&lt;BR&gt;
      -&lt;BR&gt;
      -&lt;BR&gt;&lt;/FONT&gt;
    &lt;/TD&gt;
    &lt;TD BGCOLOR="#cccccc" ALIGN=CENTER&gt;&lt;FONT FACE=ARIAL SIZE=3&gt;
      -&lt;BR&gt;
      43P&lt;BR&gt;
      43W&lt;BR&gt;
      43Y&lt;BR&gt;
      -&lt;BR&gt;
      -&lt;BR&gt;
      -&lt;BR&gt;
      -&lt;BR&gt;
      40L&lt;BR&gt;
      40P&lt;BR&gt;
      40Y&lt;BR&gt;
      70Y-T602&lt;BR&gt;
      70L&lt;BR&gt;
      70P&lt;BR&gt;
      70Y&lt;BR&gt;&lt;/FONT&gt;
    &lt;/TD&gt;
    &lt;TD BGCOLOR="#cccccc" ALIGN=CENTER&gt;&lt;FONT FACE=ARIAL SIZE=3&gt;
      -&lt;BR&gt;
      -&lt;BR&gt;
      -&lt;BR&gt;
      -&lt;BR&gt;
      -&lt;BR&gt;
      -&lt;BR&gt;
      -&lt;BR&gt;
      -&lt;BR&gt;
      RT/RTR12&lt;BR&gt;
      RT/RTR12&lt;BR&gt;
      RT/RTR12&lt;BR&gt;
      -&lt;BR&gt;
      RJ/RJR12&lt;BR&gt;
      RJ/RJR12&lt;BR&gt;
      RJ/RJR12&lt;BR&gt;&lt;/FONT&gt;
    &lt;/TD&gt;
  &lt;/TR&gt;
  &lt;TR&gt;
    &lt;TD COLSPAN=8&gt;&amp;nbsp;
    &lt;/TD&gt;
  &lt;/TR&gt;
  &lt;TR&gt;
    &lt;TD COLSPAN=8&gt;
      &lt;FONT SIZE=4 FACE=ARIAL&gt;&lt;B&gt;SQUARE MULTI-TURN&lt;/B&gt;&lt;/FONT&gt;
    &lt;/TD&gt;
  &lt;/TR&gt;
  &lt;TR&gt;
   &lt;TD ALIGN=CENTER&gt;
      &lt;FONT SIZE=3 FACE=ARIAL&gt;&lt;B&gt;BOURN&lt;/B&gt;&lt;/FONT&gt;
    &lt;/TD&gt;
    &lt;TD ALIGN=CENTER&gt;
      &lt;FONT SIZE=3 FACE=ARIAL&gt;&lt;B&gt;BI&amp;nbsp;TECH&lt;/B&gt;&lt;/FONT&gt;
    &lt;/TD&gt;
    &lt;TD ALIGN=CENTER&gt;
      &lt;FONT SIZE=3 FACE=ARIAL&gt;&lt;B&gt;DALE-VISHAY&lt;/B&gt;&lt;/FONT&gt;
    &lt;/TD&gt;
    &lt;TD ALIGN=CENTER&gt;
      &lt;FONT SIZE=3 FACE=ARIAL&gt;&lt;B&gt;PHILIPS/MEPCO&lt;/B&gt;&lt;/FONT&gt;
    &lt;/TD&gt;
    &lt;TD ALIGN=CENTER&gt;
      &lt;FONT SIZE=3 FACE=ARIAL&gt;&lt;B&gt;MURATA&lt;/B&gt;&lt;/FONT&gt;
    &lt;/TD&gt;
    &lt;TD ALIGN=CENTER&gt;
      &lt;FONT SIZE=3 FACE=ARIAL&gt;&lt;B&gt;PANASONIC&lt;/B&gt;&lt;/FONT&gt;
    &lt;/TD&gt;
    &lt;TD ALIGN=CENTER&gt;
      &lt;FONT SIZE=3 FACE=ARIAL&gt;&lt;B&gt;SPECTROL&lt;/B&gt;&lt;/FONT&gt;
    &lt;/TD&gt;
    &lt;TD ALIGN=CENTER&gt;
      &lt;FONT SIZE=3 FACE=ARIAL&gt;&lt;B&gt;MILSPEC&lt;/B&gt;&lt;/FONT&gt;
    &lt;/TD&gt;
  &lt;/TR&gt;
  &lt;TR&gt;
    &lt;TD BGCOLOR="#cccccc" ALIGN=CENTER&gt;&lt;FONT FACE=ARIAL SIZE=3&gt;
      3250L&lt;BR&gt;
      3250P&lt;BR&gt;
      3250W&lt;BR&gt;
      3250X&lt;BR&gt;
      3252P&lt;BR&gt;
      3252W&lt;BR&gt;
      3252X&lt;BR&gt;
      3260P&lt;BR&gt;
      3260W&lt;BR&gt;
      3260X&lt;BR&gt;
      3262P&lt;BR&gt;
      3262W&lt;BR&gt;
      3262X&lt;BR&gt;
      3266P&lt;BR&gt;
      3266W&lt;BR&gt;
      3266X&lt;BR&gt;
      3290H&lt;BR&gt;
      3290P&lt;BR&gt;
      3290W&lt;BR&gt;
      3292P&lt;BR&gt;
      3292W&lt;BR&gt;
      3292X&lt;BR&gt;
      3296P&lt;BR&gt;
      3296W&lt;BR&gt;
      3296X&lt;BR&gt;
      3296Y&lt;BR&gt;
      3296Z&lt;BR&gt;
      3299P&lt;BR&gt;
      3299W&lt;BR&gt;
      3299X&lt;BR&gt;
      3299Y&lt;BR&gt;
      3299Z&lt;BR&gt;&lt;/FONT&gt;
    &lt;/TD&gt;
    &lt;TD BGCOLOR="#cccccc" ALIGN=CENTER&gt;&lt;FONT FACE=ARIAL SIZE=3&gt;
      -&lt;BR&gt;
      66P&amp;nbsp;ALT&lt;BR&gt;
      66W&amp;nbsp;ALT&lt;BR&gt;
      66X&amp;nbsp;ALT&lt;BR&gt;
      66P&amp;nbsp;ALT&lt;BR&gt;
      66W&amp;nbsp;ALT&lt;BR&gt;
      66X&amp;nbsp;ALT&lt;BR&gt;
      -&lt;BR&gt;
      64W&amp;nbsp;ALT&lt;BR&gt;
      -&lt;BR&gt;
      64P&amp;nbsp;ALT&lt;BR&gt;
      64W&amp;nbsp;ALT&lt;BR&gt;
      64X&amp;nbsp;ALT&lt;BR&gt;
      64P&lt;BR&gt;
      64W&lt;BR&gt;
      64X&lt;BR&gt;
      66X&amp;nbsp;ALT&lt;BR&gt;
      66P&amp;nbsp;ALT&lt;BR&gt;
      66W&amp;nbsp;ALT&lt;BR&gt;
      66P&lt;BR&gt;
      66W&lt;BR&gt;
      66X&lt;BR&gt;
      67P&lt;BR&gt;
      67W&lt;BR&gt;
      67X&lt;BR&gt;
      67Y&lt;BR&gt;
      67Z&lt;BR&gt;
      68P&lt;BR&gt;
      68W&lt;BR&gt;
      68X&lt;BR&gt;
      67Y&amp;nbsp;ALT&lt;BR&gt;
      67Z&amp;nbsp;ALT&lt;BR&gt;&lt;/FONT&gt;
    &lt;/TD&gt;
    &lt;TD BGCOLOR="#cccccc" ALIGN=CENTER&gt;&lt;FONT FACE=ARIAL SIZE=3&gt;
      5050&lt;BR&gt;
      5091&lt;BR&gt;
      5080&lt;BR&gt;
      5087&lt;BR&gt;
      -&lt;BR&gt;
      -&lt;BR&gt;
      -&lt;BR&gt;
      -&lt;BR&gt;
      -&lt;BR&gt;
      -&lt;BR&gt;
      -&lt;BR&gt;
      T63YB&lt;BR&gt;
      T63XB&lt;BR&gt;
      -&lt;BR&gt;
      -&lt;BR&gt;
      -&lt;BR&gt;
      5887&lt;BR&gt;
      5891&lt;BR&gt;
      5880&lt;BR&gt;
      -&lt;BR&gt;
      -&lt;BR&gt;
      -&lt;BR&gt;
      T93Z&lt;BR&gt;
      T93YA&lt;BR&gt;
      T93XA&lt;BR&gt;
      T93YB&lt;BR&gt;
      T93XB&lt;BR&gt;
      -&lt;BR&gt;
      -&lt;BR&gt;
      -&lt;BR&gt;
      -&lt;BR&gt;
      -&lt;BR&gt;&lt;/FONT&gt;
    &lt;/TD&gt;
    &lt;TD BGCOLOR="#cccccc" ALIGN=CENTER&gt;&lt;FONT FACE=ARIAL SIZE=3&gt;
      -&lt;BR&gt;
      -&lt;BR&gt;
      -&lt;BR&gt;
      -&lt;BR&gt;
      -&lt;BR&gt;
      -&lt;BR&gt;
      -&lt;BR&gt;
      -&lt;BR&gt;
      -&lt;BR&gt;
      -&lt;BR&gt;
      8026EKP&lt;BR&gt;
      8026EKW&lt;BR&gt;
      8026EKM&lt;BR&gt;
      8026EKP&lt;BR&gt;
      8026EKB&lt;BR&gt;
      8026EKM&lt;BR&gt;
      1309X&lt;BR&gt;
      1309P&lt;BR&gt;
      1309W&lt;BR&gt;
      8024EKP&lt;BR&gt;
      8024EKW&lt;BR&gt;
      8024EKN&lt;BR&gt;
      RJ-9P/CT9P&lt;BR&gt;
      RJ-9W&lt;BR&gt;
      RJ-9X&lt;BR&gt;
      -&lt;BR&gt;
      -&lt;BR&gt;
      -&lt;BR&gt;
      -&lt;BR&gt;
      -&lt;BR&gt;
      -&lt;BR&gt;
      -&lt;BR&gt;&lt;/FONT&gt;
    &lt;/TD&gt;
    &lt;TD BGCOLOR="#cccccc" ALIGN=CENTER&gt;&lt;FONT FACE=ARIAL SIZE=3&gt;
      -&lt;BR&gt;
      -&lt;BR&gt;
      -&lt;BR&gt;
      -&lt;BR&gt;
      -&lt;BR&gt;
      -&lt;BR&gt;
      -&lt;BR&gt;
      -&lt;BR&gt;
      -&lt;BR&gt;
      -&lt;BR&gt;
      3103P&lt;BR&gt;
      3103Y&lt;BR&gt;
      3103Z&lt;BR&gt;
      3103P&lt;BR&gt;
      3103Y&lt;BR&gt;
      3103Z&lt;BR&gt;
      -&lt;BR&gt;
      -&lt;BR&gt;
      -&lt;BR&gt;
      -&lt;BR&gt;
      -&lt;BR&gt;
      -&lt;BR&gt;
      3105P/3106P&lt;BR&gt;
      3105W/3106W&lt;BR&gt;
      3105X/3106X&lt;BR&gt;
      3105Y/3106Y&lt;BR&gt;
      3105Z/3105Z&lt;BR&gt;
      3102P&lt;BR&gt;
      3102W&lt;BR&gt;
      3102X&lt;BR&gt;
      3102Y&lt;BR&gt;
      3102Z&lt;BR&gt;&lt;/FONT&gt;
    &lt;/TD&gt;
    &lt;TD BGCOLOR="#cccccc" ALIGN=CENTER&gt;&lt;FONT FACE=ARIAL SIZE=3&gt;
      -&lt;BR&gt;
      -&lt;BR&gt;
      -&lt;BR&gt;
      -&lt;BR&gt;
      -&lt;BR&gt;
      -&lt;BR&gt;
      -&lt;BR&gt;
      -&lt;BR&gt;
      -&lt;BR&gt;
      -&lt;BR&gt;
      -&lt;BR&gt;
      -&lt;BR&gt;
      -&lt;BR&gt;
      -&lt;BR&gt;
      -&lt;BR&gt;
      -&lt;BR&gt;
      -&lt;BR&gt;
      -&lt;BR&gt;
      -&lt;BR&gt;
      -&lt;BR&gt;
      -&lt;BR&gt;
      -&lt;BR&gt;
      EVMCBG&lt;BR&gt;
      EVMCCG&lt;BR&gt;
      -&lt;BR&gt;
      -&lt;BR&gt;
      -&lt;BR&gt;
      -&lt;BR&gt;
      -&lt;BR&gt;
      -&lt;BR&gt;
      -&lt;BR&gt;
      -&lt;BR&gt;&lt;/FONT&gt;
    &lt;/TD&gt;
    &lt;TD BGCOLOR="#cccccc" ALIGN=CENTER&gt;&lt;FONT FACE=ARIAL SIZE=3&gt;
      55-1-X&lt;BR&gt;
      55-4-X&lt;BR&gt;
      55-3-X&lt;BR&gt;
      55-2-X&lt;BR&gt;
      -&lt;BR&gt;
      -&lt;BR&gt;
      -&lt;BR&gt;
      -&lt;BR&gt;
      -&lt;BR&gt;
      -&lt;BR&gt;
      -&lt;BR&gt;
      -&lt;BR&gt;
      -&lt;BR&gt;
      -&lt;BR&gt;
      -&lt;BR&gt;
      -&lt;BR&gt;
      50-2-X&lt;BR&gt;
      50-4-X&lt;BR&gt;
      50-3-X&lt;BR&gt;
      -&lt;BR&gt;
      -&lt;BR&gt;
      -&lt;BR&gt;
      64P&lt;BR&gt;
      64W&lt;BR&gt;
      64X&lt;BR&gt;
      64Y&lt;BR&gt;
      64Z&lt;BR&gt;
      -&lt;BR&gt;
      -&lt;BR&gt;
      -&lt;BR&gt;
      -&lt;BR&gt;
      -&lt;BR&gt;&lt;/FONT&gt;
    &lt;/TD&gt;
    &lt;TD BGCOLOR="#cccccc" ALIGN=CENTER&gt;&lt;FONT FACE=ARIAL SIZE=3&gt;
      RT/RTR22&lt;BR&gt;
      RT/RTR22&lt;BR&gt;
      RT/RTR22&lt;BR&gt;
      RT/RTR22&lt;BR&gt;
      RJ/RJR22&lt;BR&gt;
      RJ/RJR22&lt;BR&gt;
      RJ/RJR22&lt;BR&gt;
      RT/RTR26&lt;BR&gt;
      RT/RTR26&lt;BR&gt;
      RT/RTR26&lt;BR&gt;
      RJ/RJR26&lt;BR&gt;
      RJ/RJR26&lt;BR&gt;
      RJ/RJR26&lt;BR&gt;
      RJ/RJR26&lt;BR&gt;
      RJ/RJR26&lt;BR&gt;
      RJ/RJR26&lt;BR&gt;
      RT/RTR24&lt;BR&gt;
      RT/RTR24&lt;BR&gt;
      RT/RTR24&lt;BR&gt;
      RJ/RJR24&lt;BR&gt;
      RJ/RJR24&lt;BR&gt;
      RJ/RJR24&lt;BR&gt;
      RJ/RJR24&lt;BR&gt;
      RJ/RJR24&lt;BR&gt;
      RJ/RJR24&lt;BR&gt;
      -&lt;BR&gt;
      -&lt;BR&gt;
      -&lt;BR&gt;
      -&lt;BR&gt;
      -&lt;BR&gt;
      -&lt;BR&gt;
      -&lt;BR&gt;&lt;/FONT&gt;
    &lt;/TD&gt;
  &lt;/TR&gt;
  &lt;TR&gt;
    &lt;TD COLSPAN=8&gt;&amp;nbsp;
    &lt;/TD&gt;
  &lt;/TR&gt;
  &lt;TR&gt;
    &lt;TD COLSPAN=8&gt;
      &lt;FONT SIZE=4 FACE=ARIAL&gt;&lt;B&gt;SINGLE TURN&lt;/B&gt;&lt;/FONT&gt;
    &lt;/TD&gt;
  &lt;/TR&gt;
  &lt;TR&gt;
    &lt;TD ALIGN=CENTER&gt;
      &lt;FONT SIZE=3 FACE=ARIAL&gt;&lt;B&gt;BOURN&lt;/B&gt;&lt;/FONT&gt;
    &lt;/TD&gt;
    &lt;TD ALIGN=CENTER&gt;
      &lt;FONT SIZE=3 FACE=ARIAL&gt;&lt;B&gt;BI&amp;nbsp;TECH&lt;/B&gt;&lt;/FONT&gt;
    &lt;/TD&gt;
    &lt;TD ALIGN=CENTER&gt;
      &lt;FONT SIZE=3 FACE=ARIAL&gt;&lt;B&gt;DALE-VISHAY&lt;/B&gt;&lt;/FONT&gt;
    &lt;/TD&gt;
    &lt;TD ALIGN=CENTER&gt;
      &lt;FONT SIZE=3 FACE=ARIAL&gt;&lt;B&gt;PHILIPS/MEPCO&lt;/B&gt;&lt;/FONT&gt;
    &lt;/TD&gt;
    &lt;TD ALIGN=CENTER&gt;
      &lt;FONT SIZE=3 FACE=ARIAL&gt;&lt;B&gt;MURATA&lt;/B&gt;&lt;/FONT&gt;
    &lt;/TD&gt;
    &lt;TD ALIGN=CENTER&gt;
      &lt;FONT SIZE=3 FACE=ARIAL&gt;&lt;B&gt;PANASONIC&lt;/B&gt;&lt;/FONT&gt;
    &lt;/TD&gt;
    &lt;TD ALIGN=CENTER&gt;
      &lt;FONT SIZE=3 FACE=ARIAL&gt;&lt;B&gt;SPECTROL&lt;/B&gt;&lt;/FONT&gt;
    &lt;/TD&gt;
    &lt;TD ALIGN=CENTER&gt;
      &lt;FONT SIZE=3 FACE=ARIAL&gt;&lt;B&gt;MILSPEC&lt;/B&gt;&lt;/FONT&gt;
    &lt;/TD&gt;
  &lt;/TR&gt;
  &lt;TR&gt;
    &lt;TD BGCOLOR="#cccccc" ALIGN=CENTER&gt;&lt;FONT FACE=ARIAL SIZE=3&gt;
      3323P&lt;BR&gt;
      3323S&lt;BR&gt;
      3323W&lt;BR&gt;
      3329H&lt;BR&gt;
      3329P&lt;BR&gt;
      3329W&lt;BR&gt;
      3339H&lt;BR&gt;
      3339P&lt;BR&gt;
      3339W&lt;BR&gt;
      3352E&lt;BR&gt;
      3352H&lt;BR&gt;
      3352K&lt;BR&gt;
      3352P&lt;BR&gt;
      3352T&lt;BR&gt;
      3352V&lt;BR&gt;
      3352W&lt;BR&gt;
      3362H&lt;BR&gt;
      3362M&lt;BR&gt;
      3362P&lt;BR&gt;
      3362R&lt;BR&gt;
      3362S&lt;BR&gt;
      3362U&lt;BR&gt;
      3362W&lt;BR&gt;
      3362X&lt;BR&gt;
      3386B&lt;BR&gt;
      3386C&lt;BR&gt;
      3386F&lt;BR&gt;
      3386H&lt;BR&gt;
      3386K&lt;BR&gt;
      3386M&lt;BR&gt;
      3386P&lt;BR&gt;
      3386S&lt;BR&gt;
      3386W&lt;BR&gt;
      3386X&lt;BR&gt;&lt;/FONT&gt;
    &lt;/TD&gt;
    &lt;TD BGCOLOR="#cccccc" ALIGN=CENTER&gt;&lt;FONT FACE=ARIAL SIZE=3&gt;
      25P&lt;BR&gt;
      25S&lt;BR&gt;
      25RX&lt;BR&gt;
      82P&lt;BR&gt;
      82M&lt;BR&gt;
      82PA&lt;BR&gt;
      -&lt;BR&gt;
      -&lt;BR&gt;
      -&lt;BR&gt;
      91E&lt;BR&gt;
      91X&lt;BR&gt;
      91T&lt;BR&gt;
      91B&lt;BR&gt;
      91A&lt;BR&gt;
      91V&lt;BR&gt;
      91W&lt;BR&gt;
      25W&lt;BR&gt;
      25V&lt;BR&gt;
      25P&lt;BR&gt;
      -&lt;BR&gt;
      25S&lt;BR&gt;
      25U&lt;BR&gt;
      25RX&lt;BR&gt;
      25X&lt;BR&gt;
      72XW&lt;BR&gt;
      72XL&lt;BR&gt;
      72PM&lt;BR&gt;
      72RX&lt;BR&gt;
      -&lt;BR&gt;
      72PX&lt;BR&gt;
      72P&lt;BR&gt;
      72RXW&lt;BR&gt;
      72RXL&lt;BR&gt;
      72X&lt;BR&gt;&lt;/FONT&gt;
    &lt;/TD&gt;
    &lt;TD BGCOLOR="#cccccc" ALIGN=CENTER&gt;&lt;FONT FACE=ARIAL SIZE=3&gt;
      -&lt;BR&gt;
      -&lt;BR&gt;
      -&lt;BR&gt;
      T7YB&lt;BR&gt;
      T7YA&lt;BR&gt;
      -&lt;BR&gt;
      -&lt;BR&gt;
      -&lt;BR&gt;
      -&lt;BR&gt;
      -&lt;BR&gt;
      -&lt;BR&gt;
      -&lt;BR&gt;
      -&lt;BR&gt;
      -&lt;BR&gt;
      -&lt;BR&gt;
      -&lt;BR&gt;
      -&lt;BR&gt;
      TXD&lt;BR&gt;
      TYA&lt;BR&gt;
      TYP&lt;BR&gt;
      -&lt;BR&gt;
      TYD&lt;BR&gt;
      TX&lt;BR&gt;
      -&lt;BR&gt;
      150SX&lt;BR&gt;
      100SX&lt;BR&gt;
      102T&lt;BR&gt;
      101S&lt;BR&gt;
      190T&lt;BR&gt;
      150TX&lt;BR&gt;
      101&lt;BR&gt;
      -&lt;BR&gt;
      -&lt;BR&gt;
      101SX&lt;BR&gt;&lt;/FONT&gt;
    &lt;/TD&gt;
    &lt;TD BGCOLOR="#cccccc" ALIGN=CENTER&gt;&lt;FONT FACE=ARIAL SIZE=3&gt;
      ET6P&lt;BR&gt;
      ET6S&lt;BR&gt;
      ET6X&lt;BR&gt;
      RJ-6W/8014EMW&lt;BR&gt;
      RJ-6P/8014EMP&lt;BR&gt;
      RJ-6X/8014EMX&lt;BR&gt;
      TM7W&lt;BR&gt;
      TM7P&lt;BR&gt;
      TM7X&lt;BR&gt;
      -&lt;BR&gt;
      8017SMS&lt;BR&gt;
      -&lt;BR&gt;
      8017SMB&lt;BR&gt;
      8017SMA&lt;BR&gt;
      -&lt;BR&gt;
      -&lt;BR&gt;
      CT-6W&lt;BR&gt;
      CT-6H&lt;BR&gt;
      CT-6P&lt;BR&gt;
      CT-6R&lt;BR&gt;
      -&lt;BR&gt;
      CT-6V&lt;BR&gt;
      CT-6X&lt;BR&gt;
      -&lt;BR&gt;
      -&lt;BR&gt;
      8038EKV&lt;BR&gt;
      -&lt;BR&gt;
      8038EKX&lt;BR&gt;
      -&lt;BR&gt;
      -&lt;BR&gt;
      8038EKP&lt;BR&gt;
      8038EKZ&lt;BR&gt;
      8038EKW&lt;BR&gt;
      -&lt;BR&gt;&lt;/FONT&gt;
    &lt;/TD&gt;
    &lt;TD BGCOLOR="#cccccc" ALIGN=CENTER&gt;&lt;FONT FACE=ARIAL SIZE=3&gt;
      -&lt;BR&gt;
      -&lt;BR&gt;
      -&lt;BR&gt;
      3321H&lt;BR&gt;
      3321P&lt;BR&gt;
      3321N&lt;BR&gt;
      1102H&lt;BR&gt;
      1102P&lt;BR&gt;
      1102T&lt;BR&gt;
      RVA0911V304A&lt;BR&gt;
      -&lt;BR&gt;
      RVA0911H413A&lt;BR&gt;
      RVG0707V100A&lt;BR&gt;
      RVA0607V(H)306A&lt;BR&gt;
      RVA1214H213A&lt;BR&gt;
      -&lt;BR&gt;
      -&lt;BR&gt;
      -&lt;BR&gt;
      -&lt;BR&gt;
      -&lt;BR&gt;
      -&lt;BR&gt;
      -&lt;BR&gt;
      -&lt;BR&gt;
      -&lt;BR&gt;
      3104B&lt;BR&gt;
      3104C&lt;BR&gt;
      3104F&lt;BR&gt;
      3104H&lt;BR&gt;
      -&lt;BR&gt;
      3104M&lt;BR&gt;
      3104P&lt;BR&gt;
      3104S&lt;BR&gt;
      3104W&lt;BR&gt;
      3104X&lt;BR&gt;&lt;/FONT&gt;
    &lt;/TD&gt;
    &lt;TD BGCOLOR="#cccccc" ALIGN=CENTER&gt;&lt;FONT FACE=ARIAL SIZE=3&gt;
      EVMQ0G&lt;BR&gt;
      EVMQIG&lt;BR&gt;
      EVMQ3G&lt;BR&gt;
      EVMS0G&lt;BR&gt;
      EVMQ0G&lt;BR&gt;
      EVMG0G&lt;BR&gt;
      -&lt;BR&gt;
      -&lt;BR&gt;
      -&lt;BR&gt;
      EVMK4GA00B&lt;BR&gt;
      EVM30GA00B&lt;BR&gt;
      EVMK0GA00B&lt;BR&gt;
      EVM38GA00B&lt;BR&gt;
      EVMB6&lt;BR&gt;
      EVLQ0&lt;BR&gt;
      -&lt;BR&gt;
      EVMMSG&lt;BR&gt;
      EVMMBG&lt;BR&gt;
      EVMMAG&lt;BR&gt;
      -&lt;BR&gt;
      -&lt;BR&gt;
      EVMMCS&lt;BR&gt;
      -&lt;BR&gt;
      -&lt;BR&gt;
      -&lt;BR&gt;
      -&lt;BR&gt;
      -&lt;BR&gt;
      EVMM1&lt;BR&gt;
      -&lt;BR&gt;
      -&lt;BR&gt;
      EVMM0&lt;BR&gt;
      -&lt;BR&gt;
      -&lt;BR&gt;
      EVMM3&lt;BR&gt;&lt;/FONT&gt;
    &lt;/TD&gt;
    &lt;TD BGCOLOR="#cccccc" ALIGN=CENTER&gt;&lt;FONT FACE=ARIAL SIZE=3&gt;
      -&lt;BR&gt;
      -&lt;BR&gt;
      -&lt;BR&gt;
      62-3-1&lt;BR&gt;
      62-1-2&lt;BR&gt;
      -&lt;BR&gt;
      -&lt;BR&gt;
      -&lt;BR&gt;
      -&lt;BR&gt;
      -&lt;BR&gt;
      -&lt;BR&gt;
      -&lt;BR&gt;
      -&lt;BR&gt;
      -&lt;BR&gt;
      -&lt;BR&gt;
      -&lt;BR&gt;
      67R&lt;BR&gt;
      -&lt;BR&gt;
      67P&lt;BR&gt;
      -&lt;BR&gt;
      -&lt;BR&gt;
      -&lt;BR&gt;
      -&lt;BR&gt;
      67X&lt;BR&gt;
      63V&lt;BR&gt;
      63S&lt;BR&gt;
      63M&lt;BR&gt;
      -&lt;BR&gt;
      -&lt;BR&gt;
      63H&lt;BR&gt;
      63P&lt;BR&gt;
      -&lt;BR&gt;
      -&lt;BR&gt;
      63X&lt;BR&gt;&lt;/FONT&gt;
    &lt;/TD&gt;
    &lt;TD BGCOLOR="#cccccc" ALIGN=CENTER&gt;&lt;FONT FACE=ARIAL SIZE=3&gt;
      -&lt;BR&gt;
      -&lt;BR&gt;
      -&lt;BR&gt;
      RJ/RJR50&lt;BR&gt;
      RJ/RJR50&lt;BR&gt;
      RJ/RJR50&lt;BR&gt;
      -&lt;BR&gt;
      -&lt;BR&gt;
      -&lt;BR&gt;
      -&lt;BR&gt;
      -&lt;BR&gt;
      -&lt;BR&gt;
      -&lt;BR&gt;
      -&lt;BR&gt;
      -&lt;BR&gt;
      -&lt;BR&gt;
      -&lt;BR&gt;
      -&lt;BR&gt;
      -&lt;BR&gt;
      -&lt;BR&gt;
      -&lt;BR&gt;
      -&lt;BR&gt;
      -&lt;BR&gt;
      -&lt;BR&gt;
      -&lt;BR&gt;
      -&lt;BR&gt;
      -&lt;BR&gt;
      -&lt;BR&gt;
      -&lt;BR&gt;
      -&lt;BR&gt;
      -&lt;BR&gt;
      -&lt;BR&gt;
      -&lt;BR&gt;
      -&lt;BR&gt;&lt;/FONT&gt;
    &lt;/TD&gt;
  &lt;/TR&gt;
&lt;/TABLE&gt;
&lt;P&gt;&amp;nbsp;&lt;P&gt;
&lt;TABLE BORDER=0 CELLSPACING=1 CELLPADDING=3&gt;
  &lt;TR&gt;
    &lt;TD COLSPAN=7&gt;
      &lt;FONT color="#0000FF" SIZE=4 FACE=ARIAL&gt;&lt;B&gt;SMD TRIM-POT CROSS REFERENCE&lt;/B&gt;&lt;/FONT&gt;
      &lt;P&gt;
      &lt;FONT SIZE=4 FACE=ARIAL&gt;&lt;B&gt;MULTI-TURN&lt;/B&gt;&lt;/FONT&gt;
    &lt;/TD&gt;
  &lt;/TR&gt;
  &lt;TR&gt;
    &lt;TD&gt;
      &lt;FONT SIZE=3 FACE=ARIAL&gt;&lt;B&gt;BOURNS&lt;/B&gt;&lt;/FONT&gt;
    &lt;/TD&gt;
    &lt;TD&gt;
      &lt;FONT SIZE=3 FACE=ARIAL&gt;&lt;B&gt;BI&amp;nbsp;TECH&lt;/B&gt;&lt;/FONT&gt;
    &lt;/TD&gt;
    &lt;TD&gt;
      &lt;FONT SIZE=3 FACE=ARIAL&gt;&lt;B&gt;DALE-VISHAY&lt;/B&gt;&lt;/FONT&gt;
    &lt;/TD&gt;
    &lt;TD&gt;
      &lt;FONT SIZE=3 FACE=ARIAL&gt;&lt;B&gt;PHILIPS/MEPCO&lt;/B&gt;&lt;/FONT&gt;
    &lt;/TD&gt;
    &lt;TD&gt;
      &lt;FONT SIZE=3 FACE=ARIAL&gt;&lt;B&gt;PANASONIC&lt;/B&gt;&lt;/FONT&gt;
    &lt;/TD&gt;
    &lt;TD&gt;
      &lt;FONT SIZE=3 FACE=ARIAL&gt;&lt;B&gt;TOCOS&lt;/B&gt;&lt;/FONT&gt;
    &lt;/TD&gt;
    &lt;TD&gt;
      &lt;FONT SIZE=3 FACE=ARIAL&gt;&lt;B&gt;AUX/KYOCERA&lt;/B&gt;&lt;/FONT&gt;
    &lt;/TD&gt;
  &lt;/TR&gt;
  &lt;TR&gt;
    &lt;TD BGCOLOR="#cccccc" ALIGN=CENTER&gt;&lt;FONT FACE=ARIAL SIZE=3&gt;
      3224G&lt;BR&gt;
      3224J&lt;BR&gt;
      3224W&lt;BR&gt;
      3269P&lt;BR&gt;
      3269W&lt;BR&gt;
      3269X&lt;BR&gt;&lt;/FONT&gt;
    &lt;/TD&gt;
    &lt;TD BGCOLOR="#cccccc" ALIGN=CENTER&gt;&lt;FONT FACE=ARIAL SIZE=3&gt;
      44G&lt;BR&gt;
      44J&lt;BR&gt;
      44W&lt;BR&gt;
      84P&lt;BR&gt;
      84W&lt;BR&gt;
      84X&lt;BR&gt;&lt;/FONT&gt;
    &lt;/TD&gt;
    &lt;TD BGCOLOR="#cccccc" ALIGN=CENTER&gt;&lt;FONT FACE=ARIAL SIZE=3&gt;
      -&lt;BR&gt;
      -&lt;BR&gt;
      -&lt;BR&gt;
      ST63Z&lt;BR&gt;
      ST63Y&lt;BR&gt;
      -&lt;BR&gt;&lt;/FONT&gt;
    &lt;/TD&gt;
    &lt;TD BGCOLOR="#cccccc" ALIGN=CENTER&gt;&lt;FONT FACE=ARIAL SIZE=3&gt;
      -&lt;BR&gt;
      -&lt;BR&gt;
      -&lt;BR&gt;
      ST5P&lt;BR&gt;
      ST5W&lt;BR&gt;
      ST5X&lt;BR&gt;&lt;/FONT&gt;
    &lt;/TD&gt;
    &lt;TD BGCOLOR="#cccccc" ALIGN=CENTER&gt;&lt;FONT FACE=ARIAL SIZE=3&gt;
      -&lt;BR&gt;
      -&lt;BR&gt;
      -&lt;BR&gt;
      -&lt;BR&gt;
      -&lt;BR&gt;
      -&lt;BR&gt;&lt;/FONT&gt;
    &lt;/TD&gt;
    &lt;TD BGCOLOR="#cccccc" ALIGN=CENTER&gt;&lt;FONT FACE=ARIAL SIZE=3&gt;
      -&lt;BR&gt;
      -&lt;BR&gt;
      -&lt;BR&gt;
      -&lt;BR&gt;
      -&lt;BR&gt;
      -&lt;BR&gt;&lt;/FONT&gt;
    &lt;/TD&gt;
    &lt;TD BGCOLOR="#cccccc" ALIGN=CENTER&gt;&lt;FONT FACE=ARIAL SIZE=3&gt;
      -&lt;BR&gt;
      -&lt;BR&gt;
      -&lt;BR&gt;
      -&lt;BR&gt;
      -&lt;BR&gt;
      -&lt;BR&gt;&lt;/FONT&gt;
    &lt;/TD&gt;
  &lt;/TR&gt;
  &lt;TR&gt;
    &lt;TD COLSPAN=7&gt;&amp;nbsp;
    &lt;/TD&gt;
  &lt;/TR&gt;
  &lt;TR&gt;
    &lt;TD COLSPAN=7&gt;
      &lt;FONT SIZE=4 FACE=ARIAL&gt;&lt;B&gt;SINGLE TURN&lt;/B&gt;&lt;/FONT&gt;
    &lt;/TD&gt;
  &lt;/TR&gt;
  &lt;TR&gt;
    &lt;TD&gt;
      &lt;FONT SIZE=3 FACE=ARIAL&gt;&lt;B&gt;BOURNS&lt;/B&gt;&lt;/FONT&gt;
    &lt;/TD&gt;
    &lt;TD&gt;
      &lt;FONT SIZE=3 FACE=ARIAL&gt;&lt;B&gt;BI&amp;nbsp;TECH&lt;/B&gt;&lt;/FONT&gt;
    &lt;/TD&gt;
    &lt;TD&gt;
      &lt;FONT SIZE=3 FACE=ARIAL&gt;&lt;B&gt;DALE-VISHAY&lt;/B&gt;&lt;/FONT&gt;
    &lt;/TD&gt;
    &lt;TD&gt;
      &lt;FONT SIZE=3 FACE=ARIAL&gt;&lt;B&gt;PHILIPS/MEPCO&lt;/B&gt;&lt;/FONT&gt;
    &lt;/TD&gt;
    &lt;TD&gt;
      &lt;FONT SIZE=3 FACE=ARIAL&gt;&lt;B&gt;PANASONIC&lt;/B&gt;&lt;/FONT&gt;
    &lt;/TD&gt;
    &lt;TD&gt;
      &lt;FONT SIZE=3 FACE=ARIAL&gt;&lt;B&gt;TOCOS&lt;/B&gt;&lt;/FONT&gt;
    &lt;/TD&gt;
    &lt;TD&gt;
      &lt;FONT SIZE=3 FACE=ARIAL&gt;&lt;B&gt;AUX/KYOCERA&lt;/B&gt;&lt;/FONT&gt;
    &lt;/TD&gt;
  &lt;/TR&gt;
  &lt;TR&gt;
    &lt;TD BGCOLOR="#cccccc" ALIGN=CENTER&gt;&lt;FONT FACE=ARIAL SIZE=3&gt;
      3314G&lt;BR&gt;
      3314J&lt;BR&gt;
      3364A/B&lt;BR&gt;
      3364C/D&lt;BR&gt;
      3364W/X&lt;BR&gt;
      3313G&lt;BR&gt;
      3313J&lt;BR&gt;&lt;/FONT&gt;
    &lt;/TD&gt;
    &lt;TD BGCOLOR="#cccccc" ALIGN=CENTER&gt;&lt;FONT FACE=ARIAL SIZE=3&gt;
      23B&lt;BR&gt;
      23A&lt;BR&gt;
      21X&lt;BR&gt;
      21W&lt;BR&gt;
      -&lt;BR&gt;
      22B&lt;BR&gt;
      22A&lt;BR&gt;&lt;/FONT&gt;
    &lt;/TD&gt;
    &lt;TD BGCOLOR="#cccccc" ALIGN=CENTER&gt;&lt;FONT FACE=ARIAL SIZE=3&gt;
      ST5YL/ST53YL&lt;BR&gt;
      ST5YJ/5T53YJ&lt;BR&gt;
      ST-23A&lt;BR&gt;
      ST-22B&lt;BR&gt;
      ST-22&lt;BR&gt;
      -&lt;BR&gt;
      -&lt;BR&gt;&lt;/FONT&gt;
    &lt;/TD&gt;
    &lt;TD BGCOLOR="#cccccc" ALIGN=CENTER&gt;&lt;FONT FACE=ARIAL SIZE=3&gt;
      ST-4B&lt;BR&gt;
      ST-4A&lt;BR&gt;
      -&lt;BR&gt;
      -&lt;BR&gt;
      -&lt;BR&gt;
      ST-3B&lt;BR&gt;
      ST-3A&lt;BR&gt;&lt;/FONT&gt;
    &lt;/TD&gt;
    &lt;TD BGCOLOR="#cccccc" ALIGN=CENTER&gt;&lt;FONT FACE=ARIAL SIZE=3&gt;
      -&lt;BR&gt;
      EVM-6YS&lt;BR&gt;
      EVM-1E&lt;BR&gt;
      EVM-1G&lt;BR&gt;
      EVM-1D&lt;BR&gt;
      -&lt;BR&gt;
      -&lt;BR&gt;&lt;/FONT&gt;
    &lt;/TD&gt;
    &lt;TD BGCOLOR="#cccccc" ALIGN=CENTER&gt;&lt;FONT FACE=ARIAL SIZE=3&gt;
      G4B&lt;BR&gt;
      G4A&lt;BR&gt;
      TR04-3S1&lt;BR&gt;
      TRG04-2S1&lt;BR&gt;
      -&lt;BR&gt;
      -&lt;BR&gt;
      -&lt;BR&gt;&lt;/FONT&gt;
    &lt;/TD&gt;
    &lt;TD BGCOLOR="#cccccc" ALIGN=CENTER&gt;&lt;FONT FACE=ARIAL SIZE=3&gt;
      -&lt;BR&gt;
      -&lt;BR&gt;
      DVR-43A&lt;BR&gt;
      CVR-42C&lt;BR&gt;
      CVR-42A/C&lt;BR&gt;
      -&lt;BR&gt;
      -&lt;BR&gt;&lt;/FONT&gt;
    &lt;/TD&gt;
  &lt;/TR&gt;
&lt;/TABLE&gt;
&lt;P&gt;
&lt;FONT SIZE=4 FACE=ARIAL&gt;&lt;B&gt;ALT =&amp;nbsp;ALTERNATE&lt;/B&gt;&lt;/FONT&gt;
&lt;P&gt;

&amp;nbsp;
&lt;P&gt;
&lt;/td&gt;
&lt;/tr&gt;
&lt;/table&gt;</description>
<packages>
<package name="C0201" urn="urn:adsk.eagle:footprint:23196/1" library_version="11">
<description>Source: http://www.avxcorp.com/docs/catalogs/cx5r.pdf</description>
<smd name="1" x="-0.25" y="0" dx="0.25" dy="0.35" layer="1"/>
<smd name="2" x="0.25" y="0" dx="0.25" dy="0.35" layer="1"/>
<text x="-0.635" y="0.635" size="1.27" layer="25">&gt;NAME</text>
<text x="-0.635" y="-1.905" size="1.27" layer="27">&gt;VALUE</text>
<rectangle x1="-0.3" y1="-0.15" x2="-0.15" y2="0.15" layer="51"/>
<rectangle x1="0.15" y1="-0.15" x2="0.3" y2="0.15" layer="51"/>
<rectangle x1="-0.15" y1="0.1" x2="0.15" y2="0.15" layer="51"/>
<rectangle x1="-0.15" y1="-0.15" x2="0.15" y2="-0.1" layer="51"/>
</package>
</packages>
<packages3d>
<package3d name="C0201" urn="urn:adsk.eagle:package:23690/2" type="model" library_version="11">
<description>Source: http://www.avxcorp.com/docs/catalogs/cx5r.pdf</description>
<packageinstances>
<packageinstance name="C0201"/>
</packageinstances>
</package3d>
</packages3d>
</library>
<library name="wirepad" urn="urn:adsk.eagle:library:412">
<description>&lt;b&gt;Single Pads&lt;/b&gt;&lt;p&gt;
&lt;author&gt;Created by librarian@cadsoft.de&lt;/author&gt;</description>
<packages>
<package name="SMD1,27-2,54" urn="urn:adsk.eagle:footprint:30822/1" library_version="2">
<description>&lt;b&gt;SMD PAD&lt;/b&gt;</description>
<smd name="1" x="0" y="0" dx="1.27" dy="2.54" layer="1"/>
<text x="0" y="0" size="0.0254" layer="27">&gt;VALUE</text>
<text x="-0.8" y="-2.4" size="1.27" layer="25" rot="R90">&gt;NAME</text>
</package>
</packages>
<packages3d>
<package3d name="SMD1,27-2,54" urn="urn:adsk.eagle:package:30839/1" type="box" library_version="2">
<description>SMD PAD</description>
<packageinstances>
<packageinstance name="SMD1,27-2,54"/>
</packageinstances>
</package3d>
</packages3d>
</library>
<library name="JLCPCB" urn="urn:adsk.eagle:library:40383427">
<packages>
<package name="BMP384" urn="urn:adsk.eagle:footprint:40107429/1" library_version="20">
<description>&lt;b&gt;BMP384-1&lt;/b&gt;&lt;br&gt;
</description>
<smd name="1" x="0.25" y="0.758" dx="0.285" dy="0.27" layer="1" rot="R90"/>
<smd name="2" x="-0.25" y="0.758" dx="0.285" dy="0.27" layer="1" rot="R90"/>
<smd name="3" x="-0.757" y="0.5" dx="0.285" dy="0.27" layer="1"/>
<smd name="4" x="-0.757" y="0" dx="0.285" dy="0.27" layer="1"/>
<smd name="5" x="-0.757" y="-0.5" dx="0.285" dy="0.27" layer="1"/>
<smd name="6" x="-0.25" y="-0.758" dx="0.285" dy="0.27" layer="1" rot="R90"/>
<smd name="7" x="0.25" y="-0.758" dx="0.285" dy="0.27" layer="1" rot="R90"/>
<smd name="8" x="0.757" y="-0.5" dx="0.285" dy="0.27" layer="1"/>
<smd name="9" x="0.757" y="0" dx="0.285" dy="0.27" layer="1"/>
<smd name="10" x="0.757" y="0.5" dx="0.285" dy="0.27" layer="1"/>
<text x="0" y="0" size="1.27" layer="25" align="center">&gt;NAME</text>
<text x="0" y="0" size="1.27" layer="27" align="center">&gt;VALUE</text>
<wire x1="-1" y1="-1" x2="1" y2="-1" width="0.1" layer="51"/>
<wire x1="1" y1="-1" x2="1" y2="1" width="0.1" layer="51"/>
<wire x1="1" y1="1" x2="-1" y2="1" width="0.1" layer="51"/>
<wire x1="-1" y1="1" x2="-1" y2="-1" width="0.1" layer="51"/>
<wire x1="-2" y1="2" x2="2" y2="2" width="0.1" layer="51"/>
<wire x1="2" y1="2" x2="2" y2="-2" width="0.1" layer="51"/>
<wire x1="2" y1="-2" x2="-2" y2="-2" width="0.1" layer="51"/>
<wire x1="-2" y1="-2" x2="-2" y2="2" width="0.1" layer="51"/>
<wire x1="0.25" y1="1.6" x2="0.25" y2="1.6" width="0.2" layer="21"/>
<wire x1="0.25" y1="1.6" x2="0.25" y2="1.5" width="0.2" layer="21" curve="180"/>
<wire x1="0.25" y1="1.5" x2="0.25" y2="1.5" width="0.2" layer="21"/>
<wire x1="0.25" y1="1.5" x2="0.25" y2="1.6" width="0.2" layer="21" curve="180"/>
<wire x1="0.25" y1="1.6" x2="0.25" y2="1.6" width="0.2" layer="21"/>
<wire x1="0.25" y1="1.6" x2="0.25" y2="1.5" width="0.2" layer="21" curve="180"/>
</package>
<package name="IIM42352" urn="urn:adsk.eagle:footprint:42554984/1" library_version="19">
<description>&lt;b&gt;14 Lead LGA (2.5x3x0.91)_1&lt;/b&gt;&lt;br&gt;
</description>
<smd name="1" x="-1.15" y="0.75" dx="0.6" dy="0.3" layer="1"/>
<smd name="2" x="-1.15" y="0.25" dx="0.6" dy="0.3" layer="1"/>
<smd name="3" x="-1.15" y="-0.25" dx="0.6" dy="0.3" layer="1"/>
<smd name="4" x="-1.15" y="-0.75" dx="0.6" dy="0.3" layer="1"/>
<smd name="5" x="-0.5" y="-0.9" dx="0.6" dy="0.3" layer="1" rot="R90"/>
<smd name="6" x="0" y="-0.9" dx="0.6" dy="0.3" layer="1" rot="R90"/>
<smd name="7" x="0.5" y="-0.9" dx="0.6" dy="0.3" layer="1" rot="R90"/>
<smd name="8" x="1.15" y="-0.75" dx="0.6" dy="0.3" layer="1"/>
<smd name="9" x="1.15" y="-0.25" dx="0.6" dy="0.3" layer="1"/>
<smd name="10" x="1.15" y="0.25" dx="0.6" dy="0.3" layer="1"/>
<smd name="11" x="1.15" y="0.75" dx="0.6" dy="0.3" layer="1"/>
<smd name="12" x="0.5" y="0.9" dx="0.6" dy="0.3" layer="1" rot="R90"/>
<smd name="13" x="0" y="0.9" dx="0.6" dy="0.3" layer="1" rot="R90"/>
<smd name="14" x="-0.5" y="0.9" dx="0.6" dy="0.3" layer="1" rot="R90"/>
<text x="-0.225" y="0" size="1.27" layer="25" align="center">&gt;NAME</text>
<text x="-0.225" y="0" size="1.27" layer="27" align="center">&gt;VALUE</text>
<wire x1="-1.5" y1="1.25" x2="1.5" y2="1.25" width="0.2" layer="51"/>
<wire x1="1.5" y1="1.25" x2="1.5" y2="-1.25" width="0.2" layer="51"/>
<wire x1="1.5" y1="-1.25" x2="-1.5" y2="-1.25" width="0.2" layer="51"/>
<wire x1="-1.5" y1="-1.25" x2="-1.5" y2="1.25" width="0.2" layer="51"/>
<wire x1="-2.7" y1="2" x2="2.25" y2="2" width="0.1" layer="51"/>
<wire x1="2.25" y1="2" x2="2.25" y2="-2" width="0.1" layer="51"/>
<wire x1="2.25" y1="-2" x2="-2.7" y2="-2" width="0.1" layer="51"/>
<wire x1="-2.7" y1="-2" x2="-2.7" y2="2" width="0.1" layer="51"/>
<wire x1="-1.5" y1="1" x2="-1.5" y2="1.25" width="0.1" layer="21"/>
<wire x1="-1.5" y1="1.25" x2="-0.8" y2="1.25" width="0.1" layer="21"/>
<wire x1="0.8" y1="1.25" x2="1.5" y2="1.25" width="0.1" layer="21"/>
<wire x1="1.5" y1="1.25" x2="1.5" y2="1" width="0.1" layer="21"/>
<wire x1="-1.5" y1="-1.1" x2="-1.5" y2="-1.25" width="0.1" layer="21"/>
<wire x1="-1.5" y1="-1.25" x2="-0.8" y2="-1.25" width="0.1" layer="21"/>
<wire x1="0.8" y1="-1.25" x2="1.5" y2="-1.25" width="0.1" layer="21"/>
<wire x1="1.5" y1="-1.25" x2="1.5" y2="-1" width="0.1" layer="21"/>
<wire x1="-1.9" y1="0.8" x2="-1.9" y2="0.8" width="0.1" layer="21"/>
<wire x1="-1.9" y1="0.8" x2="-1.9" y2="0.7" width="0.1" layer="21" curve="180"/>
<wire x1="-1.9" y1="0.7" x2="-1.9" y2="0.7" width="0.1" layer="21"/>
<wire x1="-1.9" y1="0.7" x2="-1.9" y2="0.8" width="0.1" layer="21" curve="180"/>
</package>
</packages>
<packages3d>
<package3d name="BMP384" urn="urn:adsk.eagle:package:40107454/2" type="model" library_version="20">
<description>&lt;b&gt;BMP384-1&lt;/b&gt;&lt;br&gt;</description>
<packageinstances>
<packageinstance name="BMP384"/>
</packageinstances>
</package3d>
<package3d name="IIM42352" urn="urn:adsk.eagle:package:42554985/2" type="model" library_version="19">
<description>&lt;b&gt;14 Lead LGA (2.5x3x0.91)_1&lt;/b&gt;&lt;br&gt;</description>
<packageinstances>
<packageinstance name="IIM42352"/>
</packageinstances>
</package3d>
</packages3d>
</library>
</libraries>
<attributes>
</attributes>
<variantdefs>
</variantdefs>
<classes>
<class number="0" name="default" width="0" drill="0">
</class>
</classes>
<designrules name="jlcpcb-2layers">
<description language="en">&lt;b&gt;JLCPCB design rules (2 layers)&lt;/b&gt;
&lt;ul&gt;
&lt;li&gt;Board thickness: 1.6mm&lt;/li&gt;
&lt;li&gt;Copper weight: 1oz (35um)&lt;/li&gt;
&lt;li&gt;Note: annular ring aren't minimal&lt;/li&gt;
&lt;/ul&gt;</description>
<param name="layerSetup" value="(1*16)"/>
<param name="mtCopper" value="0.035mm 0.035mm 0.035mm 0.035mm 0.035mm 0.035mm 0.035mm 0.035mm 0.035mm 0.035mm 0.035mm 0.035mm 0.035mm 0.035mm 0.035mm 0.035mm"/>
<param name="mtIsolate" value="0.93mm 0.15mm 0.2mm 0.15mm 0.2mm 0.15mm 0.2mm 0.15mm 0.2mm 0.15mm 0.2mm 0.15mm 0.2mm 0.15mm 0.2mm"/>
<param name="mdWireWire" value="5mil"/>
<param name="mdWirePad" value="0.2mm"/>
<param name="mdWireVia" value="5mil"/>
<param name="mdPadPad" value="5mil"/>
<param name="mdPadVia" value="5mil"/>
<param name="mdViaVia" value="5mil"/>
<param name="mdSmdPad" value="5mil"/>
<param name="mdSmdVia" value="5mil"/>
<param name="mdSmdSmd" value="5mil"/>
<param name="mdViaViaSameLayer" value="6mil"/>
<param name="mnLayersViaInSmd" value="2"/>
<param name="mdCopperDimension" value="0.2mm"/>
<param name="mdDrill" value="6mil"/>
<param name="mdSmdStop" value="0mil"/>
<param name="msWidth" value="3.5mil"/>
<param name="msDrill" value="0.3mm"/>
<param name="msMicroVia" value="9.99mm"/>
<param name="msBlindViaRatio" value="0.5"/>
<param name="rvPadTop" value="0"/>
<param name="rvPadInner" value="0"/>
<param name="rvPadBottom" value="0"/>
<param name="rvViaOuter" value="0"/>
<param name="rvViaInner" value="0"/>
<param name="rvMicroViaOuter" value="0"/>
<param name="rvMicroViaInner" value="0"/>
<param name="rlMinPadTop" value="10mil"/>
<param name="rlMaxPadTop" value="80mil"/>
<param name="rlMinPadInner" value="10mil"/>
<param name="rlMaxPadInner" value="20mil"/>
<param name="rlMinPadBottom" value="10mil"/>
<param name="rlMaxPadBottom" value="80mil"/>
<param name="rlMinViaOuter" value="0.13mm"/>
<param name="rlMaxViaOuter" value="20mil"/>
<param name="rlMinViaInner" value="0.13mm"/>
<param name="rlMaxViaInner" value="20mil"/>
<param name="rlMinMicroViaOuter" value="3mil"/>
<param name="rlMaxMicroViaOuter" value="20mil"/>
<param name="rlMinMicroViaInner" value="4mil"/>
<param name="rlMaxMicroViaInner" value="20mil"/>
<param name="psTop" value="-1"/>
<param name="psBottom" value="-1"/>
<param name="psFirst" value="-1"/>
<param name="psElongationLong" value="100"/>
<param name="psElongationOffset" value="100"/>
<param name="mvStopFrame" value="1"/>
<param name="mvCreamFrame" value="0"/>
<param name="mlMinStopFrame" value="0.05mm"/>
<param name="mlMaxStopFrame" value="0.05mm"/>
<param name="mlMinCreamFrame" value="0mil"/>
<param name="mlMaxCreamFrame" value="0mil"/>
<param name="mlViaStopLimit" value="0mil"/>
<param name="srRoundness" value="0"/>
<param name="srMinRoundness" value="0mil"/>
<param name="srMaxRoundness" value="0mil"/>
<param name="slThermalIsolate" value="10mil"/>
<param name="slThermalsForVias" value="0"/>
<param name="dpMaxLengthDifference" value="10mm"/>
<param name="dpGapFactor" value="2.5"/>
<param name="checkAngle" value="0"/>
<param name="checkFont" value="1"/>
<param name="checkRestrict" value="1"/>
<param name="checkStop" value="0"/>
<param name="checkValues" value="0"/>
<param name="checkNames" value="1"/>
<param name="checkWireStubs" value="1"/>
<param name="checkPolygonWidth" value="0"/>
<param name="useDiameter" value="13"/>
<param name="maxErrors" value="50"/>
</designrules>
<autorouter>
<pass name="Default">
<param name="RoutingGrid" value="50mil"/>
<param name="AutoGrid" value="1"/>
<param name="Efforts" value="0"/>
<param name="TopRouterVariant" value="1"/>
<param name="tpViaShape" value="round"/>
<param name="PrefDir.1" value="a"/>
<param name="PrefDir.2" value="0"/>
<param name="PrefDir.3" value="0"/>
<param name="PrefDir.4" value="0"/>
<param name="PrefDir.5" value="0"/>
<param name="PrefDir.6" value="0"/>
<param name="PrefDir.7" value="0"/>
<param name="PrefDir.8" value="0"/>
<param name="PrefDir.9" value="0"/>
<param name="PrefDir.10" value="0"/>
<param name="PrefDir.11" value="0"/>
<param name="PrefDir.12" value="0"/>
<param name="PrefDir.13" value="0"/>
<param name="PrefDir.14" value="0"/>
<param name="PrefDir.15" value="0"/>
<param name="PrefDir.16" value="a"/>
<param name="cfVia" value="8"/>
<param name="cfNonPref" value="5"/>
<param name="cfChangeDir" value="2"/>
<param name="cfOrthStep" value="2"/>
<param name="cfDiagStep" value="3"/>
<param name="cfExtdStep" value="0"/>
<param name="cfBonusStep" value="1"/>
<param name="cfMalusStep" value="1"/>
<param name="cfPadImpact" value="4"/>
<param name="cfSmdImpact" value="4"/>
<param name="cfBusImpact" value="0"/>
<param name="cfHugging" value="3"/>
<param name="cfAvoid" value="4"/>
<param name="cfPolygon" value="10"/>
<param name="cfBase.1" value="0"/>
<param name="cfBase.2" value="1"/>
<param name="cfBase.3" value="1"/>
<param name="cfBase.4" value="1"/>
<param name="cfBase.5" value="1"/>
<param name="cfBase.6" value="1"/>
<param name="cfBase.7" value="1"/>
<param name="cfBase.8" value="1"/>
<param name="cfBase.9" value="1"/>
<param name="cfBase.10" value="1"/>
<param name="cfBase.11" value="1"/>
<param name="cfBase.12" value="1"/>
<param name="cfBase.13" value="1"/>
<param name="cfBase.14" value="1"/>
<param name="cfBase.15" value="1"/>
<param name="cfBase.16" value="0"/>
<param name="mnVias" value="20"/>
<param name="mnSegments" value="9999"/>
<param name="mnExtdSteps" value="9999"/>
<param name="mnRipupLevel" value="10"/>
<param name="mnRipupSteps" value="100"/>
<param name="mnRipupTotal" value="100"/>
</pass>
<pass name="Follow-me" refer="Default" active="yes">
</pass>
<pass name="Busses" refer="Default" active="yes">
<param name="cfNonPref" value="4"/>
<param name="cfBusImpact" value="4"/>
<param name="cfHugging" value="0"/>
<param name="mnVias" value="0"/>
</pass>
<pass name="Route" refer="Default" active="yes">
</pass>
<pass name="Optimize1" refer="Default" active="yes">
<param name="cfVia" value="99"/>
<param name="cfExtdStep" value="10"/>
<param name="cfHugging" value="1"/>
<param name="mnExtdSteps" value="1"/>
<param name="mnRipupLevel" value="0"/>
</pass>
<pass name="Optimize2" refer="Optimize1" active="yes">
<param name="cfNonPref" value="0"/>
<param name="cfChangeDir" value="6"/>
<param name="cfExtdStep" value="0"/>
<param name="cfBonusStep" value="2"/>
<param name="cfMalusStep" value="2"/>
<param name="cfPadImpact" value="2"/>
<param name="cfSmdImpact" value="2"/>
<param name="cfHugging" value="0"/>
</pass>
<pass name="Optimize3" refer="Optimize2" active="yes">
<param name="cfChangeDir" value="8"/>
<param name="cfPadImpact" value="0"/>
<param name="cfSmdImpact" value="0"/>
</pass>
<pass name="Optimize4" refer="Optimize3" active="yes">
<param name="cfChangeDir" value="25"/>
</pass>
</autorouter>
<elements>
<element name="IC1" library="JLCPCB" library_urn="urn:adsk.eagle:library:40383427" package="BMP384" package3d_urn="urn:adsk.eagle:package:40107454/2" value="BMP384" x="0" y="6" smashed="yes">
<attribute name="DESCRIPTION" value="Board Mount Pressure Sensors Absolute Pressure Sensor" x="22.86" y="-10.51" size="1.778" layer="27" display="off"/>
<attribute name="HEIGHT" value="1mm" x="22.86" y="-10.51" size="1.778" layer="27" display="off"/>
<attribute name="JLC_ROTATION" value="180" x="0" y="6" size="1.778" layer="27" display="off"/>
<attribute name="LCSC_PART" value="C9900010680" x="0" y="6" size="1.778" layer="27" display="off"/>
<attribute name="MANUFACTURER_NAME" value="BOSCH" x="22.86" y="-10.51" size="1.778" layer="27" display="off"/>
<attribute name="MANUFACTURER_PART_NUMBER" value="BMP384" x="22.86" y="-10.51" size="1.778" layer="27" display="off"/>
<attribute name="MOUSER_PART_NUMBER" value="262-BMP384" x="22.86" y="-10.51" size="1.778" layer="27" display="off"/>
<attribute name="MOUSER_PRICE-STOCK" value="https://www.mouser.co.uk/ProductDetail/Bosch-Sensortec/BMP384?qs=IS%252B4QmGtzzqB3KCclqIEVQ%3D%3D" x="22.86" y="-10.51" size="1.778" layer="27" display="off"/>
</element>
<element name="IC2" library="JLCPCB" library_urn="urn:adsk.eagle:library:40383427" package="IIM42352" package3d_urn="urn:adsk.eagle:package:42554985/2" value="ICM-42688-P" x="3.7" y="6" smashed="yes" rot="R180">
<attribute name="DESCRIPTION" value="IMU (Inertial Measurement Unit), 6-Axis, Accelerometer, Gyroscope" x="-12.81" y="22.51" size="1.778" layer="27" rot="R180" display="off"/>
<attribute name="HEIGHT" value="mm" x="3.7" y="6" size="1.778" layer="27" rot="R180" display="off"/>
<attribute name="LCSC_PART" value="C1850418" x="3.7" y="6" size="1.778" layer="27" rot="R180" display="off"/>
<attribute name="MANUFACTURER_NAME" value="TDK" x="3.7" y="6" size="1.778" layer="27" rot="R180" display="off"/>
<attribute name="MANUFACTURER_PART_NUMBER" value="ICM-42688-P" x="3.7" y="6" size="1.778" layer="27" rot="R180" display="off"/>
<attribute name="MOUSER_PART_NUMBER" value="410-ICM-42688-P" x="3.7" y="6" size="1.778" layer="27" rot="R180" display="off"/>
<attribute name="MOUSER_PRICE-STOCK" value="https://www.mouser.co.uk/ProductDetail/TDK-InvenSense/ICM-42688-P?qs=OlC7AqGiEDk8QrNAV728zw%3D%3D" x="3.7" y="6" size="1.778" layer="27" rot="R180" display="off"/>
</element>
<element name="C1" library="rcl" library_urn="urn:adsk.eagle:library:334" package="C0201" package3d_urn="urn:adsk.eagle:package:23690/2" value="100nF" x="-0.75" y="7.7768" smashed="yes" rot="R270">
<attribute name="LCSC_PART" value="C161494" x="-0.75" y="7.7768" size="1.778" layer="27" rot="R270" display="off"/>
<attribute name="POPULARITY" value="0" x="-0.8" y="7.7768" size="1.778" layer="27" rot="R270" display="off"/>
<attribute name="SPICEPREFIX" value="C" x="-0.8" y="7.7768" size="1.778" layer="27" rot="R270" display="off"/>
</element>
<element name="C2" library="rcl" library_urn="urn:adsk.eagle:library:334" package="C0201" package3d_urn="urn:adsk.eagle:package:23690/2" value="100nF" x="0.8" y="7.77" smashed="yes" rot="R270">
<attribute name="LCSC_PART" value="C161494" x="0.8" y="7.77" size="1.778" layer="27" rot="R270" display="off"/>
<attribute name="POPULARITY" value="0" x="0.8" y="7.27" size="1.778" layer="27" rot="R270" display="off"/>
<attribute name="SPICEPREFIX" value="C" x="0.8" y="7.27" size="1.778" layer="27" rot="R270" display="off"/>
</element>
<element name="SDA" library="wirepad" library_urn="urn:adsk.eagle:library:412" package="SMD1,27-2,54" package3d_urn="urn:adsk.eagle:package:30839/1" value="+3V3" x="-3.75" y="4.75" smashed="yes" rot="R90">
<attribute name="POPULARITY" value="15" x="-3.75" y="4.75" size="1.778" layer="27" rot="R90" display="off"/>
<attribute name="VALUE" x="-3.75" y="4.75" size="0.0254" layer="27" rot="R90"/>
</element>
<element name="SCL" library="wirepad" library_urn="urn:adsk.eagle:library:412" package="SMD1,27-2,54" package3d_urn="urn:adsk.eagle:package:30839/1" value="+3V3" x="-3.75" y="7.25" smashed="yes" rot="R90">
<attribute name="POPULARITY" value="15" x="-10.75" y="3.25" size="1.778" layer="27" rot="R90" display="off"/>
<attribute name="VALUE" x="-3.75" y="7.25" size="0.0254" layer="27" rot="R90"/>
</element>
<element name="VCC" library="wirepad" library_urn="urn:adsk.eagle:library:412" package="SMD1,27-2,54" package3d_urn="urn:adsk.eagle:package:30839/1" value="+3V3" x="-3.75" y="7.25" smashed="yes" rot="MR270">
<attribute name="POPULARITY" value="15" x="-9.75" y="11.25" size="1.778" layer="28" rot="MR270" display="off"/>
<attribute name="VALUE" x="-3.75" y="7.25" size="0.0254" layer="28" rot="MR270"/>
</element>
<element name="GND" library="wirepad" library_urn="urn:adsk.eagle:library:412" package="SMD1,27-2,54" package3d_urn="urn:adsk.eagle:package:30839/1" value="" x="-3.75" y="4.75" smashed="yes" rot="MR270">
<attribute name="POPULARITY" value="15" x="-15.75" y="12.75" size="1.778" layer="28" rot="MR270" display="off"/>
<attribute name="VALUE" x="-3.75" y="4.75" size="0.0254" layer="28" rot="MR270"/>
</element>
<element name="C3" library="rcl" library_urn="urn:adsk.eagle:library:334" package="C0201" package3d_urn="urn:adsk.eagle:package:23690/2" value="100nF" x="2.6488" y="7.873" smashed="yes" rot="R180">
<attribute name="LCSC_PART" value="C161494" x="2.6488" y="7.873" size="1.778" layer="27" rot="R180" display="off"/>
<attribute name="POPULARITY" value="0" x="2.2488" y="7.873" size="1.778" layer="27" rot="R180" display="off"/>
<attribute name="SPICEPREFIX" value="C" x="2.2488" y="7.873" size="1.778" layer="27" rot="R180" display="off"/>
</element>
<element name="C4" library="rcl" library_urn="urn:adsk.eagle:library:334" package="C0201" package3d_urn="urn:adsk.eagle:package:23690/2" value="2.2uF" x="1.7794" y="7.7746" smashed="yes" rot="R90">
<attribute name="LCSC_PART" value="C335106" x="1.7794" y="7.7746" size="1.778" layer="27" rot="R90" display="off"/>
<attribute name="POPULARITY" value="0" x="1.7794" y="8.0246" size="1.778" layer="27" rot="R90" display="off"/>
<attribute name="SPICEPREFIX" value="C" x="1.7794" y="8.0246" size="1.778" layer="27" rot="R90" display="off"/>
</element>
<element name="C5" library="rcl" library_urn="urn:adsk.eagle:library:334" package="C0201" package3d_urn="urn:adsk.eagle:package:23690/2" value="10nF" x="4.8138" y="7.871" smashed="yes" rot="R180">
<attribute name="LCSC_PART" value="C3899136" x="4.8138" y="7.871" size="1.778" layer="27" rot="R180" display="off"/>
<attribute name="POPULARITY" value="0" x="4.8138" y="7.871" size="1.778" layer="27" rot="R180" display="off"/>
<attribute name="SPICEPREFIX" value="C" x="4.8138" y="7.871" size="1.778" layer="27" rot="R180" display="off"/>
</element>
<element name="IC3" library="JLCPCB" library_urn="urn:adsk.eagle:library:40383427" package="BMP384" package3d_urn="urn:adsk.eagle:package:40107454/2" value="BMP384" x="0" y="0" smashed="yes">
<attribute name="DESCRIPTION" value="Board Mount Pressure Sensors Absolute Pressure Sensor" x="22.86" y="-16.51" size="1.778" layer="27" display="off"/>
<attribute name="HEIGHT" value="1mm" x="22.86" y="-16.51" size="1.778" layer="27" display="off"/>
<attribute name="JLC_ROTATION" value="180" x="0" y="0" size="1.778" layer="27" display="off"/>
<attribute name="LCSC_PART" value="C9900010680" x="0" y="0" size="1.778" layer="27" display="off"/>
<attribute name="MANUFACTURER_NAME" value="BOSCH" x="22.86" y="-16.51" size="1.778" layer="27" display="off"/>
<attribute name="MANUFACTURER_PART_NUMBER" value="BMP384" x="22.86" y="-16.51" size="1.778" layer="27" display="off"/>
<attribute name="MOUSER_PART_NUMBER" value="262-BMP384" x="22.86" y="-16.51" size="1.778" layer="27" display="off"/>
<attribute name="MOUSER_PRICE-STOCK" value="https://www.mouser.co.uk/ProductDetail/Bosch-Sensortec/BMP384?qs=IS%252B4QmGtzzqB3KCclqIEVQ%3D%3D" x="22.86" y="-16.51" size="1.778" layer="27" display="off"/>
</element>
<element name="IC4" library="JLCPCB" library_urn="urn:adsk.eagle:library:40383427" package="IIM42352" package3d_urn="urn:adsk.eagle:package:42554985/2" value="ICM-42688-P" x="3.7" y="0" smashed="yes" rot="R180">
<attribute name="DESCRIPTION" value="IMU (Inertial Measurement Unit), 6-Axis, Accelerometer, Gyroscope" x="-12.81" y="16.51" size="1.778" layer="27" rot="R180" display="off"/>
<attribute name="HEIGHT" value="mm" x="3.7" y="0" size="1.778" layer="27" rot="R180" display="off"/>
<attribute name="LCSC_PART" value="C1850418" x="3.7" y="0" size="1.778" layer="27" rot="R180" display="off"/>
<attribute name="MANUFACTURER_NAME" value="TDK" x="3.7" y="0" size="1.778" layer="27" rot="R180" display="off"/>
<attribute name="MANUFACTURER_PART_NUMBER" value="ICM-42688-P" x="3.7" y="0" size="1.778" layer="27" rot="R180" display="off"/>
<attribute name="MOUSER_PART_NUMBER" value="410-ICM-42688-P" x="3.7" y="0" size="1.778" layer="27" rot="R180" display="off"/>
<attribute name="MOUSER_PRICE-STOCK" value="https://www.mouser.co.uk/ProductDetail/TDK-InvenSense/ICM-42688-P?qs=OlC7AqGiEDk8QrNAV728zw%3D%3D" x="3.7" y="0" size="1.778" layer="27" rot="R180" display="off"/>
</element>
<element name="C6" library="rcl" library_urn="urn:adsk.eagle:library:334" package="C0201" package3d_urn="urn:adsk.eagle:package:23690/2" value="100nF" x="-0.75" y="1.7768" smashed="yes" rot="R270">
<attribute name="LCSC_PART" value="C161494" x="-0.75" y="1.7768" size="1.778" layer="27" rot="R270" display="off"/>
<attribute name="POPULARITY" value="0" x="-0.8" y="1.7768" size="1.778" layer="27" rot="R270" display="off"/>
<attribute name="SPICEPREFIX" value="C" x="-0.8" y="1.7768" size="1.778" layer="27" rot="R270" display="off"/>
</element>
<element name="C7" library="rcl" library_urn="urn:adsk.eagle:library:334" package="C0201" package3d_urn="urn:adsk.eagle:package:23690/2" value="100nF" x="0.8" y="1.77" smashed="yes" rot="R270">
<attribute name="LCSC_PART" value="C161494" x="0.8" y="1.77" size="1.778" layer="27" rot="R270" display="off"/>
<attribute name="POPULARITY" value="0" x="0.8" y="1.27" size="1.778" layer="27" rot="R270" display="off"/>
<attribute name="SPICEPREFIX" value="C" x="0.8" y="1.27" size="1.778" layer="27" rot="R270" display="off"/>
</element>
<element name="SDA1" library="wirepad" library_urn="urn:adsk.eagle:library:412" package="SMD1,27-2,54" package3d_urn="urn:adsk.eagle:package:30839/1" value="+3V3" x="-3.75" y="-1.25" smashed="yes" rot="R90">
<attribute name="POPULARITY" value="15" x="-3.75" y="-1.25" size="1.778" layer="27" rot="R90" display="off"/>
<attribute name="VALUE" x="-3.75" y="-1.25" size="0.0254" layer="27" rot="R90"/>
</element>
<element name="SCL1" library="wirepad" library_urn="urn:adsk.eagle:library:412" package="SMD1,27-2,54" package3d_urn="urn:adsk.eagle:package:30839/1" value="+3V3" x="-3.75" y="1.25" smashed="yes" rot="R90">
<attribute name="POPULARITY" value="15" x="-10.75" y="-2.75" size="1.778" layer="27" rot="R90" display="off"/>
<attribute name="VALUE" x="-3.75" y="1.25" size="0.0254" layer="27" rot="R90"/>
</element>
<element name="VCC1" library="wirepad" library_urn="urn:adsk.eagle:library:412" package="SMD1,27-2,54" package3d_urn="urn:adsk.eagle:package:30839/1" value="+3V3" x="-3.75" y="1.25" smashed="yes" rot="MR270">
<attribute name="POPULARITY" value="15" x="-9.75" y="5.25" size="1.778" layer="28" rot="MR270" display="off"/>
<attribute name="VALUE" x="-3.75" y="1.25" size="0.0254" layer="28" rot="MR270"/>
</element>
<element name="GND1" library="wirepad" library_urn="urn:adsk.eagle:library:412" package="SMD1,27-2,54" package3d_urn="urn:adsk.eagle:package:30839/1" value="" x="-3.75" y="-1.25" smashed="yes" rot="MR270">
<attribute name="POPULARITY" value="15" x="-15.75" y="6.75" size="1.778" layer="28" rot="MR270" display="off"/>
<attribute name="VALUE" x="-3.75" y="-1.25" size="0.0254" layer="28" rot="MR270"/>
</element>
<element name="C8" library="rcl" library_urn="urn:adsk.eagle:library:334" package="C0201" package3d_urn="urn:adsk.eagle:package:23690/2" value="100nF" x="2.6488" y="1.873" smashed="yes" rot="R180">
<attribute name="LCSC_PART" value="C161494" x="2.6488" y="1.873" size="1.778" layer="27" rot="R180" display="off"/>
<attribute name="POPULARITY" value="0" x="2.2488" y="1.873" size="1.778" layer="27" rot="R180" display="off"/>
<attribute name="SPICEPREFIX" value="C" x="2.2488" y="1.873" size="1.778" layer="27" rot="R180" display="off"/>
</element>
<element name="C9" library="rcl" library_urn="urn:adsk.eagle:library:334" package="C0201" package3d_urn="urn:adsk.eagle:package:23690/2" value="2.2uF" x="1.7794" y="1.7746" smashed="yes" rot="R90">
<attribute name="LCSC_PART" value="C335106" x="1.7794" y="1.7746" size="1.778" layer="27" rot="R90" display="off"/>
<attribute name="POPULARITY" value="0" x="1.7794" y="2.0246" size="1.778" layer="27" rot="R90" display="off"/>
<attribute name="SPICEPREFIX" value="C" x="1.7794" y="2.0246" size="1.778" layer="27" rot="R90" display="off"/>
</element>
<element name="C10" library="rcl" library_urn="urn:adsk.eagle:library:334" package="C0201" package3d_urn="urn:adsk.eagle:package:23690/2" value="10nF" x="4.8138" y="1.871" smashed="yes" rot="R180">
<attribute name="LCSC_PART" value="C3899136" x="4.8138" y="1.871" size="1.778" layer="27" rot="R180" display="off"/>
<attribute name="POPULARITY" value="0" x="4.8138" y="1.871" size="1.778" layer="27" rot="R180" display="off"/>
<attribute name="SPICEPREFIX" value="C" x="4.8138" y="1.871" size="1.778" layer="27" rot="R180" display="off"/>
</element>
</elements>
<signals>
<signal name="GND">
<contactref element="IC2" pad="6"/>
<contactref element="C1" pad="2"/>
<contactref element="C2" pad="2"/>
<contactref element="GND" pad="1"/>
<contactref element="C3" pad="1"/>
<contactref element="C4" pad="1"/>
<contactref element="C5" pad="2"/>
<contactref element="IC2" pad="7"/>
<contactref element="IC2" pad="11"/>
<contactref element="IC2" pad="9"/>
<polygon width="0.1524" layer="1" orphans="yes">
<vertex x="-5.5" y="8.5"/>
<vertex x="5.5" y="8.5"/>
<vertex x="5.5" y="3.5"/>
<vertex x="-5.5" y="3.5"/>
</polygon>
<polygon width="0.1524" layer="16" orphans="yes">
<vertex x="-5.5" y="3.5"/>
<vertex x="-5.5" y="8.5"/>
<vertex x="5.5" y="8.5"/>
<vertex x="5.5" y="3.5"/>
</polygon>
<contactref element="IC2" pad="1"/>
<contactref element="IC1" pad="5"/>
<via x="4.9276" y="4.1712" extent="1-16" drill="0.35"/>
<wire x1="2.4882" y1="6.2032" x2="2.55" y2="6.25" width="0.1524" layer="1"/>
<wire x1="2.4882" y1="6.2032" x2="1.8468" y2="6.2032" width="0.1524" layer="1"/>
<wire x1="1.8468" y1="6.2032" x2="1.8468" y2="5.4032" width="0.1524" layer="1"/>
<wire x1="1.8468" y1="5.4032" x2="2" y2="5.25" width="0.1524" layer="1"/>
<wire x1="2" y1="5.25" x2="2.55" y2="5.25" width="0.1524" layer="1"/>
<via x="0" y="6" extent="1-16" drill="0.35"/>
<via x="0.0254" y="7.5" extent="1-16" drill="0.35"/>
<via x="-3.75" y="6" extent="1-16" drill="0.35"/>
<wire x1="1.7794" y1="7.5246" x2="1.8468" y2="7.4572" width="0.1524" layer="1"/>
<wire x1="1.8468" y1="7.4572" x2="1.8468" y2="6.2032" width="0.1524" layer="1"/>
<contactref element="IC1" pad="3"/>
<contactref element="IC1" pad="8"/>
<contactref element="IC1" pad="9"/>
<contactref element="IC1" pad="7"/>
<contactref element="IC4" pad="6"/>
<contactref element="C6" pad="2"/>
<contactref element="C7" pad="2"/>
<contactref element="GND1" pad="1"/>
<contactref element="C8" pad="1"/>
<contactref element="C9" pad="1"/>
<contactref element="C10" pad="2"/>
<contactref element="IC4" pad="7"/>
<contactref element="IC4" pad="11"/>
<contactref element="IC4" pad="9"/>
<polygon width="0.1524" layer="1" orphans="yes">
<vertex x="-5.5" y="2.5"/>
<vertex x="5.5" y="2.5"/>
<vertex x="5.5" y="-2.5"/>
<vertex x="-5.5" y="-2.5"/>
</polygon>
<polygon width="0.1524" layer="16" orphans="yes">
<vertex x="-5.5" y="-2.5"/>
<vertex x="-5.5" y="2.5"/>
<vertex x="5.5" y="2.5"/>
<vertex x="5.5" y="-2.5"/>
</polygon>
<contactref element="IC4" pad="1"/>
<contactref element="IC3" pad="5"/>
<via x="4.9276" y="-1.8288" extent="1-16" drill="0.35"/>
<wire x1="2.4882" y1="0.2032" x2="2.55" y2="0.25" width="0.1524" layer="1"/>
<wire x1="2.4882" y1="0.2032" x2="1.8468" y2="0.2032" width="0.1524" layer="1"/>
<wire x1="1.8468" y1="0.2032" x2="1.8468" y2="-0.5968" width="0.1524" layer="1"/>
<wire x1="1.8468" y1="-0.5968" x2="2" y2="-0.75" width="0.1524" layer="1"/>
<wire x1="2" y1="-0.75" x2="2.55" y2="-0.75" width="0.1524" layer="1"/>
<via x="0" y="0" extent="1-16" drill="0.35"/>
<via x="0.0254" y="1.5" extent="1-16" drill="0.35"/>
<via x="-3.75" y="0" extent="1-16" drill="0.35"/>
<wire x1="1.7794" y1="1.5246" x2="1.8468" y2="1.4572" width="0.1524" layer="1"/>
<wire x1="1.8468" y1="1.4572" x2="1.8468" y2="0.2032" width="0.1524" layer="1"/>
<contactref element="IC3" pad="3"/>
<contactref element="IC3" pad="8"/>
<contactref element="IC3" pad="9"/>
<contactref element="IC3" pad="7"/>
<wire x1="4.9276" y1="4.1712" x2="4.5638" y2="1.871" width="0" layer="19" extent="1-1"/>
</signal>
<signal name="VCC">
<contactref element="IC2" pad="5"/>
<contactref element="C5" pad="1"/>
<wire x1="4.80320625" y1="7.4198" x2="4.4508" y2="7.4198" width="0.1524" layer="1"/>
<wire x1="4.4508" y1="7.4198" x2="4.2" y2="7.161546875" width="0.1524" layer="1"/>
<wire x1="4.2" y1="7.161546875" x2="4.2" y2="6.9" width="0.1524" layer="1"/>
<wire x1="5.0638" y1="7.871" x2="5.0638" y2="7.68039375" width="0.1524" layer="1"/>
<wire x1="5.0638" y1="7.68039375" x2="4.80320625" y2="7.4198" width="0.1524" layer="1"/>
<wire x1="4.1512" y1="6.42985" x2="4.1512" y2="6.8662" width="0.1524" layer="1"/>
<wire x1="4.1512" y1="6.8662" x2="4.2" y2="6.9" width="0.1524" layer="1"/>
<contactref element="VCC" pad="1"/>
<contactref element="IC2" pad="8"/>
<contactref element="C3" pad="2"/>
<contactref element="C4" pad="2"/>
<contactref element="IC2" pad="12"/>
<contactref element="IC1" pad="1"/>
<contactref element="C1" pad="1"/>
<contactref element="IC1" pad="10"/>
<contactref element="C2" pad="1"/>
<wire x1="-3.75" y1="7.4738" x2="-3.75" y2="7.25" width="0.1524" layer="16"/>
<wire x1="-0.75" y1="8.0268" x2="-0.8022" y2="7.9746" width="0.1524" layer="1"/>
<wire x1="-0.8022" y1="7.9746" x2="-1.8008" y2="7.9746" width="0.1524" layer="1"/>
<via x="-1.8008" y="7.9746" extent="1-16" drill="0.35"/>
<wire x1="-3.7492" y1="7.4746" x2="-3.75" y2="7.4738" width="0.1524" layer="16"/>
<wire x1="-1.8008" y1="7.2272" x2="-1.33069375" y2="7.2272" width="0.1524" layer="16"/>
<wire x1="-1.8008" y1="7.4746" x2="-3.7492" y2="7.4746" width="0.1524" layer="16"/>
<wire x1="-0.75" y1="8.0268" x2="0.7932" y2="8.0268" width="0.1524" layer="1"/>
<wire x1="0.7932" y1="8.0268" x2="0.8" y2="8.02" width="0.1524" layer="1"/>
<wire x1="0.25" y1="6.758" x2="0.499" y2="6.763" width="0.1524" layer="1"/>
<wire x1="0.499" y1="6.763" x2="0.757" y2="6.5" width="0.1524" layer="1"/>
<wire x1="-1.33069375" y1="7.2272" x2="-1.191" y2="7.08750625" width="0.1524" layer="16"/>
<wire x1="-1.191" y1="7.08750625" x2="-1.191" y2="5.72229375" width="0.1524" layer="16"/>
<wire x1="-0.45270625" y1="4.984" x2="-1.191" y2="5.72229375" width="0.1524" layer="16"/>
<wire x1="1.8548625" y1="5" x2="1.5" y2="5" width="0.1524" layer="1"/>
<wire x1="3.2" y1="5.1" x2="3.2" y2="4.7988" width="0.1524" layer="1"/>
<wire x1="3.2" y1="4.7988" x2="2.0560625" y2="4.7988" width="0.1524" layer="1"/>
<wire x1="2.0560625" y1="4.7988" x2="1.8548625" y2="5" width="0.1524" layer="1"/>
<via x="1.5" y="5" extent="1-16" drill="0.35"/>
<wire x1="1.5" y1="5" x2="1.484" y2="4.984" width="0.1524" layer="16"/>
<wire x1="1.484" y1="4.984" x2="-0.45270625" y2="4.984" width="0.1524" layer="16"/>
<wire x1="2.3988" y1="6.8862" x2="2.55" y2="6.75" width="0.1524" layer="1"/>
<wire x1="2.3988" y1="7.873" x2="2.3988" y2="6.8862" width="0.1524" layer="1"/>
<wire x1="0.8" y1="8.02" x2="0.8046" y2="8.0246" width="0.1524" layer="1"/>
<wire x1="0.8046" y1="8.0246" x2="1.2754" y2="8.0246" width="0.1524" layer="1"/>
<wire x1="1.2754" y1="8.0246" x2="1.7794" y2="8.0246" width="0.1524" layer="1"/>
<wire x1="1.7794" y1="8.0246" x2="2.2472" y2="8.0246" width="0.1524" layer="1"/>
<wire x1="2.2472" y1="8.0246" x2="2.3988" y2="7.873" width="0.1524" layer="1"/>
<wire x1="1.2754" y1="8.0246" x2="1.2754" y2="7.0134" width="0.1524" layer="1"/>
<wire x1="1.2754" y1="7.0134" x2="0.757" y2="6.5" width="0.1524" layer="1"/>
<wire x1="-1.8008" y1="7.9746" x2="-1.8008" y2="7.4746" width="0.1524" layer="16"/>
<wire x1="-1.8008" y1="7.4746" x2="-1.8008" y2="7.2272" width="0.1524" layer="16"/>
<wire x1="4.1512" y1="6.42985" x2="3.2" y2="5.47865" width="0.1524" layer="1"/>
<wire x1="3.2" y1="5.47865" x2="3.2" y2="5.1" width="0.1524" layer="1"/>
<contactref element="IC4" pad="5"/>
<contactref element="C10" pad="1"/>
<wire x1="4.80320625" y1="1.4198" x2="4.4508" y2="1.4198" width="0.1524" layer="1"/>
<wire x1="4.4508" y1="1.4198" x2="4.2" y2="1.161546875" width="0.1524" layer="1"/>
<wire x1="4.2" y1="1.161546875" x2="4.2" y2="0.9" width="0.1524" layer="1"/>
<wire x1="5.0638" y1="1.871" x2="5.0638" y2="1.68039375" width="0.1524" layer="1"/>
<wire x1="5.0638" y1="1.68039375" x2="4.80320625" y2="1.4198" width="0.1524" layer="1"/>
<wire x1="4.1512" y1="0.42985" x2="4.1512" y2="0.8662" width="0.1524" layer="1"/>
<wire x1="4.1512" y1="0.8662" x2="4.2" y2="0.9" width="0.1524" layer="1"/>
<contactref element="VCC1" pad="1"/>
<contactref element="IC4" pad="8"/>
<contactref element="C8" pad="2"/>
<contactref element="C9" pad="2"/>
<contactref element="IC4" pad="12"/>
<contactref element="IC3" pad="1"/>
<contactref element="C6" pad="1"/>
<contactref element="IC3" pad="10"/>
<contactref element="C7" pad="1"/>
<wire x1="-3.75" y1="1.4738" x2="-3.75" y2="1.25" width="0.1524" layer="16"/>
<wire x1="-0.75" y1="2.0268" x2="-0.8022" y2="1.9746" width="0.1524" layer="1"/>
<wire x1="-0.8022" y1="1.9746" x2="-1.8008" y2="1.9746" width="0.1524" layer="1"/>
<via x="-1.8008" y="1.9746" extent="1-16" drill="0.35"/>
<wire x1="-3.7492" y1="1.4746" x2="-3.75" y2="1.4738" width="0.1524" layer="16"/>
<wire x1="-1.8008" y1="1.2272" x2="-1.33069375" y2="1.2272" width="0.1524" layer="16"/>
<wire x1="-1.8008" y1="1.4746" x2="-3.7492" y2="1.4746" width="0.1524" layer="16"/>
<wire x1="-0.75" y1="2.0268" x2="0.7932" y2="2.0268" width="0.1524" layer="1"/>
<wire x1="0.7932" y1="2.0268" x2="0.8" y2="2.02" width="0.1524" layer="1"/>
<wire x1="0.25" y1="0.758" x2="0.499" y2="0.763" width="0.1524" layer="1"/>
<wire x1="0.499" y1="0.763" x2="0.757" y2="0.5" width="0.1524" layer="1"/>
<wire x1="-1.33069375" y1="1.2272" x2="-1.191" y2="1.08750625" width="0.1524" layer="16"/>
<wire x1="-1.191" y1="1.08750625" x2="-1.191" y2="-0.27770625" width="0.1524" layer="16"/>
<wire x1="-0.45270625" y1="-1.016" x2="-1.191" y2="-0.27770625" width="0.1524" layer="16"/>
<wire x1="1.8548625" y1="-1" x2="1.5" y2="-1" width="0.1524" layer="1"/>
<wire x1="3.2" y1="-0.9" x2="3.2" y2="-1.2012" width="0.1524" layer="1"/>
<wire x1="3.2" y1="-1.2012" x2="2.0560625" y2="-1.2012" width="0.1524" layer="1"/>
<wire x1="2.0560625" y1="-1.2012" x2="1.8548625" y2="-1" width="0.1524" layer="1"/>
<via x="1.5" y="-1" extent="1-16" drill="0.35"/>
<wire x1="1.5" y1="-1" x2="1.484" y2="-1.016" width="0.1524" layer="16"/>
<wire x1="1.484" y1="-1.016" x2="-0.45270625" y2="-1.016" width="0.1524" layer="16"/>
<wire x1="2.3988" y1="0.8862" x2="2.55" y2="0.75" width="0.1524" layer="1"/>
<wire x1="2.3988" y1="1.873" x2="2.3988" y2="0.8862" width="0.1524" layer="1"/>
<wire x1="0.8" y1="2.02" x2="0.8046" y2="2.0246" width="0.1524" layer="1"/>
<wire x1="0.8046" y1="2.0246" x2="1.2754" y2="2.0246" width="0.1524" layer="1"/>
<wire x1="1.2754" y1="2.0246" x2="1.7794" y2="2.0246" width="0.1524" layer="1"/>
<wire x1="1.7794" y1="2.0246" x2="2.2472" y2="2.0246" width="0.1524" layer="1"/>
<wire x1="2.2472" y1="2.0246" x2="2.3988" y2="1.873" width="0.1524" layer="1"/>
<wire x1="1.2754" y1="2.0246" x2="1.2754" y2="1.0134" width="0.1524" layer="1"/>
<wire x1="1.2754" y1="1.0134" x2="0.757" y2="0.5" width="0.1524" layer="1"/>
<wire x1="-1.8008" y1="1.9746" x2="-1.8008" y2="1.4746" width="0.1524" layer="16"/>
<wire x1="-1.8008" y1="1.4746" x2="-1.8008" y2="1.2272" width="0.1524" layer="16"/>
<wire x1="4.1512" y1="0.42985" x2="3.2" y2="-0.52135" width="0.1524" layer="1"/>
<wire x1="3.2" y1="-0.52135" x2="3.2" y2="-0.9" width="0.1524" layer="1"/>
<wire x1="1.7794" y1="2.0246" x2="1.5" y2="5" width="0" layer="19" extent="1-1"/>
</signal>
<signal name="N$6">
<contactref element="IC1" pad="2"/>
<contactref element="SCL" pad="1"/>
<contactref element="IC2" pad="13"/>
<wire x1="-0.6098" y1="7.1228" x2="-0.25" y2="6.758" width="0.1524" layer="1"/>
<wire x1="-1.9024" y1="7.1228" x2="-0.6098" y2="7.1228" width="0.1524" layer="1"/>
<wire x1="-1.89641875" y1="6.71721875" x2="-1.893" y2="6.7138" width="0.1524" layer="1"/>
<wire x1="-1.89641875" y1="6.71721875" x2="-1.9024" y2="7.1228" width="0.1524" layer="1"/>
<via x="-1.893" y="6.7138" extent="1-16" drill="0.35"/>
<wire x1="-1.893" y1="6.7138" x2="-1.891903125" y2="6.712703125" width="0.1524" layer="16"/>
<wire x1="-1.891903125" y1="6.712703125" x2="-1.902528125" y2="4.3008" width="0.1524" layer="16"/>
<wire x1="-1.902528125" y1="4.3008" x2="1.25" y2="4.3008" width="0.1524" layer="16"/>
<via x="1.25" y="4.3008" extent="1-16" drill="0.35"/>
<wire x1="3.6512" y1="4.3008" x2="3.6512" y2="5.0362" width="0.1524" layer="1"/>
<wire x1="3.6512" y1="5.0362" x2="3.7" y2="5.1" width="0.1524" layer="1"/>
<wire x1="1.25" y1="4.3008" x2="3.6512" y2="4.3008" width="0.1524" layer="1"/>
<wire x1="-3.75" y1="7.25" x2="-3.6228" y2="7.1228" width="0.1524" layer="1"/>
<wire x1="-1.9024" y1="7.1228" x2="-3.6228" y2="7.1228" width="0.1524" layer="1"/>
</signal>
<signal name="N$1">
<contactref element="IC1" pad="4"/>
<contactref element="SDA" pad="1"/>
<contactref element="IC2" pad="14"/>
<wire x1="-3.75" y1="4.75" x2="-2.5762" y2="5.9238" width="0.1524" layer="1"/>
<wire x1="-0.8382" y1="5.9238" x2="-0.757" y2="6" width="0.1524" layer="1"/>
<wire x1="-0.8382" y1="5.9238" x2="-2.5762" y2="5.9238" width="0.1524" layer="1"/>
<wire x1="-3.75" y1="4.75" x2="-2.7762" y2="3.7762" width="0.1524" layer="1"/>
<wire x1="-2.7762" y1="3.7762" x2="3.75" y2="3.7762" width="0.1524" layer="1"/>
<wire x1="3.75" y1="3.7762" x2="4.2" y2="4.2262" width="0.1524" layer="1"/>
<wire x1="4.2" y1="4.2262" x2="4.2" y2="5.1" width="0.1524" layer="1"/>
</signal>
<signal name="N$2">
<contactref element="IC3" pad="2"/>
<contactref element="SCL1" pad="1"/>
<contactref element="IC4" pad="13"/>
<wire x1="-0.6098" y1="1.1228" x2="-0.25" y2="0.758" width="0.1524" layer="1"/>
<wire x1="-1.9024" y1="1.1228" x2="-0.6098" y2="1.1228" width="0.1524" layer="1"/>
<wire x1="-1.89641875" y1="0.71721875" x2="-1.893" y2="0.7138" width="0.1524" layer="1"/>
<wire x1="-1.89641875" y1="0.71721875" x2="-1.9024" y2="1.1228" width="0.1524" layer="1"/>
<via x="-1.893" y="0.7138" extent="1-16" drill="0.35"/>
<wire x1="-1.893" y1="0.7138" x2="-1.891903125" y2="0.712703125" width="0.1524" layer="16"/>
<wire x1="-1.891903125" y1="0.712703125" x2="-1.902528125" y2="-1.6992" width="0.1524" layer="16"/>
<wire x1="-1.902528125" y1="-1.6992" x2="1.25" y2="-1.6992" width="0.1524" layer="16"/>
<via x="1.25" y="-1.6992" extent="1-16" drill="0.35"/>
<wire x1="3.6512" y1="-1.6992" x2="3.6512" y2="-0.9638" width="0.1524" layer="1"/>
<wire x1="3.6512" y1="-0.9638" x2="3.7" y2="-0.9" width="0.1524" layer="1"/>
<wire x1="1.25" y1="-1.6992" x2="3.6512" y2="-1.6992" width="0.1524" layer="1"/>
<wire x1="-3.75" y1="1.25" x2="-3.6228" y2="1.1228" width="0.1524" layer="1"/>
<wire x1="-1.9024" y1="1.1228" x2="-3.6228" y2="1.1228" width="0.1524" layer="1"/>
</signal>
<signal name="N$3">
<contactref element="IC3" pad="4"/>
<contactref element="SDA1" pad="1"/>
<contactref element="IC4" pad="14"/>
<wire x1="-3.75" y1="-1.25" x2="-2.5762" y2="-0.0762" width="0.1524" layer="1"/>
<wire x1="-0.8382" y1="-0.0762" x2="-0.757" y2="0" width="0.1524" layer="1"/>
<wire x1="-0.8382" y1="-0.0762" x2="-2.5762" y2="-0.0762" width="0.1524" layer="1"/>
<wire x1="-3.75" y1="-1.25" x2="-2.7762" y2="-2.2238" width="0.1524" layer="1"/>
<wire x1="-2.7762" y1="-2.2238" x2="3.75" y2="-2.2238" width="0.1524" layer="1"/>
<wire x1="3.75" y1="-2.2238" x2="4.2" y2="-1.7738" width="0.1524" layer="1"/>
<wire x1="4.2" y1="-1.7738" x2="4.2" y2="-0.9" width="0.1524" layer="1"/>
</signal>
</signals>
<mfgpreviewcolors>
<mfgpreviewcolor name="soldermaskcolor" color="0xC8008000"/>
<mfgpreviewcolor name="silkscreencolor" color="0xFFFEFEFE"/>
<mfgpreviewcolor name="backgroundcolor" color="0xFF282828"/>
<mfgpreviewcolor name="coppercolor" color="0xFFFFBF00"/>
<mfgpreviewcolor name="substratecolor" color="0xFF786E46"/>
</mfgpreviewcolors>
</board>
</drawing>
<compatibility>
<note version="8.2" severity="warning">
Since Version 8.2, EAGLE supports online libraries. The ids
of those online libraries will not be understood (or retained)
with this version.
</note>
<note version="8.3" severity="warning">
Since Version 8.3, EAGLE supports URNs for individual library
assets (packages, symbols, and devices). The URNs of those assets
will not be understood (or retained) with this version.
</note>
<note version="8.3" severity="warning">
Since Version 8.3, EAGLE supports the association of 3D packages
with devices in libraries, schematics, and board files. Those 3D
packages will not be understood (or retained) with this version.
</note>
</compatibility>
</eagle>
