{
  "actor": "Unit Kerja, Kepaka Sekolah Permata Sosial, Anggota Biro Latihan Kerja/Pelayanan Khusus, Staf Sekolah Permata Sosial, Anggota Biro Transformasi Sosial, Panitia Lomba, Anggota Biro Pengembangan Masyarakat",
  "dataForm": "Laporan tercetak",
  "activity": "Membuat laporan pertanggungjawaban",
  "dataDictionaryCode": "DD-DDiak-014",
  "processCode": "BP-DDiak-01-10, BP-DDiak-02-02, BP-DDiak-02-06, BP-DDiak-02-07, BP-DDiak-02-08, BP-DDiak-03-03, BP-DDiak-03-04, BP-DDiak-03-05, BP-DDiak-03-06, BP-DDiak-04-02, BP-DDiak-04-03, BP-DDiak-04-04",
  "description": "Laporan ini berisi detail pertanggungjawaban kegiatan yang telah diselenggarakan dan keuangannya.",
  "attributes": [
    {
      "dataType": "String",
      "length": "255",
      "description": "Judul laporan yang dicetak",
      "alias": "judul",
      "attributeName": "judul laporan"
    },
    {
      "dataType": "String",
      "length": "~",
      "description": "Latar belakang laporan yang dicetak",
      "alias": "latar belakang",
      "attributeName": "latar belakang laporan"
    },
    {
      "dataType": "String",
      "length": "255",
      "description": "Nama kegiatan",
      "alias": "nama",
      "attributeName": "nama kegiatan"
    },
    {
      "dataType": "String",
      "length": "~",
      "description": "Maksud dan kegiatan yang telah diselenggarakan",
      "alias": "tujuan",
      "attributeName": "tujuan kegiatan"
    },
    {
      "dataType": "String",
      "length": "255",
      "description": "Sasaran dari kegiatan yang diselenggarakan",
      "alias": "-",
      "attributeName": "sasaran kegiatan"
    },
    {
      "dataType": "String",
      "length": "~",
      "description": "Struktur kepengurusan kepanitian dalam kegiatan",
      "alias": "-",
      "attributeName": "susunan kepanitiaan"
    },
    {
      "dataType": "Date",
      "length": "10",
      "description": "Jadwal dilaksanakan kegiatan",
      "alias": "tanggal",
      "attributeName": "tanggal kegiatan"
    },
    {
      "dataType": "String",
      "length": "50",
      "description": "Lokasi/kota dilakukannya kegiatan",
      "alias": "tempat",
      "attributeName": "tempat kegiatan"
    },
    {
      "dataType": "Date",
      "length": "~",
      "description": "Mekanisme atau teknis pelaksanaan kegiatan",
      "alias": "-",
      "attributeName": "rencana mekanisme kegiatan"
    },
    {
      "dataType": "Currency",
      "length": "14.4",
      "description": "Rencana biaya yang digunakan dalam kegiatan",
      "alias": "-",
      "attributeName": "rencana anggaran biaya"
    },
    {
      "dataType": "String",
      "length": "~",
      "description": "Mekanisme atau teknis realisasi setelah kegiatan berjalan",
      "alias": "-",
      "attributeName": "mekanisme realisasi kegiatan"
    },
    {
      "dataType": "Currency",
      "length": "14.4",
      "description": "Total biaya yang digunakan setelah kegiatan",
      "alias": "-",
      "attributeName": "realisasi anggaran biaya"
    },
    {
      "dataType": "String",
      "length": "~",
      "description": "Hasil evaluasi kegiatan",
      "alias": "-",
      "attributeName": "evaluasi pelaksanaan"
    },
    {
      "dataType": "String",
      "length": "~",
      "description": "Hasil pelaksaan kegiatan",
      "alias": "hasil",
      "attributeName": "hasil pelaksanaan"
    },
    {
      "dataType": "String",
      "length": "100",
      "description": "Pihak yang menerima ",
      "alias": "-",
      "attributeName": "diterima oleh"
    },
    {
      "dataType": "String",
      "length": "100",
      "description": "Persetujuan atau diketahui oleh pembuat keputusan biasanya berupa tanda tangan dan nama.",
      "alias": "-",
      "attributeName": "disetujui oleh"
    }
  ],
  "documentName": "Laporan Pertanggungjawaban",
  "relation": "DD-DDiak-001, DD-DDiak-003, DD-DDiak-004, DD-DDiak-019, DD-DDiak-020"
}