{
  "actor": "Biro Diakonia Sosial",
  "dataForm": "Dokumen tercetak",
  "activity": "Menerima pendaftaran anggota",
  "dataDictionaryCode": "DD-DDiak-010",
  "processCode": "BP-DDiak-01-06",
  "description": "Surat ini berisi persetujuan orang tua dari pemuda/pemudi untuk mengikuti program.",
  "attributes": [
    {
      "dataType": "String",
      "length": "255",
      "description": "Judul surat",
      "alias": "judul",
      "attributeName": "judul surat"
    },
    {
      "dataType": "String",
      "length": "100",
      "description": "tempat surat diterbitkan",
      "alias": "tempat",
      "attributeName": "tempat surat"
    },
    {
      "dataType": "Date",
      "length": "10",
      "description": "tanggal surat diterbitkan",
      "alias": "tanggal",
      "attributeName": "tanggal surat"
    },
    {
      "dataType": "String",
      "length": "100",
      "description": "Nama pemohon surat ",
      "alias": "nama",
      "attributeName": "nama pemohon"
    },
    {
      "dataType": "Integer",
      "length": "2",
      "description": "Umur pemohon surat ",
      "alias": "umur",
      "attributeName": "umur pemohon"
    },
    {
      "dataType": "String",
      "length": "255",
      "description": "Alamat pemohon",
      "alias": "alamat",
      "attributeName": "alamat pemohon"
    },
    {
      "dataType": "String",
      "length": "100",
      "description": "Nama orang tua anak yang mengikuti program",
      "alias": "nama",
      "attributeName": "nama orang tua"
    },
    {
      "dataType": "Integer",
      "length": "2",
      "description": "Umur orang tua",
      "alias": "umur",
      "attributeName": "umur orang tua"
    },
    {
      "dataType": "String",
      "length": "100",
      "description": "Pekerjaan orang tua",
      "alias": "pekerjaan",
      "attributeName": "pekerjaan orang tua"
    },
    {
      "dataType": "String",
      "length": "100",
      "description": "Alamat orang tua",
      "alias": "alamat",
      "attributeName": "alamat orang tua"
    },
    {
      "dataType": "String",
      "length": "100",
      "description": "Pekerjaan orang tua",
      "alias": "pekerjaan",
      "attributeName": "pekerjaan orang tua"
    },
    {
      "dataType": "String",
      "length": "~",
      "description": "Isi surat",
      "alias": "isi",
      "attributeName": "isi surat"
    },
    {
      "dataType": "String",
      "length": "100",
      "description": "Pihak yang menerima ",
      "alias": "-",
      "attributeName": "diterima oleh"
    },
    {
      "dataType": "String",
      "length": "100",
      "description": "Persetujuan atau diketahui oleh pembuat keputusan biasanya berupa tanda tangan dan nama.",
      "alias": "-",
      "attributeName": "disetujui oleh"
    }
  ],
  "documentName": "Surat pesetujuan orang tua",
  "relation": "DD-DDiak-012"
}