{
  "actor": "Anggota Badan Koordinasi Ekonomi Kerakyatan",
  "dataForm": "Dokumen tercetak",
  "activity": "Membuat daftar pengurus CUM",
  "dataDictionaryCode": "DD-DDiak-036",
  "processCode": "BP-DDiak-05-02",
  "description": "Dokumen ini berisi detail tentang suatu struktur pengurusan dalam sebuah CUM",
  "attributes": [
    {
      "dataType": "String",
      "length": "100",
      "description": "Judul dari dokumen pelatihan guru",
      "alias": "judul",
      "attributeName": "judul dokumen"
    },
    {
      "dataType": "String[]",
      "length": "50",
      "description": "Daftar nama-nama kepengurusan CUM pada laporan yang dicetak",
      "alias": "nama",
      "attributeName": "kepengurusan cum"
    },
    {
      "dataType": "String",
      "length": "100",
      "description": "Pihak yang menerima ",
      "alias": "-",
      "attributeName": "diterima oleh"
    },
    {
      "dataType": "String",
      "length": "100",
      "description": "Persetujuan atau diketahui oleh pembuat keputusan biasanya berupa tanda tangan dan nama.",
      "alias": "-",
      "attributeName": "disetujui oleh"
    }
  ],
  "documentName": "Daftar Nama Pengurus CUM",
  "relation": "DD-DDiak-035"
}