TIME,VOLUME [m^3],SALT_MASS [psu m^3],HEAT_CONTENT [degrees celsius m^3]
01/05/2011 00:00:00,  0.1781889E+08,  0.1781893E+09,  0.3563787E+09
01/05/2011 00:15:00,  0.1800213E+08,  0.1839771E+09,  0.3596363E+09
01/05/2011 00:30:00,  0.1813823E+08,  0.1881292E+09,  0.3619652E+09
01/05/2011 00:45:00,  0.1815997E+08,  0.1884082E+09,  0.3619941E+09
01/05/2011 01:00:00,  0.1803748E+08,  0.1848427E+09,  0.3591528E+09
01/05/2011 01:15:00,  0.1785123E+08,  0.1805949E+09,  0.3550329E+09
01/05/2011 01:30:00,  0.1764492E+08,  0.1769431E+09,  0.3505264E+09
01/05/2011 01:45:00,  0.1742316E+08,  0.1737655E+09,  0.3457083E+09
01/05/2011 02:00:00,  0.1727350E+08,  0.1718307E+09,  0.3423364E+09
01/05/2011 02:15:00,  0.1723257E+08,  0.1714493E+09,  0.3411416E+09
01/05/2011 02:30:00,  0.1726997E+08,  0.1725134E+09,  0.3415083E+09
01/05/2011 02:45:00,  0.1731375E+08,  0.1736251E+09,  0.3419930E+09
01/05/2011 03:00:00,  0.1731296E+08,  0.1736048E+09,  0.3416052E+09
01/05/2011 03:15:00,  0.1727331E+08,  0.1728181E+09,  0.3404486E+09
01/05/2011 03:30:00,  0.1721231E+08,  0.1716995E+09,  0.3388600E+09
01/05/2011 03:45:00,  0.1714157E+08,  0.1704906E+09,  0.3370905E+09
01/05/2011 04:00:00,  0.1708148E+08,  0.1694934E+09,  0.3355197E+09
01/05/2011 04:15:00,  0.1707634E+08,  0.1694387E+09,  0.3350583E+09
01/05/2011 04:30:00,  0.1714335E+08,  0.1712218E+09,  0.3360397E+09
01/05/2011 04:45:00,  0.1724731E+08,  0.1742456E+09,  0.3377646E+09
01/05/2011 05:00:00,  0.1735011E+08,  0.1772156E+09,  0.3394630E+09
01/05/2011 05:15:00,  0.1743523E+08,  0.1795792E+09,  0.3408189E+09
01/05/2011 05:30:00,  0.1751649E+08,  0.1818033E+09,  0.3420972E+09
01/05/2011 05:45:00,  0.1758826E+08,  0.1836732E+09,  0.3431759E+09
01/05/2011 06:00:00,  0.1764629E+08,  0.1850781E+09,  0.3439915E+09
01/05/2011 06:15:00,  0.1771470E+08,  0.1868509E+09,  0.3450181E+09
01/05/2011 06:30:00,  0.1782060E+08,  0.1899373E+09,  0.3467964E+09
01/05/2011 06:45:00,  0.1795977E+08,  0.1941652E+09,  0.3492284E+09
01/05/2011 07:00:00,  0.1810050E+08,  0.1984579E+09,  0.3516991E+09
01/05/2011 07:15:00,  0.1822706E+08,  0.2022678E+09,  0.3538915E+09
01/05/2011 07:30:00,  0.1834214E+08,  0.2056557E+09,  0.3558501E+09
01/05/2011 07:45:00,  0.1843546E+08,  0.2083019E+09,  0.3573894E+09
01/05/2011 08:00:00,  0.1851214E+08,  0.2103450E+09,  0.3585899E+09
01/05/2011 08:15:00,  0.1857479E+08,  0.2119195E+09,  0.3595270E+09
01/05/2011 08:30:00,  0.1863592E+08,  0.2134269E+09,  0.3604333E+09
01/05/2011 08:45:00,  0.1870333E+08,  0.2151602E+09,  0.3614785E+09
01/05/2011 09:00:00,  0.1877630E+08,  0.2170761E+09,  0.3626333E+09
01/05/2011 09:15:00,  0.1883822E+08,  0.2186129E+09,  0.3635798E+09
01/05/2011 09:30:00,  0.1886914E+08,  0.2190674E+09,  0.3639115E+09
01/05/2011 09:45:00,  0.1887529E+08,  0.2186611E+09,  0.3637538E+09
01/05/2011 10:00:00,  0.1886778E+08,  0.2177823E+09,  0.3633276E+09
01/05/2011 10:15:00,  0.1885058E+08,  0.2165720E+09,  0.3627123E+09
01/05/2011 10:30:00,  0.1881821E+08,  0.2148462E+09,  0.3618098E+09
01/05/2011 10:45:00,  0.1878612E+08,  0.2131409E+09,  0.3609306E+09
01/05/2011 11:00:00,  0.1876415E+08,  0.2117893E+09,  0.3602703E+09
01/05/2011 11:15:00,  0.1873471E+08,  0.2101822E+09,  0.3594717E+09
01/05/2011 11:30:00,  0.1866409E+08,  0.2072344E+09,  0.3578584E+09
01/05/2011 11:45:00,  0.1856189E+08,  0.2033166E+09,  0.3556184E+09
01/05/2011 12:00:00,  0.1844584E+08,  0.1990663E+09,  0.3531051E+09
01/05/2011 12:15:00,  0.1832769E+08,  0.1949009E+09,  0.3505505E+09
01/05/2011 12:30:00,  0.1821511E+08,  0.1910982E+09,  0.3481208E+09
01/05/2011 12:45:00,  0.1811666E+08,  0.1878608E+09,  0.3459765E+09
01/05/2011 13:00:00,  0.1804482E+08,  0.1854937E+09,  0.3443753E+09
01/05/2011 13:15:00,  0.1798333E+08,  0.1834892E+09,  0.3429849E+09
01/05/2011 13:30:00,  0.1791040E+08,  0.1812810E+09,  0.3413754E+09
01/05/2011 13:45:00,  0.1782275E+08,  0.1788538E+09,  0.3394861E+09
01/05/2011 14:00:00,  0.1772032E+08,  0.1762300E+09,  0.3373081E+09
01/05/2011 14:15:00,  0.1762116E+08,  0.1738457E+09,  0.3352089E+09
01/05/2011 14:30:00,  0.1753377E+08,  0.1718235E+09,  0.3333484E+09
01/05/2011 14:45:00,  0.1746253E+08,  0.1702011E+09,  0.3318119E+09
01/05/2011 15:00:00,  0.1740762E+08,  0.1689279E+09,  0.3306004E+09
01/05/2011 15:15:00,  0.1737408E+08,  0.1680893E+09,  0.3298207E+09
01/05/2011 15:30:00,  0.1736114E+08,  0.1676414E+09,  0.3294458E+09
01/05/2011 15:45:00,  0.1735559E+08,  0.1673378E+09,  0.3292201E+09
01/05/2011 16:00:00,  0.1734568E+08,  0.1669398E+09,  0.3289080E+09
01/05/2011 16:15:00,  0.1733717E+08,  0.1665679E+09,  0.3286239E+09
01/05/2011 16:30:00,  0.1735098E+08,  0.1666489E+09,  0.3287520E+09
01/05/2011 16:45:00,  0.1738148E+08,  0.1671530E+09,  0.3291940E+09
01/05/2011 17:00:00,  0.1742219E+08,  0.1679481E+09,  0.3298081E+09
01/05/2011 17:15:00,  0.1747360E+08,  0.1691349E+09,  0.3306156E+09
01/05/2011 17:30:00,  0.1755179E+08,  0.1712535E+09,  0.3319417E+09
01/05/2011 17:45:00,  0.1764201E+08,  0.1737977E+09,  0.3334956E+09
01/05/2011 18:00:00,  0.1773057E+08,  0.1762576E+09,  0.3349882E+09
01/05/2011 18:15:00,  0.1781339E+08,  0.1785383E+09,  0.3363556E+09
01/05/2011 18:30:00,  0.1791609E+08,  0.1814931E+09,  0.3380997E+09
01/05/2011 18:45:00,  0.1802829E+08,  0.1848023E+09,  0.3400312E+09
01/05/2011 19:00:00,  0.1814110E+08,  0.1881308E+09,  0.3419611E+09
01/05/2011 19:15:00,  0.1825479E+08,  0.1914710E+09,  0.3438865E+09
01/05/2011 19:30:00,  0.1836746E+08,  0.1947972E+09,  0.3457903E+09
01/05/2011 19:45:00,  0.1848216E+08,  0.1981751E+09,  0.3477125E+09
01/05/2011 20:00:00,  0.1858160E+08,  0.2010392E+09,  0.3493299E+09
01/05/2011 20:15:00,  0.1867049E+08,  0.2035048E+09,  0.3507084E+09
01/05/2011 20:30:00,  0.1874390E+08,  0.2054485E+09,  0.3517846E+09
01/05/2011 20:45:00,  0.1881311E+08,  0.2072444E+09,  0.3527695E+09
01/05/2011 21:00:00,  0.1888029E+08,  0.2089697E+09,  0.3537086E+09
01/05/2011 21:15:00,  0.1893870E+08,  0.2103894E+09,  0.3544668E+09
01/05/2011 21:30:00,  0.1897553E+08,  0.2110540E+09,  0.3547900E+09
01/05/2011 21:45:00,  0.1899797E+08,  0.2112264E+09,  0.3548303E+09
01/05/2011 22:00:00,  0.1901379E+08,  0.2111558E+09,  0.3547268E+09
01/05/2011 22:15:00,  0.1901336E+08,  0.2105009E+09,  0.3542841E+09
01/05/2011 22:30:00,  0.1897940E+08,  0.2087007E+09,  0.3531833E+09
01/05/2011 22:45:00,  0.1892838E+08,  0.2063193E+09,  0.3517396E+09
01/05/2011 23:00:00,  0.1887688E+08,  0.2039392E+09,  0.3502815E+09
01/05/2011 23:15:00,  0.1882070E+08,  0.2014230E+09,  0.3487297E+09
01/05/2011 23:30:00,  0.1874139E+08,  0.1981707E+09,  0.3467205E+09
01/05/2011 23:45:00,  0.1865117E+08,  0.1946391E+09,  0.3444992E+09
02/05/2011 00:00:00,  0.1856348E+08,  0.1912968E+09,  0.3423349E+09
02/05/2011 00:15:00,  0.1847383E+08,  0.1880075E+09,  0.3401324E+09
02/05/2011 00:30:00,  0.1836550E+08,  0.1843048E+09,  0.3375545E+09
02/05/2011 00:45:00,  0.1825155E+08,  0.1806596E+09,  0.3348818E+09
02/05/2011 01:00:00,  0.1813779E+08,  0.1772255E+09,  0.3322016E+09
02/05/2011 01:15:00,  0.1803135E+08,  0.1741967E+09,  0.3296797E+09
02/05/2011 01:30:00,  0.1792483E+08,  0.1713503E+09,  0.3271605E+09
02/05/2011 01:45:00,  0.1782076E+08,  0.1687375E+09,  0.3246996E+09
02/05/2011 02:00:00,  0.1771856E+08,  0.1663083E+09,  0.3222625E+09
02/05/2011 02:15:00,  0.1762401E+08,  0.1641708E+09,  0.3199843E+09
02/05/2011 02:30:00,  0.1753918E+08,  0.1623336E+09,  0.3179157E+09
02/05/2011 02:45:00,  0.1745193E+08,  0.1605260E+09,  0.3157819E+09
02/05/2011 03:00:00,  0.1737011E+08,  0.1589001E+09,  0.3137687E+09
02/05/2011 03:15:00,  0.1729611E+08,  0.1574665E+09,  0.3119094E+09
02/05/2011 03:30:00,  0.1723871E+08,  0.1563401E+09,  0.3103766E+09
02/05/2011 03:45:00,  0.1719170E+08,  0.1553938E+09,  0.3090362E+09
02/05/2011 04:00:00,  0.1715159E+08,  0.1545792E+09,  0.3078521E+09
02/05/2011 04:15:00,  0.1712166E+08,  0.1539302E+09,  0.3068645E+09
02/05/2011 04:30:00,  0.1711731E+08,  0.1536996E+09,  0.3063909E+09
02/05/2011 04:45:00,  0.1712985E+08,  0.1537633E+09,  0.3062493E+09
02/05/2011 05:00:00,  0.1714588E+08,  0.1538825E+09,  0.3062007E+09
02/05/2011 05:15:00,  0.1716981E+08,  0.1541938E+09,  0.3063213E+09
02/05/2011 05:30:00,  0.1721907E+08,  0.1553192E+09,  0.3069518E+09
02/05/2011 05:45:00,  0.1728715E+08,  0.1570748E+09,  0.3079415E+09
02/05/2011 06:00:00,  0.1735481E+08,  0.1588201E+09,  0.3089250E+09
02/05/2011 06:15:00,  0.1742487E+08,  0.1606622E+09,  0.3099634E+09
02/05/2011 06:30:00,  0.1751695E+08,  0.1632703E+09,  0.3114396E+09
02/05/2011 06:45:00,  0.1762604E+08,  0.1664521E+09,  0.3132430E+09
02/05/2011 07:00:00,  0.1773022E+08,  0.1694748E+09,  0.3149550E+09
02/05/2011 07:15:00,  0.1783170E+08,  0.1724095E+09,  0.3166151E+09
02/05/2011 07:30:00,  0.1794598E+08,  0.1757931E+09,  0.3185355E+09
02/05/2011 07:45:00,  0.1807275E+08,  0.1795923E+09,  0.3206944E+09
02/05/2011 08:00:00,  0.1819104E+08,  0.1831172E+09,  0.3227001E+09
02/05/2011 08:15:00,  0.1830493E+08,  0.1864667E+09,  0.3246079E+09
02/05/2011 08:30:00,  0.1841222E+08,  0.1896064E+09,  0.3264014E+09
02/05/2011 08:45:00,  0.1852107E+08,  0.1927808E+09,  0.3282222E+09
02/05/2011 09:00:00,  0.1861918E+08,  0.1955996E+09,  0.3298451E+09
02/05/2011 09:15:00,  0.1870705E+08,  0.1980492E+09,  0.3312635E+09
02/05/2011 09:30:00,  0.1877755E+08,  0.1998904E+09,  0.3323430E+09
02/05/2011 09:45:00,  0.1883864E+08,  0.2014032E+09,  0.3332434E+09
02/05/2011 10:00:00,  0.1889426E+08,  0.2027238E+09,  0.3340433E+09
02/05/2011 10:15:00,  0.1893939E+08,  0.2036786E+09,  0.3346428E+09
02/05/2011 10:30:00,  0.1896163E+08,  0.2038322E+09,  0.3348204E+09
02/05/2011 10:45:00,  0.1897203E+08,  0.2035714E+09,  0.3347977E+09
02/05/2011 11:00:00,  0.1898086E+08,  0.2032513E+09,  0.3347778E+09
02/05/2011 11:15:00,  0.1897880E+08,  0.2025577E+09,  0.3345782E+09
02/05/2011 11:30:00,  0.1894358E+08,  0.2007125E+09,  0.3337301E+09
02/05/2011 11:45:00,  0.1888805E+08,  0.1981717E+09,  0.3324904E+09
02/05/2011 12:00:00,  0.1882708E+08,  0.1954402E+09,  0.3311525E+09
02/05/2011 12:15:00,  0.1876188E+08,  0.1926123E+09,  0.3297476E+09
02/05/2011 12:30:00,  0.1867296E+08,  0.1890262E+09,  0.3278788E+09
02/05/2011 12:45:00,  0.1857747E+08,  0.1853158E+09,  0.3258932E+09
02/05/2011 13:00:00,  0.1848301E+08,  0.1817241E+09,  0.3239336E+09
02/05/2011 13:15:00,  0.1839122E+08,  0.1783321E+09,  0.3220372E+09
02/05/2011 13:30:00,  0.1829103E+08,  0.1748374E+09,  0.3199791E+09
02/05/2011 13:45:00,  0.1818360E+08,  0.1712916E+09,  0.3177813E+09
02/05/2011 14:00:00,  0.1808390E+08,  0.1681542E+09,  0.3157423E+09
02/05/2011 14:15:00,  0.1799049E+08,  0.1653442E+09,  0.3138314E+09
02/05/2011 14:30:00,  0.1790362E+08,  0.1628322E+09,  0.3120482E+09
02/05/2011 14:45:00,  0.1782592E+08,  0.1606628E+09,  0.3104484E+09
02/05/2011 15:00:00,  0.1775505E+08,  0.1587331E+09,  0.3089798E+09
02/05/2011 15:15:00,  0.1769435E+08,  0.1571121E+09,  0.3077134E+09
02/05/2011 15:30:00,  0.1764188E+08,  0.1557178E+09,  0.3066061E+09
02/05/2011 15:45:00,  0.1759231E+08,  0.1544295E+09,  0.3055532E+09
02/05/2011 16:00:00,  0.1753981E+08,  0.1531196E+09,  0.3044371E+09
02/05/2011 16:15:00,  0.1749393E+08,  0.1519832E+09,  0.3034490E+09
02/05/2011 16:30:00,  0.1746565E+08,  0.1511955E+09,  0.3027619E+09
02/05/2011 16:45:00,  0.1745125E+08,  0.1506833E+09,  0.3023039E+09
02/05/2011 17:00:00,  0.1744267E+08,  0.1502838E+09,  0.3019147E+09
02/05/2011 17:15:00,  0.1744465E+08,  0.1500926E+09,  0.3016898E+09
02/05/2011 17:30:00,  0.1747364E+08,  0.1505389E+09,  0.3019747E+09
02/05/2011 17:45:00,  0.1751763E+08,  0.1514762E+09,  0.3025534E+09
02/05/2011 18:00:00,  0.1756585E+08,  0.1525320E+09,  0.3031861E+09
02/05/2011 18:15:00,  0.1761721E+08,  0.1537177E+09,  0.3038778E+09
02/05/2011 18:30:00,  0.1769325E+08,  0.1557528E+09,  0.3050508E+09
02/05/2011 18:45:00,  0.1778206E+08,  0.1582464E+09,  0.3064811E+09
02/05/2011 19:00:00,  0.1787019E+08,  0.1607144E+09,  0.3078926E+09
02/05/2011 19:15:00,  0.1796196E+08,  0.1632888E+09,  0.3093617E+09
02/05/2011 19:30:00,  0.1806611E+08,  0.1663171E+09,  0.3110866E+09
02/05/2011 19:45:00,  0.1818254E+08,  0.1697539E+09,  0.3130415E+09
02/05/2011 20:00:00,  0.1828946E+08,  0.1728788E+09,  0.3148151E+09
02/05/2011 20:15:00,  0.1839268E+08,  0.1758545E+09,  0.3164999E+09
02/05/2011 20:30:00,  0.1849456E+08,  0.1788033E+09,  0.3181672E+09
02/05/2011 20:45:00,  0.1860138E+08,  0.1819057E+09,  0.3199208E+09
02/05/2011 21:00:00,  0.1870101E+08,  0.1847656E+09,  0.3215343E+09
02/05/2011 21:15:00,  0.1878951E+08,  0.1872366E+09,  0.3229242E+09
02/05/2011 21:30:00,  0.1886524E+08,  0.1892602E+09,  0.3240578E+09
02/05/2011 21:45:00,  0.1893267E+08,  0.1909939E+09,  0.3250243E+09
02/05/2011 22:00:00,  0.1899268E+08,  0.1924682E+09,  0.3258420E+09
02/05/2011 22:15:00,  0.1903856E+08,  0.1934379E+09,  0.3263708E+09
02/05/2011 22:30:00,  0.1905460E+08,  0.1933746E+09,  0.3263102E+09
02/05/2011 22:45:00,  0.1905377E+08,  0.1927232E+09,  0.3259144E+09
02/05/2011 23:00:00,  0.1904736E+08,  0.1918855E+09,  0.3254116E+09
02/05/2011 23:15:00,  0.1903055E+08,  0.1906819E+09,  0.3246987E+09
02/05/2011 23:30:00,  0.1898556E+08,  0.1885029E+09,  0.3234228E+09
02/05/2011 23:45:00,  0.1892832E+08,  0.1859287E+09,  0.3219075E+09
03/05/2011 00:00:00,  0.1887212E+08,  0.1834181E+09,  0.3204162E+09
03/05/2011 00:15:00,  0.1881089E+08,  0.1807747E+09,  0.3188267E+09
03/05/2011 00:30:00,  0.1872194E+08,  0.1772706E+09,  0.3166849E+09
03/05/2011 00:45:00,  0.1862246E+08,  0.1735666E+09,  0.3143543E+09
03/05/2011 01:00:00,  0.1852226E+08,  0.1699780E+09,  0.3120080E+09
03/05/2011 01:15:00,  0.1842276E+08,  0.1665826E+09,  0.3096859E+09
03/05/2011 01:30:00,  0.1830658E+08,  0.1629070E+09,  0.3070362E+09
03/05/2011 01:45:00,  0.1818630E+08,  0.1593729E+09,  0.3043226E+09
03/05/2011 02:00:00,  0.1806727E+08,  0.1560991E+09,  0.3016275E+09
03/05/2011 02:15:00,  0.1795863E+08,  0.1532989E+09,  0.2991583E+09
03/05/2011 02:30:00,  0.1784523E+08,  0.1505702E+09,  0.2965867E+09
03/05/2011 02:45:00,  0.1773690E+08,  0.1481252E+09,  0.2941295E+09
03/05/2011 03:00:00,  0.1763253E+08,  0.1458967E+09,  0.2917468E+09
03/05/2011 03:15:00,  0.1753541E+08,  0.1439210E+09,  0.2895070E+09
03/05/2011 03:30:00,  0.1744588E+08,  0.1421745E+09,  0.2874233E+09
03/05/2011 03:45:00,  0.1735866E+08,  0.1405367E+09,  0.2853788E+09
03/05/2011 04:00:00,  0.1727766E+08,  0.1390682E+09,  0.2834672E+09
03/05/2011 04:15:00,  0.1720190E+08,  0.1377220E+09,  0.2816420E+09
03/05/2011 04:30:00,  0.1714722E+08,  0.1367301E+09,  0.2802332E+09
03/05/2011 04:45:00,  0.1710313E+08,  0.1358992E+09,  0.2790037E+09
03/05/2011 05:00:00,  0.1706690E+08,  0.1351955E+09,  0.2779326E+09
03/05/2011 05:15:00,  0.1704297E+08,  0.1346859E+09,  0.2770998E+09
03/05/2011 05:30:00,  0.1704728E+08,  0.1346300E+09,  0.2767917E+09
03/05/2011 05:45:00,  0.1707006E+08,  0.1349438E+09,  0.2768564E+09
03/05/2011 06:00:00,  0.1709749E+08,  0.1353533E+09,  0.2770148E+09
03/05/2011 06:15:00,  0.1713241E+08,  0.1359857E+09,  0.2773268E+09
03/05/2011 06:30:00,  0.1719253E+08,  0.1374786E+09,  0.2781437E+09
03/05/2011 06:45:00,  0.1726705E+08,  0.1394740E+09,  0.2792505E+09
03/05/2011 07:00:00,  0.1734080E+08,  0.1414368E+09,  0.2803416E+09
03/05/2011 07:15:00,  0.1741780E+08,  0.1435122E+09,  0.2815003E+09
03/05/2011 07:30:00,  0.1751998E+08,  0.1464588E+09,  0.2831617E+09
03/05/2011 07:45:00,  0.1763692E+08,  0.1499268E+09,  0.2851264E+09
03/05/2011 08:00:00,  0.1775197E+08,  0.1533349E+09,  0.2870609E+09
03/05/2011 08:15:00,  0.1786941E+08,  0.1568055E+09,  0.2890348E+09
03/05/2011 08:30:00,  0.1799584E+08,  0.1606109E+09,  0.2912129E+09
03/05/2011 08:45:00,  0.1813416E+08,  0.1648128E+09,  0.2936315E+09
03/05/2011 09:00:00,  0.1826192E+08,  0.1686658E+09,  0.2958611E+09
03/05/2011 09:15:00,  0.1838232E+08,  0.1722417E+09,  0.2979457E+09
03/05/2011 09:30:00,  0.1849043E+08,  0.1754071E+09,  0.2998224E+09
03/05/2011 09:45:00,  0.1859548E+08,  0.1784467E+09,  0.3016538E+09
03/05/2011 10:00:00,  0.1868842E+08,  0.1810829E+09,  0.3032694E+09
03/05/2011 10:15:00,  0.1876914E+08,  0.1832835E+09,  0.3046582E+09
03/05/2011 10:30:00,  0.1883322E+08,  0.1848985E+09,  0.3058214E+09
03/05/2011 10:45:00,  0.1889158E+08,  0.1862913E+09,  0.3069781E+09
03/05/2011 11:00:00,  0.1894536E+08,  0.1875456E+09,  0.3081529E+09
03/05/2011 11:15:00,  0.1898746E+08,  0.1883912E+09,  0.3091873E+09
03/05/2011 11:30:00,  0.1900121E+08,  0.1882552E+09,  0.3096560E+09
03/05/2011 11:45:00,  0.1899881E+08,  0.1875507E+09,  0.3098065E+09
03/05/2011 12:00:00,  0.1899192E+08,  0.1866811E+09,  0.3098730E+09
03/05/2011 12:15:00,  0.1897439E+08,  0.1854424E+09,  0.3097314E+09
03/05/2011 12:30:00,  0.1892664E+08,  0.1831613E+09,  0.3089785E+09
03/05/2011 12:45:00,  0.1886318E+08,  0.1803466E+09,  0.3079108E+09
03/05/2011 13:00:00,  0.1880020E+08,  0.1775689E+09,  0.3068511E+09
03/05/2011 13:15:00,  0.1873431E+08,  0.1747096E+09,  0.3057348E+09
03/05/2011 13:30:00,  0.1865022E+08,  0.1712916E+09,  0.3042446E+09
03/05/2011 13:45:00,  0.1855627E+08,  0.1676143E+09,  0.3025548E+09
03/05/2011 14:00:00,  0.1846510E+08,  0.1641104E+09,  0.3009234E+09
03/05/2011 14:15:00,  0.1838016E+08,  0.1609310E+09,  0.2994083E+09
03/05/2011 14:30:00,  0.1828229E+08,  0.1574805E+09,  0.2976331E+09
03/05/2011 14:45:00,  0.1817537E+08,  0.1539238E+09,  0.2956787E+09
03/05/2011 15:00:00,  0.1806920E+08,  0.1505674E+09,  0.2937409E+09
03/05/2011 15:15:00,  0.1796961E+08,  0.1475719E+09,  0.2919282E+09
03/05/2011 15:30:00,  0.1787354E+08,  0.1448406E+09,  0.2901788E+09
03/05/2011 15:45:00,  0.1777531E+08,  0.1422013E+09,  0.2883869E+09
03/05/2011 16:00:00,  0.1768640E+08,  0.1399255E+09,  0.2867702E+09
03/05/2011 16:15:00,  0.1760829E+08,  0.1379942E+09,  0.2853552E+09
03/05/2011 16:30:00,  0.1754357E+08,  0.1364121E+09,  0.2841112E+09
03/05/2011 16:45:00,  0.1748725E+08,  0.1350515E+09,  0.2829372E+09
03/05/2011 17:00:00,  0.1743728E+08,  0.1338568E+09,  0.2817845E+09
03/05/2011 17:15:00,  0.1739931E+08,  0.1329216E+09,  0.2807741E+09
03/05/2011 17:30:00,  0.1738618E+08,  0.1324707E+09,  0.2802267E+09
03/05/2011 17:45:00,  0.1738870E+08,  0.1323299E+09,  0.2799700E+09
03/05/2011 18:00:00,  0.1739629E+08,  0.1322914E+09,  0.2798010E+09
03/05/2011 18:15:00,  0.1741311E+08,  0.1324673E+09,  0.2797949E+09
03/05/2011 18:30:00,  0.1745408E+08,  0.1332959E+09,  0.2802555E+09
03/05/2011 18:45:00,  0.1750636E+08,  0.1345099E+09,  0.2809452E+09
03/05/2011 19:00:00,  0.1755652E+08,  0.1356540E+09,  0.2815935E+09
03/05/2011 19:15:00,  0.1761094E+08,  0.1369459E+09,  0.2823237E+09
03/05/2011 19:30:00,  0.1769145E+08,  0.1391374E+09,  0.2835701E+09
03/05/2011 19:45:00,  0.1778697E+08,  0.1418650E+09,  0.2851228E+09
03/05/2011 20:00:00,  0.1788663E+08,  0.1447156E+09,  0.2867474E+09
03/05/2011 20:15:00,  0.1798700E+08,  0.1475976E+09,  0.2883921E+09
03/05/2011 20:30:00,  0.1810068E+08,  0.1509592E+09,  0.2903145E+09
03/05/2011 20:45:00,  0.1822215E+08,  0.1545920E+09,  0.2923945E+09
03/05/2011 21:00:00,  0.1834073E+08,  0.1581032E+09,  0.2944077E+09
03/05/2011 21:15:00,  0.1844592E+08,  0.1611676E+09,  0.2961680E+09
03/05/2011 21:30:00,  0.1855221E+08,  0.1642492E+09,  0.2979413E+09
03/05/2011 21:45:00,  0.1865576E+08,  0.1672458E+09,  0.2996676E+09
03/05/2011 22:00:00,  0.1875041E+08,  0.1699393E+09,  0.3012192E+09
03/05/2011 22:15:00,  0.1883414E+08,  0.1722407E+09,  0.3025451E+09
03/05/2011 22:30:00,  0.1890384E+08,  0.1740315E+09,  0.3035719E+09
03/05/2011 22:45:00,  0.1896178E+08,  0.1754325E+09,  0.3043675E+09
03/05/2011 23:00:00,  0.1901142E+08,  0.1765585E+09,  0.3049985E+09
03/05/2011 23:15:00,  0.1904937E+08,  0.1772537E+09,  0.3053768E+09
03/05/2011 23:30:00,  0.1905966E+08,  0.1769885E+09,  0.3052093E+09
03/05/2011 23:45:00,  0.1905509E+08,  0.1762054E+09,  0.3047490E+09
04/05/2011 00:00:00,  0.1904676E+08,  0.1752873E+09,  0.3042160E+09
04/05/2011 00:15:00,  0.1902770E+08,  0.1740083E+09,  0.3034780E+09
04/05/2011 00:30:00,  0.1897620E+08,  0.1716001E+09,  0.3020908E+09
04/05/2011 00:45:00,  0.1890914E+08,  0.1686976E+09,  0.3004061E+09
04/05/2011 01:00:00,  0.1884077E+08,  0.1657897E+09,  0.2986954E+09
04/05/2011 01:15:00,  0.1876606E+08,  0.1627239E+09,  0.2968581E+09
04/05/2011 01:30:00,  0.1866219E+08,  0.1587893E+09,  0.2944429E+09
04/05/2011 01:45:00,  0.1855011E+08,  0.1547716E+09,  0.2918867E+09
04/05/2011 02:00:00,  0.1843713E+08,  0.1509020E+09,  0.2893122E+09
04/05/2011 02:15:00,  0.1832452E+08,  0.1472411E+09,  0.2867484E+09
04/05/2011 02:30:00,  0.1820158E+08,  0.1435364E+09,  0.2840061E+09
04/05/2011 02:45:00,  0.1807359E+08,  0.1399556E+09,  0.2811792E+09
04/05/2011 03:00:00,  0.1794796E+08,  0.1366760E+09,  0.2784069E+09
04/05/2011 03:15:00,  0.1782711E+08,  0.1337172E+09,  0.2757277E+09
04/05/2011 03:30:00,  0.1771644E+08,  0.1311651E+09,  0.2732675E+09
04/05/2011 03:45:00,  0.1760813E+08,  0.1288072E+09,  0.2708587E+09
04/05/2011 04:00:00,  0.1750757E+08,  0.1267214E+09,  0.2686067E+09
04/05/2011 04:15:00,  0.1741480E+08,  0.1248713E+09,  0.2665048E+09
04/05/2011 04:30:00,  0.1733197E+08,  0.1232667E+09,  0.2646077E+09
04/05/2011 04:45:00,  0.1725081E+08,  0.1217504E+09,  0.2627543E+09
04/05/2011 05:00:00,  0.1716813E+08,  0.1202620E+09,  0.2608804E+09
04/05/2011 05:15:00,  0.1709504E+08,  0.1189693E+09,  0.2592007E+09
04/05/2011 05:30:00,  0.1704433E+08,  0.1180378E+09,  0.2579374E+09
04/05/2011 05:45:00,  0.1700822E+08,  0.1173255E+09,  0.2569303E+09
04/05/2011 06:00:00,  0.1698079E+08,  0.1167540E+09,  0.2560916E+09
04/05/2011 06:15:00,  0.1696749E+08,  0.1164096E+09,  0.2555084E+09
04/05/2011 06:30:00,  0.1698595E+08,  0.1166586E+09,  0.2555219E+09
04/05/2011 06:45:00,  0.1702330E+08,  0.1173649E+09,  0.2558929E+09
04/05/2011 07:00:00,  0.1706250E+08,  0.1181314E+09,  0.2563044E+09
04/05/2011 07:15:00,  0.1711051E+08,  0.1191941E+09,  0.2568828E+09
04/05/2011 07:30:00,  0.1718739E+08,  0.1212715E+09,  0.2580448E+09
04/05/2011 07:45:00,  0.1728447E+08,  0.1240322E+09,  0.2596013E+09
04/05/2011 08:00:00,  0.1737609E+08,  0.1266314E+09,  0.2610696E+09
04/05/2011 08:15:00,  0.1747566E+08,  0.1294856E+09,  0.2626881E+09
04/05/2011 08:30:00,  0.1759800E+08,  0.1331423E+09,  0.2647720E+09
04/05/2011 08:45:00,  0.1773384E+08,  0.1372777E+09,  0.2671372E+09
04/05/2011 09:00:00,  0.1787097E+08,  0.1414368E+09,  0.2695241E+09
04/05/2011 09:15:00,  0.1799785E+08,  0.1452657E+09,  0.2717406E+09
04/05/2011 09:30:00,  0.1813858E+08,  0.1495526E+09,  0.2742376E+09
04/05/2011 09:45:00,  0.1827870E+08,  0.1538394E+09,  0.2767456E+09
04/05/2011 10:00:00,  0.1841587E+08,  0.1580037E+09,  0.2791968E+09
04/05/2011 10:15:00,  0.1853651E+08,  0.1616109E+09,  0.2813435E+09
04/05/2011 10:30:00,  0.1865024E+08,  0.1649593E+09,  0.2834444E+09
04/05/2011 10:45:00,  0.1875630E+08,  0.1680450E+09,  0.2854957E+09
04/05/2011 11:00:00,  0.1885438E+08,  0.1708525E+09,  0.2874925E+09
04/05/2011 11:15:00,  0.1893858E+08,  0.1731751E+09,  0.2893147E+09
04/05/2011 11:30:00,  0.1899856E+08,  0.1746326E+09,  0.2906043E+09
04/05/2011 11:45:00,  0.1903951E+08,  0.1754412E+09,  0.2914636E+09
04/05/2011 12:00:00,  0.1907147E+08,  0.1759361E+09,  0.2921019E+09
04/05/2011 12:15:00,  0.1909124E+08,  0.1760028E+09,  0.2924576E+09
04/05/2011 12:30:00,  0.1908361E+08,  0.1751132E+09,  0.2922832E+09
04/05/2011 12:45:00,  0.1906412E+08,  0.1738097E+09,  0.2918889E+09
04/05/2011 13:00:00,  0.1904652E+08,  0.1725781E+09,  0.2915474E+09
04/05/2011 13:15:00,  0.1902129E+08,  0.1710783E+09,  0.2910686E+09
04/05/2011 13:30:00,  0.1896191E+08,  0.1683898E+09,  0.2899055E+09
04/05/2011 13:45:00,  0.1888278E+08,  0.1650495E+09,  0.2883442E+09
04/05/2011 14:00:00,  0.1880011E+08,  0.1616222E+09,  0.2867109E+09
04/05/2011 14:15:00,  0.1871267E+08,  0.1580835E+09,  0.2849780E+09
04/05/2011 14:30:00,  0.1860174E+08,  0.1538322E+09,  0.2827763E+09
04/05/2011 14:45:00,  0.1848600E+08,  0.1495584E+09,  0.2804797E+09
04/05/2011 15:00:00,  0.1837855E+08,  0.1456981E+09,  0.2783482E+09
04/05/2011 15:15:00,  0.1827339E+08,  0.1420364E+09,  0.2762627E+09
04/05/2011 15:30:00,  0.1816918E+08,  0.1385755E+09,  0.2741994E+09
04/05/2011 15:45:00,  0.1806170E+08,  0.1351700E+09,  0.2720732E+09
04/05/2011 16:00:00,  0.1796310E+08,  0.1321757E+09,  0.2701224E+09
04/05/2011 16:15:00,  0.1786836E+08,  0.1294145E+09,  0.2682428E+09
04/05/2011 16:30:00,  0.1777991E+08,  0.1269362E+09,  0.2664296E+09
04/05/2011 16:45:00,  0.1769114E+08,  0.1245531E+09,  0.2645559E+09
04/05/2011 17:00:00,  0.1760920E+08,  0.1224401E+09,  0.2627678E+09
04/05/2011 17:15:00,  0.1753295E+08,  0.1205317E+09,  0.2610362E+09
04/05/2011 17:30:00,  0.1746950E+08,  0.1189538E+09,  0.2595425E+09
04/05/2011 17:45:00,  0.1741492E+08,  0.1176038E+09,  0.2582144E+09
04/05/2011 18:00:00,  0.1736226E+08,  0.1163290E+09,  0.2569155E+09
04/05/2011 18:15:00,  0.1731856E+08,  0.1152487E+09,  0.2557706E+09
04/05/2011 18:30:00,  0.1730159E+08,  0.1146970E+09,  0.2551324E+09
04/05/2011 18:45:00,  0.1730156E+08,  0.1144793E+09,  0.2548077E+09
04/05/2011 19:00:00,  0.1730800E+08,  0.1143763E+09,  0.2545852E+09
04/05/2011 19:15:00,  0.1732397E+08,  0.1144891E+09,  0.2545461E+09
04/05/2011 19:30:00,  0.1736668E+08,  0.1153810E+09,  0.2550313E+09
04/05/2011 19:45:00,  0.1742772E+08,  0.1168855E+09,  0.2558674E+09
04/05/2011 20:00:00,  0.1748591E+08,  0.1183136E+09,  0.2566594E+09
04/05/2011 20:15:00,  0.1754936E+08,  0.1199193E+09,  0.2575521E+09
04/05/2011 20:30:00,  0.1764290E+08,  0.1225574E+09,  0.2590384E+09
04/05/2011 20:45:00,  0.1775208E+08,  0.1257599E+09,  0.2608500E+09
04/05/2011 21:00:00,  0.1786226E+08,  0.1289978E+09,  0.2626852E+09
04/05/2011 21:15:00,  0.1797425E+08,  0.1322779E+09,  0.2645468E+09
04/05/2011 21:30:00,  0.1809161E+08,  0.1357664E+09,  0.2665361E+09
04/05/2011 21:45:00,  0.1821455E+08,  0.1394296E+09,  0.2686316E+09
04/05/2011 22:00:00,  0.1832192E+08,  0.1425684E+09,  0.2704344E+09
04/05/2011 22:15:00,  0.1841872E+08,  0.1453165E+09,  0.2720198E+09
04/05/2011 22:30:00,  0.1850539E+08,  0.1477323E+09,  0.2734030E+09
04/05/2011 22:45:00,  0.1859327E+08,  0.1501688E+09,  0.2747860E+09
04/05/2011 23:00:00,  0.1867582E+08,  0.1524296E+09,  0.2760545E+09
04/05/2011 23:15:00,  0.1874885E+08,  0.1543634E+09,  0.2771239E+09
04/05/2011 23:30:00,  0.1880989E+08,  0.1558706E+09,  0.2779524E+09
04/05/2011 23:45:00,  0.1886493E+08,  0.1571686E+09,  0.2786613E+09
05/05/2011 00:00:00,  0.1891589E+08,  0.1583251E+09,  0.2792829E+09
05/05/2011 00:15:00,  0.1895242E+08,  0.1589752E+09,  0.2796081E+09
05/05/2011 00:30:00,  0.1895650E+08,  0.1584922E+09,  0.2792831E+09
05/05/2011 00:45:00,  0.1894072E+08,  0.1573183E+09,  0.2785586E+09
05/05/2011 01:00:00,  0.1891837E+08,  0.1558975E+09,  0.2776869E+09
05/05/2011 01:15:00,  0.1888524E+08,  0.1541280E+09,  0.2766120E+09
05/05/2011 01:30:00,  0.1881981E+08,  0.1512587E+09,  0.2748952E+09
05/05/2011 01:45:00,  0.1873810E+08,  0.1478699E+09,  0.2728585E+09
05/05/2011 02:00:00,  0.1865807E+08,  0.1446127E+09,  0.2708714E+09
05/05/2011 02:15:00,  0.1856877E+08,  0.1410972E+09,  0.2686856E+09
05/05/2011 02:30:00,  0.1846294E+08,  0.1372048E+09,  0.2662075E+09
05/05/2011 02:45:00,  0.1834366E+08,  0.1330582E+09,  0.2634660E+09
05/05/2011 03:00:00,  0.1823234E+08,  0.1293734E+09,  0.2609078E+09
05/05/2011 03:15:00,  0.1811942E+08,  0.1258450E+09,  0.2583243E+09
05/05/2011 03:30:00,  0.1799983E+08,  0.1223839E+09,  0.2556504E+09
05/05/2011 03:45:00,  0.1787016E+08,  0.1189075E+09,  0.2527927E+09
05/05/2011 04:00:00,  0.1774678E+08,  0.1158278E+09,  0.2500837E+09
05/05/2011 04:15:00,  0.1762491E+08,  0.1129846E+09,  0.2474082E+09
05/05/2011 04:30:00,  0.1751092E+08,  0.1104861E+09,  0.2449162E+09
05/05/2011 04:45:00,  0.1740215E+08,  0.1082260E+09,  0.2425390E+09
05/05/2011 05:00:00,  0.1730498E+08,  0.1062951E+09,  0.2404072E+09
05/05/2011 05:15:00,  0.1721418E+08,  0.1045561E+09,  0.2384024E+09
05/05/2011 05:30:00,  0.1713354E+08,  0.1030499E+09,  0.2365872E+09
05/05/2011 05:45:00,  0.1705571E+08,  0.1016320E+09,  0.2348143E+09
05/05/2011 06:00:00,  0.1698225E+08,  0.1003325E+09,  0.2331388E+09
05/05/2011 06:15:00,  0.1691839E+08,  0.9920881E+08,  0.2316332E+09
05/05/2011 06:30:00,  0.1688370E+08,  0.9853366E+08,  0.2306531E+09
05/05/2011 06:45:00,  0.1687148E+08,  0.9821091E+08,  0.2300704E+09
05/05/2011 07:00:00,  0.1687090E+08,  0.9806488E+08,  0.2297015E+09
05/05/2011 07:15:00,  0.1688387E+08,  0.9818680E+08,  0.2295825E+09
05/05/2011 07:30:00,  0.1692622E+08,  0.9907827E+08,  0.2300333E+09
05/05/2011 07:45:00,  0.1698436E+08,  0.1005003E+09,  0.2308004E+09
05/05/2011 08:00:00,  0.1704193E+08,  0.1018796E+09,  0.2315478E+09
05/05/2011 08:15:00,  0.1709899E+08,  0.1032612E+09,  0.2323048E+09
05/05/2011 08:30:00,  0.1717877E+08,  0.1054360E+09,  0.2335265E+09
05/05/2011 08:45:00,  0.1727396E+08,  0.1081487E+09,  0.2350673E+09
05/05/2011 09:00:00,  0.1736863E+08,  0.1108452E+09,  0.2366091E+09
05/05/2011 09:15:00,  0.1747281E+08,  0.1138542E+09,  0.2383420E+09
05/05/2011 09:30:00,  0.1760151E+08,  0.1177297E+09,  0.2405863E+09
05/05/2011 09:45:00,  0.1774575E+08,  0.1221564E+09,  0.2431601E+09
05/05/2011 10:00:00,  0.1788887E+08,  0.1265451E+09,  0.2457304E+09
05/05/2011 10:15:00,  0.1802767E+08,  0.1307729E+09,  0.2482513E+09
05/05/2011 10:30:00,  0.1817039E+08,  0.1351292E+09,  0.2509594E+09
05/05/2011 10:45:00,  0.1830662E+08,  0.1392775E+09,  0.2536507E+09
05/05/2011 11:00:00,  0.1843659E+08,  0.1431878E+09,  0.2563281E+09
05/05/2011 11:15:00,  0.1854918E+08,  0.1465109E+09,  0.2587688E+09
05/05/2011 11:30:00,  0.1865510E+08,  0.1495728E+09,  0.2610996E+09
05/05/2011 11:45:00,  0.1875284E+08,  0.1523682E+09,  0.2632764E+09
05/05/2011 12:00:00,  0.1884582E+08,  0.1549945E+09,  0.2653746E+09
05/05/2011 12:15:00,  0.1892746E+08,  0.1572233E+09,  0.2672636E+09
05/05/2011 12:30:00,  0.1898660E+08,  0.1586659E+09,  0.2687102E+09
05/05/2011 12:45:00,  0.1903386E+08,  0.1596854E+09,  0.2699268E+09
05/05/2011 13:00:00,  0.1907506E+08,  0.1605011E+09,  0.2710228E+09
05/05/2011 13:15:00,  0.1910174E+08,  0.1608091E+09,  0.2718314E+09
05/05/2011 13:30:00,  0.1909197E+08,  0.1598413E+09,  0.2718993E+09
05/05/2011 13:45:00,  0.1906045E+08,  0.1581135E+09,  0.2715256E+09
05/05/2011 14:00:00,  0.1902512E+08,  0.1562627E+09,  0.2710644E+09
05/05/2011 14:15:00,  0.1897755E+08,  0.1539727E+09,  0.2703566E+09
05/05/2011 14:30:00,  0.1889680E+08,  0.1505486E+09,  0.2689644E+09
05/05/2011 14:45:00,  0.1879797E+08,  0.1465240E+09,  0.2671948E+09
05/05/2011 15:00:00,  0.1869987E+08,  0.1425674E+09,  0.2654280E+09
05/05/2011 15:15:00,  0.1859917E+08,  0.1385732E+09,  0.2636018E+09
05/05/2011 15:30:00,  0.1848683E+08,  0.1342992E+09,  0.2615298E+09
05/05/2011 15:45:00,  0.1836977E+08,  0.1299917E+09,  0.2593616E+09
05/05/2011 16:00:00,  0.1825861E+08,  0.1260051E+09,  0.2573170E+09
05/05/2011 16:15:00,  0.1815741E+08,  0.1224879E+09,  0.2554599E+09
05/05/2011 16:30:00,  0.1804782E+08,  0.1188681E+09,  0.2533338E+09
05/05/2011 16:45:00,  0.1793800E+08,  0.1154302E+09,  0.2511248E+09
05/05/2011 17:00:00,  0.1783248E+08,  0.1122813E+09,  0.2489275E+09
05/05/2011 17:15:00,  0.1773104E+08,  0.1093826E+09,  0.2467275E+09
05/05/2011 17:30:00,  0.1764379E+08,  0.1069772E+09,  0.2448152E+09
05/05/2011 17:45:00,  0.1756228E+08,  0.1047980E+09,  0.2430071E+09
05/05/2011 18:00:00,  0.1749139E+08,  0.1029504E+09,  0.2414119E+09
05/05/2011 18:15:00,  0.1743089E+08,  0.1013812E+09,  0.2400051E+09
05/05/2011 18:30:00,  0.1739035E+08,  0.1002668E+09,  0.2389825E+09
05/05/2011 18:45:00,  0.1735898E+08,  0.9935186E+08,  0.2381261E+09
05/05/2011 19:00:00,  0.1733115E+08,  0.9853237E+08,  0.2373344E+09
05/05/2011 19:15:00,  0.1731066E+08,  0.9787419E+08,  0.2366685E+09
05/05/2011 19:30:00,  0.1731222E+08,  0.9766931E+08,  0.2364081E+09
05/05/2011 19:45:00,  0.1732789E+08,  0.9777586E+08,  0.2364074E+09
05/05/2011 20:00:00,  0.1734778E+08,  0.9796732E+08,  0.2364712E+09
05/05/2011 20:15:00,  0.1737823E+08,  0.9846763E+08,  0.2367457E+09
05/05/2011 20:30:00,  0.1744188E+08,  0.1000818E+09,  0.2376750E+09
05/05/2011 20:45:00,  0.1752642E+08,  0.1024250E+09,  0.2390195E+09
05/05/2011 21:00:00,  0.1761639E+08,  0.1049430E+09,  0.2404594E+09
05/05/2011 21:15:00,  0.1770772E+08,  0.1075210E+09,  0.2419308E+09
05/05/2011 21:30:00,  0.1782271E+08,  0.1109069E+09,  0.2438612E+09
05/05/2011 21:45:00,  0.1794346E+08,  0.1145143E+09,  0.2459152E+09
05/05/2011 22:00:00,  0.1806029E+08,  0.1179690E+09,  0.2478785E+09
05/05/2011 22:15:00,  0.1816847E+08,  0.1211364E+09,  0.2496751E+09
05/05/2011 22:30:00,  0.1828697E+08,  0.1246456E+09,  0.2516571E+09
05/05/2011 22:45:00,  0.1840573E+08,  0.1281843E+09,  0.2536478E+09
05/05/2011 23:00:00,  0.1852117E+08,  0.1315862E+09,  0.2555489E+09
05/05/2011 23:15:00,  0.1862347E+08,  0.1345491E+09,  0.2571912E+09
05/05/2011 23:30:00,  0.1872233E+08,  0.1373745E+09,  0.2587494E+09
05/05/2011 23:45:00,  0.1881631E+08,  0.1400365E+09,  0.2602107E+09
06/05/2011 00:00:00,  0.1890349E+08,  0.1424615E+09,  0.2615311E+09
06/05/2011 00:15:00,  0.1897753E+08,  0.1444265E+09,  0.2625837E+09
06/05/2011 00:30:00,  0.1902988E+08,  0.1456327E+09,  0.2631986E+09
06/05/2011 00:45:00,  0.1906888E+08,  0.1463730E+09,  0.2635440E+09
06/05/2011 01:00:00,  0.1910168E+08,  0.1468925E+09,  0.2637603E+09
06/05/2011 01:15:00,  0.1912007E+08,  0.1469122E+09,  0.2636867E+09
06/05/2011 01:30:00,  0.1910363E+08,  0.1457155E+09,  0.2629197E+09
06/05/2011 01:45:00,  0.1906586E+08,  0.1437697E+09,  0.2617229E+09
06/05/2011 02:00:00,  0.1902372E+08,  0.1416890E+09,  0.2604482E+09
06/05/2011 02:15:00,  0.1896955E+08,  0.1391960E+09,  0.2589329E+09
06/05/2011 02:30:00,  0.1888187E+08,  0.1355809E+09,  0.2567611E+09
06/05/2011 02:45:00,  0.1877601E+08,  0.1314075E+09,  0.2542399E+09
06/05/2011 03:00:00,  0.1866899E+08,  0.1272838E+09,  0.2517029E+09
06/05/2011 03:15:00,  0.1855867E+08,  0.1231857E+09,  0.2491208E+09
06/05/2011 03:30:00,  0.1842731E+08,  0.1186130E+09,  0.2461569E+09
06/05/2011 03:45:00,  0.1828658E+08,  0.1140145E+09,  0.2430441E+09
06/05/2011 04:00:00,  0.1814684E+08,  0.1097182E+09,  0.2399735E+09
06/05/2011 04:15:00,  0.1801698E+08,  0.1059709E+09,  0.2371348E+09
06/05/2011 04:30:00,  0.1787957E+08,  0.1022883E+09,  0.2341789E+09
06/05/2011 04:45:00,  0.1773888E+08,  0.9878734E+08,  0.2311870E+09
06/05/2011 05:00:00,  0.1760981E+08,  0.9578468E+08,  0.2284515E+09
06/05/2011 05:15:00,  0.1748715E+08,  0.9309642E+08,  0.2258536E+09
06/05/2011 05:30:00,  0.1737017E+08,  0.9067030E+08,  0.2233725E+09
06/05/2011 05:45:00,  0.1725897E+08,  0.8848617E+08,  0.2210216E+09
06/05/2011 06:00:00,  0.1714907E+08,  0.8642978E+08,  0.2186966E+09
06/05/2011 06:15:00,  0.1705438E+08,  0.8471992E+08,  0.2166684E+09
06/05/2011 06:30:00,  0.1697460E+08,  0.8329363E+08,  0.2148954E+09
06/05/2011 06:45:00,  0.1690826E+08,  0.8211357E+08,  0.2133709E+09
06/05/2011 07:00:00,  0.1684704E+08,  0.8103510E+08,  0.2119384E+09
06/05/2011 07:15:00,  0.1680054E+08,  0.8019002E+08,  0.2107659E+09
06/05/2011 07:30:00,  0.1678594E+08,  0.7983398E+08,  0.2101576E+09
06/05/2011 07:45:00,  0.1679233E+08,  0.7982359E+08,  0.2099245E+09
06/05/2011 08:00:00,  0.1680569E+08,  0.7993248E+08,  0.2098204E+09
06/05/2011 08:15:00,  0.1683147E+08,  0.8033467E+08,  0.2099518E+09
06/05/2011 08:30:00,  0.1689186E+08,  0.8183658E+08,  0.2107788E+09
06/05/2011 08:45:00,  0.1697308E+08,  0.8406431E+08,  0.2120383E+09
06/05/2011 09:00:00,  0.1705521E+08,  0.8632050E+08,  0.2133308E+09
06/05/2011 09:15:00,  0.1714420E+08,  0.8879630E+08,  0.2147657E+09
06/05/2011 09:30:00,  0.1725719E+08,  0.9213002E+08,  0.2167117E+09
06/05/2011 09:45:00,  0.1738490E+08,  0.9598688E+08,  0.2189757E+09
06/05/2011 10:00:00,  0.1751583E+08,  0.9992558E+08,  0.2213449E+09
06/05/2011 10:15:00,  0.1763835E+08,  0.1036028E+09,  0.2236031E+09
06/05/2011 10:30:00,  0.1778661E+08,  0.1081490E+09,  0.2264924E+09
06/05/2011 10:45:00,  0.1794377E+08,  0.1130251E+09,  0.2296799E+09
06/05/2011 11:00:00,  0.1809906E+08,  0.1178264E+09,  0.2329359E+09
06/05/2011 11:15:00,  0.1824376E+08,  0.1222647E+09,  0.2360780E+09
06/05/2011 11:30:00,  0.1838532E+08,  0.1266010E+09,  0.2391644E+09
06/05/2011 11:45:00,  0.1853081E+08,  0.1310548E+09,  0.2423505E+09
06/05/2011 12:00:00,  0.1866234E+08,  0.1350409E+09,  0.2452581E+09
06/05/2011 12:15:00,  0.1878213E+08,  0.1386017E+09,  0.2479477E+09
06/05/2011 12:30:00,  0.1888493E+08,  0.1415718E+09,  0.2503020E+09
06/05/2011 12:45:00,  0.1898124E+08,  0.1443157E+09,  0.2525319E+09
06/05/2011 13:00:00,  0.1907428E+08,  0.1469430E+09,  0.2547037E+09
06/05/2011 13:15:00,  0.1915371E+08,  0.1490762E+09,  0.2566174E+09
06/05/2011 13:30:00,  0.1919824E+08,  0.1500092E+09,  0.2578207E+09
06/05/2011 13:45:00,  0.1922411E+08,  0.1502895E+09,  0.2586478E+09
06/05/2011 14:00:00,  0.1924389E+08,  0.1503570E+09,  0.2593488E+09
06/05/2011 14:15:00,  0.1924827E+08,  0.1498864E+09,  0.2597381E+09
06/05/2011 14:30:00,  0.1921414E+08,  0.1480686E+09,  0.2593451E+09
06/05/2011 14:45:00,  0.1915997E+08,  0.1455536E+09,  0.2585397E+09
06/05/2011 15:00:00,  0.1910361E+08,  0.1429440E+09,  0.2576892E+09
06/05/2011 15:15:00,  0.1904256E+08,  0.1402137E+09,  0.2567163E+09
06/05/2011 15:30:00,  0.1894542E+08,  0.1362155E+09,  0.2550089E+09
06/05/2011 15:45:00,  0.1883357E+08,  0.1317454E+09,  0.2529845E+09
06/05/2011 16:00:00,  0.1872430E+08,  0.1274109E+09,  0.2509898E+09
06/05/2011 16:15:00,  0.1861571E+08,  0.1231594E+09,  0.2489925E+09
06/05/2011 16:30:00,  0.1849363E+08,  0.1185437E+09,  0.2466135E+09
06/05/2011 16:45:00,  0.1837127E+08,  0.1140581E+09,  0.2441066E+09
06/05/2011 17:00:00,  0.1825869E+08,  0.1100314E+09,  0.2417144E+09
06/05/2011 17:15:00,  0.1814930E+08,  0.1062344E+09,  0.2393007E+09
06/05/2011 17:30:00,  0.1804104E+08,  0.1026426E+09,  0.2369300E+09
06/05/2011 17:45:00,  0.1792558E+08,  0.9900526E+08,  0.2344260E+09
06/05/2011 18:00:00,  0.1781526E+08,  0.9569746E+08,  0.2320426E+09
06/05/2011 18:15:00,  0.1770797E+08,  0.9262165E+08,  0.2297195E+09
06/05/2011 18:30:00,  0.1761200E+08,  0.8997826E+08,  0.2276356E+09
06/05/2011 18:45:00,  0.1752295E+08,  0.8762172E+08,  0.2256991E+09
06/05/2011 19:00:00,  0.1744058E+08,  0.8552097E+08,  0.2239007E+09
06/05/2011 19:15:00,  0.1736846E+08,  0.8371043E+08,  0.2222836E+09
06/05/2011 19:30:00,  0.1732237E+08,  0.8249476E+08,  0.2211541E+09
06/05/2011 19:45:00,  0.1728950E+08,  0.8156971E+08,  0.2202618E+09
06/05/2011 20:00:00,  0.1726052E+08,  0.8073075E+08,  0.2194280E+09
06/05/2011 20:15:00,  0.1724600E+08,  0.8020194E+08,  0.2188573E+09
06/05/2011 20:30:00,  0.1726672E+08,  0.8046641E+08,  0.2189325E+09
06/05/2011 20:45:00,  0.1731241E+08,  0.8143664E+08,  0.2194692E+09
06/05/2011 21:00:00,  0.1736288E+08,  0.8260346E+08,  0.2201184E+09
06/05/2011 21:15:00,  0.1742817E+08,  0.8425531E+08,  0.2210407E+09
06/05/2011 21:30:00,  0.1752241E+08,  0.8693634E+08,  0.2225512E+09
06/05/2011 21:45:00,  0.1763199E+08,  0.9015480E+08,  0.2243670E+09
06/05/2011 22:00:00,  0.1774058E+08,  0.9332096E+08,  0.2261503E+09
06/05/2011 22:15:00,  0.1784497E+08,  0.9635622E+08,  0.2278561E+09
06/05/2011 22:30:00,  0.1796698E+08,  0.1000081E+09,  0.2299092E+09
06/05/2011 22:45:00,  0.1810443E+08,  0.1041807E+09,  0.2322543E+09
06/05/2011 23:00:00,  0.1823270E+08,  0.1080518E+09,  0.2344220E+09
06/05/2011 23:15:00,  0.1835852E+08,  0.1118171E+09,  0.2365202E+09
06/05/2011 23:30:00,  0.1848296E+08,  0.1155573E+09,  0.2386056E+09
06/05/2011 23:45:00,  0.1861257E+08,  0.1194570E+09,  0.2407797E+09
07/05/2011 00:00:00,  0.1873106E+08,  0.1229817E+09,  0.2427403E+09
