"M03_5m_CLA_001 [E:\_Training\_TUFLOW_Training_Python\models\Tute\runs\M03_5m_~s1~_001.tcf]","Time (h)","H FC01.1_R.1 [M03_5m_CLA_001]","H FC01.1_R.2 [M03_5m_CLA_001]","H FC01.2_R.1 [M03_5m_CLA_001]","H FC01.2_R.2 [M03_5m_CLA_001]","H FC04.1_C.1 [M03_5m_CLA_001]","H FC04.1_C.2 [M03_5m_CLA_001]"
       1,    0.000000,     44.5990,     44.4990,     37.6990,     37.5990,     43.3490,     42.7490
       2,    0.016667,     44.5990,     44.4990,     37.6990,     37.5990,     43.3490,     42.7490
       3,    0.033333,     44.5990,     44.4990,     37.6990,     37.5990,     43.3490,     42.7490
       4,    0.050000,     44.5990,     44.4990,     37.6990,     37.5990,     43.3490,     42.7490
       5,    0.066667,     44.5990,     44.4990,     37.6990,     37.5990,     43.3490,     42.7490
       6,    0.083333,     44.5990,     44.4990,     37.6990,     37.5990,     43.3490,     42.7490
       7,    0.100000,     44.5990,     44.4990,     37.6990,     37.5990,     43.3490,     42.7490
       8,    0.116667,     44.5990,     44.4990,     37.6990,     37.5990,     43.3490,     42.7490
       9,    0.133333,     44.5990,     44.4990,     37.6990,     37.5990,     43.3490,     42.7490
      10,    0.150000,     44.5990,     44.4990,     37.6990,     37.5990,     43.3490,     42.7490
      11,    0.166667,     44.5990,     44.4990,     37.6990,     37.5990,     43.3490,     42.7490
      12,    0.183333,     44.5990,     44.4990,     37.6990,     37.5990,     43.3490,     42.7490
      13,    0.200000,     44.5990,     44.4990,     37.6990,     37.5990,     43.3490,     42.7490
      14,    0.216667,     44.7047,     44.4990,     37.6990,     37.5990,     43.3490,     42.7490
      15,    0.233333,     44.9842,     44.4990,     37.6990,     37.5990,     43.3490,     42.7490
      16,    0.250000,     45.0822,     44.4990,     37.6990,     37.5990,     43.3490,     42.7490
      17,    0.266667,     45.1407,     44.5760,     37.6990,     37.5990,     43.3490,     42.7490
      18,    0.283333,     45.1762,     44.6130,     37.6990,     37.5990,     43.3490,     42.7490
      19,    0.300000,     45.2092,     44.6449,     37.6990,     37.5990,     43.3490,     42.7490
      20,    0.316667,     45.2634,     44.6843,     37.6990,     37.5990,     43.3490,     42.7490
      21,    0.333333,     45.3104,     44.7253,     37.6990,     37.5990,     43.3490,     42.7490
      22,    0.350000,     45.3502,     44.7649,     37.6990,     37.5990,     43.3490,     42.7490
      23,    0.366667,     45.4093,     44.8193,     37.6990,     37.5990,     43.3490,     42.7490
      24,    0.383333,     45.4898,     44.8964,     37.6990,     37.5990,     43.3490,     42.7490
      25,    0.400000,     45.5254,     44.9529,     37.6990,     37.5990,     43.3490,     42.7490
      26,    0.416667,     45.6353,     45.0488,     37.6990,     37.5990,     43.3490,     42.7490
      27,    0.433333,     45.6674,     45.1620,     37.6990,     37.5990,     43.3490,     42.7490
      28,    0.450000,     45.7582,     45.3345,     37.6990,     37.5990,     43.3490,     42.7490
      29,    0.466667,     45.9271,     45.4460,     37.6990,     37.5990,     43.3490,     42.7490
      30,    0.483333,     46.0573,     45.5270,     37.6990,     37.5990,     43.3490,     42.7490
      31,    0.500000,     46.1594,     45.5856,     37.6990,     37.5990,     43.3490,     42.7490
      32,    0.516667,     46.2608,     45.6569,     37.6990,     37.5990,     43.3490,     42.7490
      33,    0.533333,     46.4633,     45.7669,     37.6990,     37.5990,     43.3490,     42.7490
      34,    0.550000,     46.8801,     45.9673,     37.6990,     37.5990,     43.3490,     42.7490
      35,    0.566667,     47.2085,     46.1261,     37.6990,     37.5990,     43.3490,     42.7490
      36,    0.583333,     47.6723,     46.3206,     38.1327,     38.0411,     43.3490,     42.7490
      37,    0.600000,     47.9469,     46.4484,     38.9484,     38.2759,     43.3490,     42.7490
      38,    0.616667,     48.1498,     46.5274,     39.1014,     38.8189,     43.3490,     42.7490
      39,    0.633333,     48.4690,     46.6468,     39.2157,     39.5917,     43.3490,     42.7490
      40,    0.650000,     48.7028,     46.6939,     39.0435,     38.7929,     43.3490,     42.7490
      41,    0.666667,     48.8981,     46.7288,     39.2273,     38.7721,     43.3490,     42.7490
      42,    0.683333,     49.1002,     46.7669,     39.5559,     39.0531,     43.3947,     42.7490
      43,    0.700000,     49.3021,     46.8049,     39.5056,     39.3386,     43.6967,     42.9153
      44,    0.716667,     49.4611,     46.9124,     39.7047,     39.4770,     43.8571,     43.0244
      45,    0.733333,     49.5897,     47.0642,     39.8773,     39.5859,     44.0021,     43.1052
      46,    0.750000,     49.6645,     47.2137,     40.0473,     39.6908,     44.1258,     43.1752
      47,    0.766667,     49.7065,     47.3352,     40.2103,     39.7980,     44.2307,     43.2241
      48,    0.783333,     49.7708,     47.3198,     40.3506,     39.8798,     44.3183,     43.3230
      49,    0.800000,     49.7001,     47.4589,     40.5107,     39.9617,     44.3938,     43.3631
      50,    0.816667,     49.7172,     47.2143,     40.7106,     40.0452,     44.4557,     43.3892
      51,    0.833333,     49.7459,     47.2387,     40.9269,     40.1314,     44.5046,     43.4098
      52,    0.850000,     49.8154,     47.4267,     41.1529,     40.2185,     44.5428,     43.4267
      53,    0.866667,     49.8583,     47.6900,     41.3690,     40.2962,     44.5749,     43.4509
      54,    0.883333,     49.7518,     47.3485,     41.5540,     40.3612,     44.6029,     43.4616
      55,    0.900000,     49.7432,     47.4182,     41.7072,     40.4139,     44.6287,     43.4713
      56,    0.916667,     49.7566,     47.4020,     41.8332,     40.4527,     44.6529,     43.4803
      57,    0.933333,     49.7702,     47.2070,     41.9397,     40.4866,     44.6761,     43.4888
      58,    0.950000,     49.7555,     47.3025,     42.0293,     40.5117,     44.6976,     43.4967
      59,    0.966667,     49.7489,     47.5539,     42.1070,     40.5334,     44.7184,     43.5044
      60,    0.983333,     49.8074,     47.5930,     42.1777,     40.5508,     44.7379,     43.5116
      61,    1.000000,     49.7876,     47.6584,     42.2453,     40.5652,     44.7565,     43.5185
      62,    1.016667,     49.8264,     47.2996,     42.3070,     40.5772,     44.7741,     43.5249
      63,    1.033333,     49.7767,     47.3636,     42.3653,     40.5892,     44.7910,     43.5310
      64,    1.050000,     49.7996,     47.0851,     42.4181,     40.5990,     44.8069,     43.5368
      65,    1.066667,     49.7369,     47.1822,     42.4662,     40.6079,     44.8217,     43.5422
      66,    1.083333,     49.7595,     47.1917,     42.5047,     40.6156,     44.8359,     43.5474
      67,    1.100000,     49.8322,     47.5735,     42.5468,     40.6225,     44.8493,     43.5522
      68,    1.116667,     49.7834,     47.2871,     42.5868,     40.6294,     44.8614,     43.5567
      69,    1.133333,     49.7383,     47.3579,     42.6243,     40.6384,     44.8725,     43.5607
      70,    1.150000,     49.7015,     47.4498,     42.6619,     40.6535,     44.8827,     43.5644
      71,    1.166667,     49.7310,     47.3209,     42.6880,     40.6670,     44.8918,     43.5678
      72,    1.183333,     49.7139,     47.3426,     42.7152,     40.6746,     44.9001,     43.5709
      73,    1.200000,     49.7380,     47.4922,     42.7398,     40.6838,     44.9075,     43.5737
      74,    1.216667,     49.7418,     47.4438,     42.7609,     40.6915,     44.9138,     43.5762
      75,    1.233333,     49.6851,     47.3595,     42.7806,     40.6983,     44.9193,     43.5783
      76,    1.250000,     49.6986,     47.2222,     42.7972,     40.7046,     44.9239,     43.5801
      77,    1.266667,     49.6727,     47.2553,     42.8114,     40.7083,     44.9276,     43.5816
      78,    1.283333,     49.6468,     47.2673,     42.8245,     40.7193,     44.9302,     43.5826
      79,    1.300000,     49.6475,     47.3809,     42.8350,     40.7222,     44.9317,     43.5833
      80,    1.316667,     49.6419,     47.3034,     42.8437,     40.7270,     44.9323,     43.5836
      81,    1.333333,     49.6068,     47.1725,     42.8488,     40.7321,     44.9319,     43.5836
      82,    1.350000,     49.6142,     47.3548,     42.8532,     40.7352,     44.9306,     43.5831
      83,    1.366667,     49.5833,     47.1228,     42.8552,     40.7360,     44.9285,     43.5824
      84,    1.383333,     49.5713,     47.1550,     42.8548,     40.7363,     44.9255,     43.5813
      85,    1.400000,     49.5509,     47.1210,     42.8521,     40.7360,     44.9217,     43.5798
      86,    1.416667,     49.5402,     47.0920,     42.8480,     40.7347,     44.9171,     43.5781
      87,    1.433333,     49.5119,     47.0436,     42.8421,     40.7328,     44.9118,     43.5761
      88,    1.450000,     49.4939,     47.0374,     42.8345,     40.7302,     44.9056,     43.5738
      89,    1.466667,     49.4659,     47.0320,     42.8259,     40.7234,     44.8988,     43.5712
      90,    1.483333,     49.4350,     47.0146,     42.8153,     40.7235,     44.8913,     43.5684
      91,    1.500000,     49.3959,     47.0044,     42.8036,     40.7159,     44.8830,     43.5653
      92,    1.516667,     49.3565,     46.9434,     42.7907,     40.7145,     44.8740,     43.5619
      93,    1.533333,     49.3020,     46.9296,     42.7800,     40.7108,     44.8644,     43.5582
      94,    1.550000,     49.2374,     46.9218,     42.7654,     40.7010,     44.8542,     43.5544
      95,    1.566667,     49.1615,     46.9122,     42.7511,     40.6961,     44.8435,     43.5506
      96,    1.583333,     49.0712,     46.8703,     42.7355,     40.6909,     44.8321,     43.5465
      97,    1.600000,     48.9725,     46.8527,     42.7206,     40.6859,     44.8203,     43.5422
      98,    1.616667,     48.8740,     46.8387,     42.7055,     40.6808,     44.8085,     43.5380
      99,    1.633333,     48.7682,     46.8245,     42.6906,     40.6758,     44.7965,     43.5337
     100,    1.650000,     48.6602,     46.8069,     42.6745,     40.6702,     44.7843,     43.5293
     101,    1.666667,     48.5390,     46.7880,     42.6573,     40.6647,     44.7720,     43.5248
     102,    1.683333,     48.4119,     46.7663,     42.6410,     40.6564,     44.7596,     43.5204
     103,    1.700000,     48.2688,     46.7433,     42.6222,     40.6510,     44.7468,     43.5158
     104,    1.716667,     48.1162,     46.7196,     42.6026,     40.6405,     44.7338,     43.5111
     105,    1.733333,     47.9861,     46.6870,     42.5814,     40.6369,     44.7203,     43.5062
     106,    1.750000,     47.7989,     46.6445,     42.5573,     40.6335,     44.7067,     43.5013
     107,    1.766667,     47.5819,     46.5935,     42.5321,     40.6290,     44.6928,     43.4962
     108,    1.783333,     47.3267,     46.5260,     42.5054,     40.6241,     44.6789,     43.4912
     109,    1.800000,     47.1473,     46.4578,     42.4776,     40.6189,     44.6650,     43.4862
     110,    1.816667,     46.9832,     46.3925,     42.4517,     40.6148,     44.6512,     43.4811
     111,    1.833333,     46.8803,     46.3279,     42.4180,     40.6094,     44.6375,     43.4761
     112,    1.850000,     46.7583,     46.2313,     42.3810,     40.6028,     44.6237,     43.4710
     113,    1.866667,     46.6578,     46.1704,     42.3412,     40.5964,     44.6100,     43.4660
     114,    1.883333,     46.5772,     46.1154,     42.3003,     40.5892,     44.5964,     43.4610
     115,    1.900000,     46.4984,     46.0622,     42.2563,     40.5816,     44.5828,     43.4559
     116,    1.916667,     46.4714,     46.0242,     42.2085,     40.5719,     44.5691,     43.4508
     117,    1.933333,     46.4856,     46.0122,     42.1570,     40.5636,     44.5556,     43.4457
     118,    1.950000,     46.4491,     45.9987,     42.1024,     40.5537,     44.5423,     43.4405
     119,    1.966667,     46.4505,     45.9877,     42.0437,     40.5439,     44.5289,     43.4353
     120,    1.983333,     46.4516,     45.9822,     41.9819,     40.5333,     44.5157,     43.4299
     121,    2.000000,     46.4101,     45.9822,     41.9159,     40.5207,     44.5024,     43.4243
