"M03_5m_HPC_001 [E:\_Training\_TUFLOW_Training_Python\models\TUFLOW\runs\M03_5m_~s1~_001.tcf]","Node ID","Hmax","Time Hmax"
     1,"FC01.1_R.1",     49.7410,      0.9500
     2,"FC01.1_R.2",     47.1509,      0.9608
     3,"FC01.2_R.1",     42.7843,      1.3408
     4,"FC01.2_R.2",     40.7545,      1.3527
     5,"FC04.1_C.1",     44.9312,      1.3198
     6,"FC04.1_C.2",     43.4972,      1.3175
