time (hr),level (m AHD)
0.00,0.669
0.25,0.670
0.50,0.672
0.75,0.673
1.00,0.674
1.25,0.675
1.50,0.677
1.75,0.678
2.00,0.679
2.25,0.680
2.50,0.681
2.75,0.681
3.00,0.682
3.25,0.683
3.50,0.683
3.75,0.683
4.00,0.683
4.25,0.683
4.50,0.683
4.75,0.685
5.00,0.688
5.25,0.692
5.50,0.696
5.75,0.701
6.00,0.706
6.25,0.711
6.50,0.716
6.75,0.720
7.00,0.725
7.25,0.729
7.50,0.737
7.75,0.744
8.00,0.755
8.25,0.770
8.50,0.789
8.75,0.811
9.00,0.836
9.25,0.864
9.50,0.895
9.75,0.930
10.00,0.971
10.25,1.026
10.50,1.106
10.75,1.221
11.00,1.367
11.25,1.527
11.50,1.680
11.75,1.815
12.00,1.931
12.25,2.034
12.50,2.130
12.75,2.223
13.00,2.314
13.25,2.402
13.50,2.484
13.75,2.557
14.00,2.619
14.25,2.669
14.50,2.707
14.75,2.734
15.00,2.749
15.25,2.754
15.50,2.752
15.75,2.748
16.00,2.742
16.25,2.737
16.50,2.731
16.75,2.724
17.00,2.716
17.25,2.707
17.50,2.696
17.75,2.685
18.00,2.675
18.25,2.667
18.50,2.657
18.75,2.647
19.00,2.632
19.25,2.613
19.50,2.587
19.75,2.553
20.00,2.514
20.25,2.471
20.50,2.423
20.75,2.372
21.00,2.315
21.25,2.255
21.50,2.192
21.75,2.128
22.00,2.064
22.25,1.997
22.50,1.929
22.75,1.861
23.00,1.794
23.25,1.729
23.50,1.668
23.75,1.610
24.00,1.558
24.25,1.513
24.50,1.473
24.75,1.435
25.00,1.399
25.25,1.363
25.50,1.328
25.75,1.297
26.00,1.271
26.25,1.251
26.50,1.236
26.75,1.225
27.00,1.217
27.25,1.213
27.50,1.212
27.75,1.214
28.00,1.219
28.25,1.226
28.50,1.234
28.75,1.242
29.00,1.247
29.25,1.250
29.50,1.250
29.75,1.247
30.00,1.242
30.25,1.235
30.50,1.226
30.75,1.215
31.00,1.204
31.25,1.192
31.50,1.180
31.75,1.168
32.00,1.155
32.25,1.142
32.50,1.131
32.75,1.119
33.00,1.109
33.25,1.098
33.50,1.089
33.75,1.085
34.00,1.092
34.25,1.116
34.50,1.160
34.75,1.221
35.00,1.291
35.25,1.360
35.50,1.421
35.75,1.471
36.00,1.510
36.25,1.539
36.50,1.558
36.75,1.566
37.00,1.564
37.25,1.552
37.50,1.534
37.75,1.512
38.00,1.487
38.25,1.459
38.50,1.428
38.75,1.395
39.00,1.361
39.25,1.325
39.50,1.289
39.75,1.254
40.00,1.223
40.25,1.195
40.50,1.170
40.75,1.147
41.00,1.126
41.25,1.105
41.50,1.086
41.75,1.069
42.00,1.055
42.25,1.040
42.50,1.028
42.75,1.018
43.00,1.008
43.25,0.999
43.50,0.991
43.75,0.983
44.00,0.976
44.25,0.969
44.50,0.962
44.75,0.955
45.00,0.948
45.25,0.942
45.50,0.937
45.75,0.931
46.00,0.926
46.25,0.921
46.50,0.916
46.75,0.912
47.00,0.908
47.25,0.905
47.50,0.901
47.75,0.897
48.00,0.894
