Surveyed WL (m),Modelled WL (m)
98.943,100.128
98.597,98.123
98.009,99.755
97.826,97.898
97.558,97.792
96.564,96.563
95.998,95.88
95.73,95.03
95.508,95.948
95.42,95.12
95.309,94.546
94.857,93.09
94.248,95.574
94.015,95.617
92.355,93.821
92.341,90.978
92.145,93.094
91.331,92.141
91.18,92.725
90.828,89.506
90.013,90.852
