"M03_5m_CLA_001 [E:\_Training\_TUFLOW_Training_Python\models\Tute\runs\M03_5m_~s1~_001.tcf]","ID (Lowest)","Q Below","Q Above","Q Total","A Below","A Above","A Total","V Below","V Above","V Combined","h U/S","h D/S","dh","Time"
       1,"FC01.2_R",            72.3,             0.0,            72.3,            14.4,             0.0,            14.4,     5.020,     0.000,     5.020,    42.855,    40.736,     2.119,     1.374
       2,"FC04.1_C",             9.5,             0.0,             9.5,             3.4,             0.0,             3.4,     2.811,     0.000,     2.811,    44.932,    43.584,     1.349,     1.317
       3,"FC01.1_R",            51.2,             0.0,            51.2,             9.7,             0.0,             9.7,     5.270,     0.000,     5.270,    49.874,    47.626,     2.248,     1.059
