"M03_5m_CLA_001 [E:\_Training\_TUFLOW_Training_Python\models\TUFLOW\runs\M03_5m_~s1~_001.tcf]","Time(h)","V FC01.1_R [M03_5m_CLA_001]","V FC01.2_R [M03_5m_CLA_001]","V FC04.1_C [M03_5m_CLA_001]"
       1,    0.000000,    0.000,    0.000,    0.000
       2,    0.016667,    0.000,    0.000,    0.000
       3,    0.033333,    0.000,    0.000,    0.000
       4,    0.050000,    0.000,    0.000,    0.000
       5,    0.066667,    0.000,    0.000,    0.000
       6,    0.083333,    0.000,    0.000,    0.000
       7,    0.100000,    0.000,    0.000,    0.000
       8,    0.116667,    0.000,    0.000,    0.000
       9,    0.133333,    0.000,    0.000,    0.000
      10,    0.150000,    0.000,    0.000,    0.000
      11,    0.166667,    0.000,    0.000,    0.000
      12,    0.183333,    0.000,    0.000,    0.000
      13,    0.200000,    0.000,    0.000,    0.000
      14,    0.216667,    0.992,    0.000,    0.000
      15,    0.233333,    1.606,    0.000,    0.000
      16,    0.250000,    1.782,    0.000,    0.000
      17,    0.266667,    1.887,    0.000,    0.000
      18,    0.283333,    1.949,    0.000,    0.000
      19,    0.300000,    2.000,    0.000,    0.000
      20,    0.316667,    2.084,    0.000,    0.000
      21,    0.333333,    2.159,    0.000,    0.000
      22,    0.350000,    2.219,    0.000,    0.000
      23,    0.366667,    2.309,    0.000,    0.000
      24,    0.383333,    2.350,    0.000,    0.000
      25,    0.400000,    2.410,    0.000,    0.000
      26,    0.416667,    2.499,    0.000,    0.000
      27,    0.433333,    2.417,    0.000,    0.000
      28,    0.450000,    2.284,    0.000,    0.000
      29,    0.466667,    2.391,    0.000,    0.000
      30,    0.483333,    2.586,    0.000,    0.000
      31,    0.500000,    2.617,    0.000,    0.000
      32,    0.516667,    2.786,    0.000,    0.000
      33,    0.533333,    2.789,    0.000,    0.000
      34,    0.550000,    2.674,    0.000,    0.000
      35,    0.566667,    5.502,    0.000,    0.000
      36,    0.583333,    6.262,    0.649,    0.000
      37,    0.600000,    6.654,    0.622,    0.000
      38,    0.616667,    7.009,    0.657,    0.000
      39,    0.633333,    7.403,    0.769,    0.000
      40,    0.650000,    7.690,    0.808,    0.000
      41,    0.666667,    7.940,    0.869,    0.000
      42,    0.683333,    8.188,    1.069,    0.529
      43,    0.700000,    8.421,    1.383,    1.036
      44,    0.716667,    8.609,    1.636,    1.259
      45,    0.733333,    8.756,    1.868,    1.449
      46,    0.750000,    8.835,    2.061,    1.613
      47,    0.766667,    8.869,    2.209,    1.758
      48,    0.783333,    8.892,    2.369,    1.884
      49,    0.800000,    8.886,    2.559,    1.941
      50,    0.816667,    8.892,    2.814,    1.994
      51,    0.833333,    8.008,    3.088,    2.040
      52,    0.850000,    8.908,    3.354,    2.079
      53,    0.866667,    8.909,    3.596,    2.113
      54,    0.883333,    8.909,    3.797,    2.145
      55,    0.900000,    6.226,    3.954,    2.177
      56,    0.916667,    8.916,    4.084,    2.209
      57,    0.933333,    8.917,    4.185,    2.241
      58,    0.950000,    8.917,    4.272,    2.273
      59,    0.966667,    8.916,    4.351,    2.305
      60,    0.983333,    8.916,    4.423,    2.338
      61,    1.000000,    8.916,    4.492,    2.372
      62,    1.016667,    8.915,    4.555,    2.407
      63,    1.033333,    8.913,    4.614,    2.446
      64,    1.050000,    8.911,    4.668,    2.487
      65,    1.066667,    8.909,    4.716,    2.525
      66,    1.083333,    8.907,    4.756,    2.561
      67,    1.100000,    8.903,    4.801,    2.596
      68,    1.116667,    8.898,    4.840,    2.628
      69,    1.133333,    8.892,    4.873,    2.656
      70,    1.150000,    8.886,    4.888,    2.683
      71,    1.166667,    8.879,    4.909,    2.707
      72,    1.183333,    8.872,    4.930,    2.729
      73,    1.200000,    8.864,    4.948,    2.749
      74,    1.216667,    8.856,    4.963,    2.766
      75,    1.233333,    8.845,    4.976,    2.780
      76,    1.250000,    8.839,    4.985,    2.792
      77,    1.266667,    8.826,    4.994,    2.802
      78,    1.283333,    8.818,    4.996,    2.809
      79,    1.300000,    8.802,    5.001,    2.813
      80,    1.316667,    8.790,    5.006,    2.815
      81,    1.333333,    8.772,    5.008,    2.814
      82,    1.350000,    8.757,    5.009,    2.810
      83,    1.366667,    8.742,    5.009,    2.805
      84,    1.383333,    8.726,    5.007,    2.797
      85,    1.400000,    8.709,    5.004,    2.787
      86,    1.416667,    8.690,    4.999,    2.775
      87,    1.433333,    8.672,    4.994,    2.761
      88,    1.450000,    8.646,    4.988,    2.744
      89,    1.466667,    8.618,    4.981,    2.727
      90,    1.483333,    8.582,    4.973,    2.707
      91,    1.500000,    8.537,    4.965,    2.685
      92,    1.516667,    8.492,    4.959,    2.662
      93,    1.533333,    8.428,    4.947,    2.637
      94,    1.550000,    8.347,    4.941,    2.610
      95,    1.566667,    8.260,    4.930,    2.582
      96,    1.583333,    8.155,    4.918,    2.553
      97,    1.600000,    8.035,    4.906,    2.523
      98,    1.616667,    7.912,    4.894,    2.493
      99,    1.633333,    7.775,    4.882,    2.462
     100,    1.650000,    7.629,    4.870,    2.432
     101,    1.666667,    7.489,    4.858,    2.405
     102,    1.683333,    7.313,    4.847,    2.380
     103,    1.700000,    7.112,    4.831,    2.356
     104,    1.716667,    4.127,    4.821,    2.333
     105,    1.733333,    3.943,    4.798,    2.310
     106,    1.750000,    3.730,    4.775,    2.288
     107,    1.766667,    3.479,    4.749,    2.267
     108,    1.783333,    3.185,    4.719,    2.247
     109,    1.800000,    2.961,    4.697,    2.227
     110,    1.816667,    2.756,    4.665,    2.208
     111,    1.833333,    2.572,    4.630,    2.190
     112,    1.850000,    2.395,    4.591,    2.173
     113,    1.866667,    2.464,    4.549,    2.156
     114,    1.883333,    2.461,    4.504,    2.140
     115,    1.900000,    2.314,    4.454,    2.124
     116,    1.916667,    2.335,    4.400,    2.109
     117,    1.933333,    2.352,    4.343,    2.094
     118,    1.950000,    2.361,    4.279,    2.080
     119,    1.966667,    2.382,    4.216,    2.066
     120,    1.983333,    2.361,    4.145,    2.053
     121,    2.000000,    2.319,    4.067,    2.040
