No,Channel,US Node,DS Node,US Channel,DS Channel,Flags,Length,Form Loss,n or Cd,pSlope,US Invert,DS Invert,LBUS Obvert,RBUS Obvert,LBDS Obvert,RBDS Obvert,pBlockage
     3,"FC01.1_R","FC01.1_R.1","FC01.1_R.2","------","------","R",             7.0,   0.000,   0.015,   1.4,    44.600,    44.500,    46.400,    46.400,    46.300,    46.300,     0.000
     1,"FC01.2_R","FC01.2_R.1","FC01.2_R.2","------","------","R",            10.0,   0.000,   0.015,   1.0,    37.700,    37.600,    38.900,    38.900,    38.800,    38.800,     0.000
     2,"FC04.1_C","FC04.1_C.1","FC04.1_C.2","------","------","C",            20.0,   0.000,   0.015,   3.0,    43.350,    42.750,    44.550,    44.550,    43.950,    43.950,     0.000
