{
  "folder_structure": {
    "runs": "./runs",
    "log": "./runs/log",
    "results": "./results",
    "check": "./check",
    "gis": "./model/gis",
    "gis/xf": "./model/gis/xf",
    "gis/empty": "./model/gis/empty",
    "mi/empty": "./model/mi/empty",
    "mif": "./model/mi",
    "tin": "./model/tin",
    "model": "./model",
    "grid": "./model/grid",
    "grid/xf": "./model/grid/xf",
    "bc_dbase": "./bc_dbase",
    "pit_dbase": "./pit_dbase",
    "mat": "./model",
    "rf_grid_csv": "./bc_dbase/rf"
  },
  "mappings": {
    ".tcf": "runs",
    ".tgc": "model",
    ".tbc": "model",
    ".toc": "model",
    ".trfc": "bc_dbase",
    ".tesf": "bc_dbase",
    ".tef": "runs",
    ".ecf": "model",
    ".csv": "model",
    ".trd": "model",
    ".tscf": "model",
    ".shp": "gis",
    ".mif": "mif",
    ".prj": "gis",
    ".gpkg": "gis",
    ".asc": "grid",
    ".tif": "grid",
    ".flt": "grid",
    ".nc": "grid",
    ".tsoilf": "model",
    ".qcf": "model"
  },
  "always_create": []
}