
#REVISION#1
         9     0.750     0.900     0.100     0.001        12SI
    10.000     0.010     0.010     0.700     0.100     0.700     0.000
RAD FILE

END GENERAL
QTBDY
US_1
         2     0.000     0.000     HOURS    EXTEND    LINEAR               0.000
     0.100     0.000
     0.100    10.000
RIVER
SECTION
US_1
        10
         4
     0.000    99.000     0.001     1.000          445609.146447403.393          0
     0.000    98.000     0.001     1.000          445609.146447403.393          0
     5.000    98.000     0.001     1.000          445614.146447403.393          0
     5.000    99.000     0.001     1.000          445614.146447403.393          0
RIVER
SECTION
US_2
        10
         4
     0.000    99.000     0.001     1.000          445611.646447663.393          0
     0.000    97.999     0.001     1.000          445611.646447663.393          0
     5.000    97.999     0.001     1.000          445614.146447663.393          0
     5.000    99.000     0.001     1.000          445616.646447663.393          0
RIVER
SECTION
US_3
        10
         4
     0.000    99.000     0.001     1.000          445611.646447923.393          0
     0.000    97.998     0.001     1.000          445611.646447923.393          0
     5.000    97.998     0.001     1.000          445614.146447923.393          0
     5.000    99.000     0.001     1.000          445616.646447923.393          0
RIVER
SECTION
DS_1
     0.000              0.0001      1000
         4
     0.000    99.000     0.001     1.000          445611.646448183.393          
     0.000    97.998     0.001     1.000          445611.646448183.393          
     5.000    97.998     0.001     1.000          445614.146448183.393          
     5.000    99.000     0.001     1.000          445616.646448183.393          
JUNCTION
OPEN
DS_2a       DS_2
CONDUIT
ASYMMETRIC
DS_1a
    10.000     DARCY
        11
     0.000    99.000   0.00100
     1.000    98.500   0.00100
     2.000    97.998   0.00100
     3.000    98.500   0.00100
     4.000    97.998   0.00100
     5.000    99.000   0.00100
     4.000   102.998   0.00100
     3.000   103.500   0.00100
     2.000   102.998   0.00100
     1.000   103.500   0.00100
     0.000    99.000   0.00100
CONDUIT
ASYMMETRIC
DS_2a
     0.000     DARCY
        11
     0.000    99.000   0.00100
     1.000    98.500   0.00100
     2.000    97.997   0.00100
     3.000    98.500   0.00100
     4.000    97.997   0.00100
     5.000    99.000   0.00100
     4.000   102.997   0.00100
     3.000   103.500   0.00100
     2.000   102.997   0.00100
     1.000   103.500   0.00100
     0.000    99.000   0.00100
JUNCTION
OPEN
DS_1        DS_1a
RIVER
SECTION
DS_2
        10
         4
     0.000    99.000     0.001     1.000          445611.646448443.393          0
     0.000    97.997     0.001     1.000          445611.646448443.393          0
     5.000    97.997     0.001     1.000          445614.146448443.393          0
     5.000    99.000     0.001     1.000          445616.646448443.393          0
RIVER
SECTION
DS_3
        10
         4
     0.000    99.000     0.001     1.000          445611.646448703.393          0
     0.000    97.996     0.001     1.000          445611.646448703.393          0
     5.000    97.996     0.001     1.000          445614.146448703.393          0
     5.000    99.000     0.001     1.000          445616.646448703.393          0
RIVER
SECTION
DS_4
    0.000
         4
     0.000    98.500     0.001     1.000          445609.146448963.393          0
     0.000    97.500     0.001     1.000          445609.146448963.393          0
     5.000    97.500     0.001     1.000          445614.146448963.393          0
     5.000    98.500     0.001     1.000          445614.146448963.393          0
QHBDY
DS_4
         7     0.000    LINEAR
     0.000    98.000
     0.100    98.480
     0.110    98.500
     0.120    98.650
     0.400    98.700
     1.000    98.800
     5.000    99.000
INITIAL CONDITIONS
 label   ?      flow     stage froude no  velocity     umode    ustate         z
US_1         y     0.000     0.000     0.000     0.000     0.000     0.000     0.000
DS_4         y     0.000     0.000     0.000     0.000     0.000     0.000     0.000
US_3         y     0.000     0.000     0.000     0.000     0.000     0.000     0.000
DS_3         y     0.000     0.000     0.000     0.000     0.000     0.000     0.000
DS_2         y     0.000     0.000     0.000     0.000     0.000     0.000     0.000
DS_1         y     0.000     0.000     0.000     0.000     0.000     0.000     0.000
DS_1a        y     0.000     0.000     0.000     0.000     0.000     0.000     0.000
DS_2a        y     0.000     0.000     0.000     0.000     0.000     0.000     0.000
US_2         y     0.000     0.000     0.000     0.000     0.000     0.000     0.000
GISINFO
QTBDY US_1 0 0 0 0 0
RIVER SECTION US_1 0 0 0 0 0
RIVER SECTION US_2 0 0 0 0 0
RIVER SECTION US_3 0 0 0 0 0
RIVER SECTION DS_1 0 0 0 0 0
JUNCTION OPEN DS_2a 0 0 0 0 0
CONDUIT ASYMMETRIC DS_1a 0 0 0 0 0
CONDUIT ASYMMETRIC DS_2a 0 0 0 0 0
JUNCTION OPEN DS_1 0 0 0 0 0
RIVER SECTION DS_2 0 0 0 0 0
RIVER SECTION DS_3 0 0 0 0 0
RIVER SECTION DS_4 0 0 0 0 0
QHBDY DS_4 0 0 0 0 0
US_1 0 0 0 0 0
DS_4 0 0 0 0 0
US_3 0 0 0 0 0
DS_3 0 0 0 0 0
DS_2 0 0 0 0 0
DS_1 0 0 0 0 0
DS_1a 0 0 0 0 0
US_2 0 0 0 0 0
