{
  "i2c": {
    "type": "i2c",
    "bus": {
      "rtc": {
        "type": "ds3231",
        "interval": 10000
      },
      "scd": {
        "type": "scd30",
        "interval": 2000
      }
    }
  },
  "spi": {
    "type": "spi",
    "bus": {
      "sd-card": {
        "type": "sd",
        "chipselect": 15,
        "interval": 30000
      }
    }
  },
  "wifi": {
    "type": "wifi",
    "interval": 10000
  }
}
