EESchema Schematic File Version 4
EELAYER 30 0
EELAYER END
$Descr A4 11693 8268
encoding utf-8
Sheet 1 1
Title ""
Date "2020-07-17"
Rev "v1.0.1"
Comp ""
Comment1 ""
Comment2 ""
Comment3 ""
Comment4 ""
$EndDescr
$Comp
L CO2Mofetten:RJ45SensorCableConnector J1
U 1 1 5F1173DA
P 4900 2700
F 0 "J1" V 4911 3230 50  0000 L CNN
F 1 "RJ45SensorCableConnector" V 5002 3230 50  0000 L CNN
F 2 "CO2Mofetten:RJ45_econ_MEB8.8PG_Horizontal" V 4900 2725 50  0001 C CNN
F 3 "~" V 4900 2725 50  0001 C CNN
	1    4900 2700
	0    1    1    0   
$EndComp
$Comp
L CO2Mofetten:RJ45SensorCableConnector J3
U 1 1 5F118217
P 7000 2700
F 0 "J3" V 7011 3230 50  0000 L CNN
F 1 "RJ45SensorCableConnector" V 7102 3230 50  0000 L CNN
F 2 "CO2Mofetten:RJ45_econ_MEB8.8PG_Horizontal" V 7000 2725 50  0001 C CNN
F 3 "~" V 7000 2725 50  0001 C CNN
	1    7000 2700
	0    1    1    0   
$EndComp
$Comp
L CO2Mofetten:RJ45SensorCableConnector J2
U 1 1 5F11A037
P 6000 4200
F 0 "J2" V 6011 4730 50  0000 L CNN
F 1 "RJ45SensorCableConnector" V 6102 4730 50  0000 L CNN
F 2 "CO2Mofetten:RJ45_econ_MEB8.8PG_Horizontal" V 6000 4225 50  0001 C CNN
F 3 "~" V 6000 4225 50  0001 C CNN
	1    6000 4200
	0    -1   -1   0   
$EndComp
Wire Wire Line
	5600 3800 5700 3800
Connection ~ 5700 3800
Wire Wire Line
	5700 3800 5800 3800
Wire Wire Line
	6000 3800 6000 3750
Wire Wire Line
	5700 3750 5700 3800
Wire Wire Line
	5300 3100 5200 3100
Connection ~ 5200 3100
Wire Wire Line
	5200 3100 5100 3100
Wire Wire Line
	7400 3100 7300 3100
Connection ~ 7300 3100
Wire Wire Line
	7300 3100 7200 3100
Wire Wire Line
	7300 3100 7300 3150
Wire Wire Line
	7300 3150 7000 3150
Wire Wire Line
	7000 3150 7000 3100
Wire Wire Line
	7100 3100 7100 3350
Wire Wire Line
	7100 3350 5900 3350
Wire Wire Line
	5900 3350 5900 3800
Wire Wire Line
	5900 3350 5000 3350
Wire Wire Line
	5000 3350 5000 3100
Connection ~ 5900 3350
Wire Wire Line
	4800 3100 4800 3400
Wire Wire Line
	4800 3400 6100 3400
Wire Wire Line
	6100 3400 6100 3800
Wire Wire Line
	6900 3100 6900 3400
Wire Wire Line
	6900 3400 6100 3400
Connection ~ 6100 3400
Wire Wire Line
	6800 3100 6800 3200
Wire Wire Line
	6800 3200 6200 3200
Wire Wire Line
	6200 3200 6200 3800
Connection ~ 6200 3200
Wire Wire Line
	6500 4000 6500 4100
Connection ~ 6500 4100
Wire Wire Line
	6500 4100 6500 4300
Connection ~ 6500 4300
Wire Wire Line
	6500 4300 6500 4400
Wire Wire Line
	4700 3200 4700 3100
Wire Wire Line
	4700 3200 6200 3200
Wire Wire Line
	5200 3100 5200 3150
Wire Wire Line
	5200 3150 4900 3150
Wire Wire Line
	4900 3150 4900 3100
Wire Wire Line
	5200 3150 5700 3150
Connection ~ 5200 3150
Connection ~ 7000 3150
Wire Wire Line
	5700 3150 5700 3600
Connection ~ 5700 3150
Wire Wire Line
	5700 3150 6500 3150
Connection ~ 5700 3750
Wire Wire Line
	6500 4000 6500 3600
Wire Wire Line
	6500 3600 5700 3600
Wire Wire Line
	5700 3750 6000 3750
Connection ~ 6500 4000
Connection ~ 5700 3600
Wire Wire Line
	5700 3600 5700 3750
Wire Wire Line
	6500 2500 6500 2600
Connection ~ 6500 3150
Wire Wire Line
	6500 3150 7000 3150
Connection ~ 6500 2600
Wire Wire Line
	6500 2600 6500 2800
Connection ~ 6500 2800
Wire Wire Line
	6500 2800 6500 2900
Connection ~ 6500 2900
Wire Wire Line
	6500 2900 6500 3150
Wire Wire Line
	4400 2500 4400 2600
Wire Wire Line
	4400 3150 4900 3150
Connection ~ 4400 2600
Wire Wire Line
	4400 2600 4400 2800
Connection ~ 4400 2800
Wire Wire Line
	4400 2800 4400 2900
Connection ~ 4400 2900
Wire Wire Line
	4400 2900 4400 3150
Connection ~ 4900 3150
$Comp
L power:+3.3V #PWR0101
U 1 1 5F1194F3
P 3600 2300
F 0 "#PWR0101" H 3600 2150 50  0001 C CNN
F 1 "+3.3V" H 3615 2473 50  0000 C CNN
F 2 "" H 3600 2300 50  0001 C CNN
F 3 "" H 3600 2300 50  0001 C CNN
	1    3600 2300
	1    0    0    -1  
$EndComp
$Comp
L power:+5V #PWR0102
U 1 1 5F119E33
P 3950 2300
F 0 "#PWR0102" H 3950 2150 50  0001 C CNN
F 1 "+5V" H 3965 2473 50  0000 C CNN
F 2 "" H 3950 2300 50  0001 C CNN
F 3 "" H 3950 2300 50  0001 C CNN
	1    3950 2300
	1    0    0    -1  
$EndComp
Wire Wire Line
	4600 3100 4600 3250
Wire Wire Line
	4600 3250 6300 3250
Wire Wire Line
	6700 3250 6700 3100
Wire Wire Line
	6300 3250 6300 3800
Connection ~ 6300 3250
Wire Wire Line
	6300 3250 6700 3250
Wire Wire Line
	3950 2300 3950 3250
Wire Wire Line
	3950 3250 4600 3250
Connection ~ 4600 3250
Wire Wire Line
	4700 3200 3600 3200
Wire Wire Line
	3600 3200 3600 2300
Connection ~ 4700 3200
$Comp
L power:GND #PWR0103
U 1 1 5F11FFA5
P 3900 3750
F 0 "#PWR0103" H 3900 3500 50  0001 C CNN
F 1 "GND" H 3905 3577 50  0000 C CNN
F 2 "" H 3900 3750 50  0001 C CNN
F 3 "" H 3900 3750 50  0001 C CNN
	1    3900 3750
	1    0    0    -1  
$EndComp
Wire Wire Line
	5700 3600 3900 3600
Wire Wire Line
	3900 3600 3900 3750
$EndSCHEMATC
