(kicad_pcb (version 20171130) (host pcbnew 5.1.6)

  (general
    (thickness 1.6)
    (drawings 17)
    (tracks 83)
    (zones 0)
    (modules 3)
    (nets 6)
  )

  (page A4)
  (layers
    (0 F.Cu signal hide)
    (31 B.Cu signal)
    (32 B.Adhes user hide)
    (33 F.Adhes user hide)
    (34 B.Paste user hide)
    (35 F.Paste user hide)
    (36 B.SilkS user hide)
    (37 F.SilkS user hide)
    (38 B.Mask user hide)
    (39 F.Mask user hide)
    (40 Dwgs.User user hide)
    (41 Cmts.User user hide)
    (42 Eco1.User user hide)
    (43 Eco2.User user hide)
    (44 Edge.Cuts user)
    (45 Margin user hide)
    (46 B.CrtYd user hide)
    (47 F.CrtYd user hide)
    (48 B.Fab user hide)
    (49 F.Fab user hide)
  )

  (setup
    (last_trace_width 0.508)
    (user_trace_width 0.254)
    (trace_clearance 0.25146)
    (zone_clearance 0)
    (zone_45_only yes)
    (trace_min 0.2)
    (via_size 1.27)
    (via_drill 0.79502)
    (via_min_size 0.4)
    (via_min_drill 0.3)
    (uvia_size 1.27)
    (uvia_drill 0.79502)
    (uvias_allowed no)
    (uvia_min_size 0.2)
    (uvia_min_drill 0.1)
    (edge_width 0.05)
    (segment_width 0.2)
    (pcb_text_width 0.3)
    (pcb_text_size 1.5 1.5)
    (mod_edge_width 0.12)
    (mod_text_size 1 1)
    (mod_text_width 0.15)
    (pad_size 1.27 2.2)
    (pad_drill 0.79502)
    (pad_to_mask_clearance 0.051)
    (solder_mask_min_width 0.25)
    (aux_axis_origin 0 0)
    (visible_elements 7FFFFFFF)
    (pcbplotparams
      (layerselection 0x01000_ffffffff)
      (usegerberextensions false)
      (usegerberattributes true)
      (usegerberadvancedattributes true)
      (creategerberjobfile true)
      (excludeedgelayer true)
      (linewidth 0.100000)
      (plotframeref false)
      (viasonmask false)
      (mode 1)
      (useauxorigin false)
      (hpglpennumber 1)
      (hpglpenspeed 20)
      (hpglpendiameter 15.000000)
      (psnegative false)
      (psa4output false)
      (plotreference true)
      (plotvalue true)
      (plotinvisibletext false)
      (padsonsilk false)
      (subtractmaskfromsilk false)
      (outputformat 1)
      (mirror false)
      (drillshape 0)
      (scaleselection 1)
      (outputdirectory "plot"))
  )

  (net 0 "")
  (net 1 "Net-(J1-Pad5)")
  (net 2 "Net-(J1-Pad3)")
  (net 3 GND)
  (net 4 +3V3)
  (net 5 +5V)

  (net_class Default "Dies ist die voreingestellte Netzklasse."
    (clearance 0.25146)
    (trace_width 0.508)
    (via_dia 1.27)
    (via_drill 0.79502)
    (uvia_dia 1.27)
    (uvia_drill 0.79502)
    (add_net +3V3)
    (add_net +5V)
    (add_net GND)
    (add_net "Net-(J1-Pad3)")
    (add_net "Net-(J1-Pad5)")
  )

  (net_class Power ""
    (clearance 0.25146)
    (trace_width 0.508)
    (via_dia 1.27)
    (via_drill 0.79502)
    (uvia_dia 1.27)
    (uvia_drill 0.79502)
  )

  (module CO2Mofetten:RJ45_econ_MEB8.8PG_Horizontal (layer F.Cu) (tedit 5F11A551) (tstamp 5F1210E2)
    (at 90.1446 40.7416)
    (descr "Modular-Einbaubuchse Buchse, Einbau horizontal MEB8/8PG Metall econ connect MEB8/8PG 1 St. (https://asset.conrad.com/media10/add/160267/c1/-/en/001303852DS01/datenblatt-1303852-modular-einbaubuchse-buchse-einbau-horizontal-meb88pg-metall-econ-connect-meb88pg-1-st.pdf)")
    (tags RJ45)
    (path /5F1173DA)
    (fp_text reference J1 (at 4.445 -5) (layer F.SilkS)
      (effects (font (size 1 1) (thickness 0.15)))
    )
    (fp_text value RJ45SensorCableConnector (at 4.445 4) (layer F.Fab)
      (effects (font (size 1 1) (thickness 0.15)))
    )
    (fp_line (start 12.6 14.47) (end -3.71 14.47) (layer F.CrtYd) (width 0.05))
    (fp_line (start 12.6 14.47) (end 12.6 -4.27) (layer F.CrtYd) (width 0.05))
    (fp_line (start -3.71 -4.27) (end -3.71 14.47) (layer F.CrtYd) (width 0.05))
    (fp_line (start -3.71 -4.27) (end 12.6 -4.27) (layer F.CrtYd) (width 0.05))
    (fp_line (start -3.315 -3.88) (end -3.315 14.08) (layer F.SilkS) (width 0.12))
    (fp_line (start 12.205 -3.88) (end -3.315 -3.88) (layer F.SilkS) (width 0.12))
    (fp_line (start 12.205 -3.88) (end 12.205 14.08) (layer F.SilkS) (width 0.12))
    (fp_line (start -3.315 14.08) (end 12.205 14.08) (layer F.SilkS) (width 0.12))
    (fp_line (start -3.205 -2.77) (end -2.205 -3.77) (layer F.Fab) (width 0.12))
    (fp_line (start -2.205 -3.77) (end 12.095 -3.77) (layer F.Fab) (width 0.12))
    (fp_line (start 12.095 -3.77) (end 12.095 13.97) (layer F.Fab) (width 0.12))
    (fp_line (start 12.095 13.97) (end -3.205 13.97) (layer F.Fab) (width 0.12))
    (fp_line (start -3.205 13.97) (end -3.205 -2.77) (layer F.Fab) (width 0.12))
    (fp_line (start -3.5 0) (end -4 -0.5) (layer F.SilkS) (width 0.12))
    (fp_line (start -4 -0.5) (end -4 0.5) (layer F.SilkS) (width 0.12))
    (fp_line (start -4 0.5) (end -3.5 0) (layer F.SilkS) (width 0.12))
    (fp_text user %R (at 4.445 2) (layer F.Fab)
      (effects (font (size 1 1) (thickness 0.15)))
    )
    (pad Hr thru_hole oval (at 12.19 3.3) (size 1.27 2.2) (drill oval 0.79502 1.65) (layers *.Mask B.Cu)
      (net 3 GND))
    (pad Hl thru_hole oval (at -3.3 3.3) (size 1.27 2.2) (drill oval 0.79502 1.65) (layers *.Mask B.Cu)
      (net 3 GND))
    (pad 8 thru_hole oval (at 8.89 -2.54) (size 1.524 2.286) (drill 0.79502 (offset 0 -0.508)) (layers *.Mask B.Cu)
      (net 3 GND))
    (pad 7 thru_hole circle (at 7.62 0) (size 2.032 2.032) (drill 0.79502) (layers *.Mask B.Cu)
      (net 3 GND))
    (pad 6 thru_hole oval (at 6.4516 -2.54) (size 1.524 2.286) (drill 0.79502 (offset 0 -0.508)) (layers *.Mask B.Cu)
      (net 3 GND))
    (pad 5 thru_hole oval (at 5.08 0) (size 1.524 2.286) (drill 0.79502 (offset 0 0.381)) (layers *.Mask B.Cu)
      (net 1 "Net-(J1-Pad5)"))
    (pad 4 thru_hole oval (at 3.81 -2.54) (size 1.524 2.286) (drill 0.79502 (offset 0 -0.508)) (layers *.Mask B.Cu)
      (net 3 GND))
    (pad 3 thru_hole oval (at 2.54 0) (size 1.524 2.286) (drill 0.79502 (offset 0 0.381)) (layers *.Mask B.Cu)
      (net 2 "Net-(J1-Pad3)"))
    (pad 2 thru_hole oval (at 1.1684 -2.54) (size 1.524 2.286) (drill 0.79502 (offset 0 -0.508)) (layers *.Mask B.Cu)
      (net 4 +3V3))
    (pad 1 thru_hole rect (at 0 0) (size 1.524 2.032) (drill 0.79502 (offset 0 0.381)) (layers *.Mask B.Cu)
      (net 5 +5V))
    (pad Fl thru_hole circle (at -1.27 6.35) (size 3.200001 3.200001) (drill 3.200001) (layers *.Cu *.Mask)
      (net 3 GND) (zone_connect 2))
    (pad Fr thru_hole circle (at 10.16 6.35) (size 3.200001 3.200001) (drill 3.200001) (layers *.Cu *.Mask)
      (net 3 GND) (zone_connect 2))
    (model ${KISYS3DMOD}/Connector_RJ.3dshapes/RJ45_Amphenol_RJHSE538X.step
      (offset (xyz 7.8486 -4.8768 0))
      (scale (xyz 0.95 1.15 1))
      (rotate (xyz 0 0 180))
    )
  )

  (module CO2Mofetten:RJ45_econ_MEB8.8PG_Horizontal (layer F.Cu) (tedit 5F11A4EF) (tstamp 5F121007)
    (at 90.6526 26.0858 180)
    (descr "Modular-Einbaubuchse Buchse, Einbau horizontal MEB8/8PG Metall econ connect MEB8/8PG 1 St. (https://asset.conrad.com/media10/add/160267/c1/-/en/001303852DS01/datenblatt-1303852-modular-einbaubuchse-buchse-einbau-horizontal-meb88pg-metall-econ-connect-meb88pg-1-st.pdf)")
    (tags RJ45)
    (path /5F11A037)
    (fp_text reference J2 (at 4.445 -5) (layer F.SilkS)
      (effects (font (size 1 1) (thickness 0.15)))
    )
    (fp_text value RJ45SensorCableConnector (at 4.445 4) (layer F.Fab)
      (effects (font (size 1 1) (thickness 0.15)))
    )
    (fp_line (start -4 0.5) (end -3.5 0) (layer F.SilkS) (width 0.12))
    (fp_line (start -4 -0.5) (end -4 0.5) (layer F.SilkS) (width 0.12))
    (fp_line (start -3.5 0) (end -4 -0.5) (layer F.SilkS) (width 0.12))
    (fp_line (start -3.205 13.97) (end -3.205 -2.77) (layer F.Fab) (width 0.12))
    (fp_line (start 12.095 13.97) (end -3.205 13.97) (layer F.Fab) (width 0.12))
    (fp_line (start 12.095 -3.77) (end 12.095 13.97) (layer F.Fab) (width 0.12))
    (fp_line (start -2.205 -3.77) (end 12.095 -3.77) (layer F.Fab) (width 0.12))
    (fp_line (start -3.205 -2.77) (end -2.205 -3.77) (layer F.Fab) (width 0.12))
    (fp_line (start -3.315 14.08) (end 12.205 14.08) (layer F.SilkS) (width 0.12))
    (fp_line (start 12.205 -3.88) (end 12.205 14.08) (layer F.SilkS) (width 0.12))
    (fp_line (start 12.205 -3.88) (end -3.315 -3.88) (layer F.SilkS) (width 0.12))
    (fp_line (start -3.315 -3.88) (end -3.315 14.08) (layer F.SilkS) (width 0.12))
    (fp_line (start -3.71 -4.27) (end 12.6 -4.27) (layer F.CrtYd) (width 0.05))
    (fp_line (start -3.71 -4.27) (end -3.71 14.47) (layer F.CrtYd) (width 0.05))
    (fp_line (start 12.6 14.47) (end 12.6 -4.27) (layer F.CrtYd) (width 0.05))
    (fp_line (start 12.6 14.47) (end -3.71 14.47) (layer F.CrtYd) (width 0.05))
    (fp_text user %R (at 4.445 2) (layer F.Fab)
      (effects (font (size 1 1) (thickness 0.15)))
    )
    (pad Fr thru_hole circle (at 10.16 6.35 180) (size 3.200001 3.200001) (drill 3.200001) (layers *.Cu *.Mask)
      (net 3 GND) (zone_connect 2))
    (pad Fl thru_hole circle (at -1.27 6.35 180) (size 3.200001 3.200001) (drill 3.200001) (layers *.Cu *.Mask)
      (net 3 GND) (zone_connect 2))
    (pad 1 thru_hole rect (at 0 0 180) (size 1.524 2.032) (drill 0.79502 (offset 0 0.381)) (layers *.Mask B.Cu)
      (net 5 +5V))
    (pad 2 thru_hole oval (at 1.1684 -2.54 180) (size 1.524 2.286) (drill 0.79502 (offset 0 -0.508)) (layers *.Mask B.Cu)
      (net 4 +3V3))
    (pad 3 thru_hole oval (at 2.54 0 180) (size 1.524 2.286) (drill 0.79502 (offset 0 0.381)) (layers *.Mask B.Cu)
      (net 2 "Net-(J1-Pad3)"))
    (pad 4 thru_hole oval (at 3.81 -2.54 180) (size 1.524 2.286) (drill 0.79502 (offset 0 -0.508)) (layers *.Mask B.Cu)
      (net 3 GND))
    (pad 5 thru_hole oval (at 5.08 0 180) (size 1.524 2.286) (drill 0.79502 (offset 0 0.381)) (layers *.Mask B.Cu)
      (net 1 "Net-(J1-Pad5)"))
    (pad 6 thru_hole oval (at 6.4516 -2.54 180) (size 1.524 2.286) (drill 0.79502 (offset 0 -0.508)) (layers *.Mask B.Cu)
      (net 3 GND))
    (pad 7 thru_hole circle (at 7.62 0 180) (size 2.032 2.032) (drill 0.79502) (layers *.Mask B.Cu)
      (net 3 GND))
    (pad 8 thru_hole oval (at 8.89 -2.54 180) (size 1.524 2.286) (drill 0.79502 (offset 0 -0.508)) (layers *.Mask B.Cu)
      (net 3 GND))
    (pad Hl thru_hole oval (at -3.3 3.3 180) (size 1.27 2.2) (drill oval 0.79502 1.65) (layers *.Mask B.Cu)
      (net 3 GND))
    (pad Hr thru_hole oval (at 12.19 3.3 180) (size 1.27 2.2) (drill oval 0.79502 1.65) (layers *.Mask B.Cu)
      (net 3 GND))
    (model ${KISYS3DMOD}/Connector_RJ.3dshapes/RJ45_Amphenol_RJHSE538X.step
      (offset (xyz 7.8486 -4.8768 0))
      (scale (xyz 0.95 1.15 1))
      (rotate (xyz 0 0 180))
    )
  )

  (module CO2Mofetten:RJ45_econ_MEB8.8PG_Horizontal (layer F.Cu) (tedit 5F11A57F) (tstamp 5F12115A)
    (at 72.5043 40.7416)
    (descr "Modular-Einbaubuchse Buchse, Einbau horizontal MEB8/8PG Metall econ connect MEB8/8PG 1 St. (https://asset.conrad.com/media10/add/160267/c1/-/en/001303852DS01/datenblatt-1303852-modular-einbaubuchse-buchse-einbau-horizontal-meb88pg-metall-econ-connect-meb88pg-1-st.pdf)")
    (tags RJ45)
    (path /5F118217)
    (fp_text reference J3 (at 4.445 -5) (layer F.SilkS)
      (effects (font (size 1 1) (thickness 0.15)))
    )
    (fp_text value RJ45SensorCableConnector (at 4.445 4) (layer F.Fab)
      (effects (font (size 1 1) (thickness 0.15)))
    )
    (fp_line (start 12.6 14.47) (end -3.71 14.47) (layer F.CrtYd) (width 0.05))
    (fp_line (start 12.6 14.47) (end 12.6 -4.27) (layer F.CrtYd) (width 0.05))
    (fp_line (start -3.71 -4.27) (end -3.71 14.47) (layer F.CrtYd) (width 0.05))
    (fp_line (start -3.71 -4.27) (end 12.6 -4.27) (layer F.CrtYd) (width 0.05))
    (fp_line (start -3.315 -3.88) (end -3.315 14.08) (layer F.SilkS) (width 0.12))
    (fp_line (start 12.205 -3.88) (end -3.315 -3.88) (layer F.SilkS) (width 0.12))
    (fp_line (start 12.205 -3.88) (end 12.205 14.08) (layer F.SilkS) (width 0.12))
    (fp_line (start -3.315 14.08) (end 12.205 14.08) (layer F.SilkS) (width 0.12))
    (fp_line (start -3.205 -2.77) (end -2.205 -3.77) (layer F.Fab) (width 0.12))
    (fp_line (start -2.205 -3.77) (end 12.095 -3.77) (layer F.Fab) (width 0.12))
    (fp_line (start 12.095 -3.77) (end 12.095 13.97) (layer F.Fab) (width 0.12))
    (fp_line (start 12.095 13.97) (end -3.205 13.97) (layer F.Fab) (width 0.12))
    (fp_line (start -3.205 13.97) (end -3.205 -2.77) (layer F.Fab) (width 0.12))
    (fp_line (start -3.5 0) (end -4 -0.5) (layer F.SilkS) (width 0.12))
    (fp_line (start -4 -0.5) (end -4 0.5) (layer F.SilkS) (width 0.12))
    (fp_line (start -4 0.5) (end -3.5 0) (layer F.SilkS) (width 0.12))
    (fp_text user %R (at 4.445 2) (layer F.Fab)
      (effects (font (size 1 1) (thickness 0.15)))
    )
    (pad Hr thru_hole oval (at 12.19 3.3) (size 1.27 2.2) (drill oval 0.79502 1.65) (layers *.Mask B.Cu)
      (net 3 GND))
    (pad Hl thru_hole oval (at -3.3 3.3) (size 1.27 2.2) (drill oval 0.79502 1.65) (layers *.Mask B.Cu)
      (net 3 GND))
    (pad 8 thru_hole oval (at 8.89 -2.54) (size 1.524 2.286) (drill 0.79502 (offset 0 -0.508)) (layers *.Mask B.Cu)
      (net 3 GND))
    (pad 7 thru_hole circle (at 7.62 0) (size 2.032 2.032) (drill 0.79502) (layers *.Mask B.Cu)
      (net 3 GND))
    (pad 6 thru_hole oval (at 6.4516 -2.54) (size 1.524 2.286) (drill 0.79502 (offset 0 -0.508)) (layers *.Mask B.Cu)
      (net 3 GND))
    (pad 5 thru_hole oval (at 5.08 0) (size 1.524 2.286) (drill 0.79502 (offset 0 0.381)) (layers *.Mask B.Cu)
      (net 1 "Net-(J1-Pad5)"))
    (pad 4 thru_hole oval (at 3.81 -2.54) (size 1.524 2.286) (drill 0.79502 (offset 0 -0.508)) (layers *.Mask B.Cu)
      (net 3 GND))
    (pad 3 thru_hole oval (at 2.54 0) (size 1.524 2.286) (drill 0.79502 (offset 0 0.381)) (layers *.Mask B.Cu)
      (net 2 "Net-(J1-Pad3)"))
    (pad 2 thru_hole oval (at 1.1684 -2.54) (size 1.524 2.286) (drill 0.79502 (offset 0 -0.508)) (layers *.Mask B.Cu)
      (net 4 +3V3))
    (pad 1 thru_hole rect (at 0 0) (size 1.524 2.032) (drill 0.79502 (offset 0 0.381)) (layers *.Mask B.Cu)
      (net 5 +5V))
    (pad Fl thru_hole circle (at -1.27 6.35) (size 3.200001 3.200001) (drill 3.200001) (layers *.Cu *.Mask)
      (net 3 GND) (zone_connect 2))
    (pad Fr thru_hole circle (at 10.16 6.35) (size 3.200001 3.200001) (drill 3.200001) (layers *.Cu *.Mask)
      (net 3 GND) (zone_connect 2))
    (model ${KISYS3DMOD}/Connector_RJ.3dshapes/RJ45_Amphenol_RJHSE538X.step
      (offset (xyz 7.8486 -4.8768 0))
      (scale (xyz 0.95 1.15 1))
      (rotate (xyz 0 0 180))
    )
  )

  (gr_text v1.0.1 (at 86.36 15.621) (layer B.Cu)
    (effects (font (size 2.286 2.794) (thickness 0.254)) (justify mirror))
  )
  (gr_line (start 94.361 12.065) (end 78.105 12.065) (layer Edge.Cuts) (width 0.05) (tstamp 5F121499))
  (gr_arc (start 78.105 13.335) (end 76.835 13.335) (angle 90) (layer Edge.Cuts) (width 0.05) (tstamp 5F12147F))
  (gr_line (start 76.835 28.575) (end 76.835 13.335) (layer Edge.Cuts) (width 0.05))
  (gr_arc (start 94.361 13.335) (end 94.361 12.065) (angle 90) (layer Edge.Cuts) (width 0.05) (tstamp 5F121470))
  (gr_line (start 95.631 28.575) (end 95.631 13.335) (layer Edge.Cuts) (width 0.05))
  (gr_line (start 102.87 29.845) (end 96.901 29.845) (layer Edge.Cuts) (width 0.05) (tstamp 5F12136E))
  (gr_arc (start 102.87 31.115) (end 102.87 29.845) (angle 90) (layer Edge.Cuts) (width 0.05) (tstamp 5F12136D))
  (gr_arc (start 96.901 28.575) (end 96.901 29.845) (angle 90) (layer Edge.Cuts) (width 0.05) (tstamp 5F12136C))
  (gr_line (start 104.14 53.34) (end 104.14 31.115) (layer Edge.Cuts) (width 0.05) (tstamp 5F121313))
  (gr_line (start 68.58 29.845) (end 75.565 29.845) (layer Edge.Cuts) (width 0.05) (tstamp 5F121332))
  (gr_arc (start 75.565 28.575) (end 75.565 29.845) (angle -90) (layer Edge.Cuts) (width 0.05) (tstamp 5F121338))
  (gr_arc (start 68.58 31.115) (end 68.58 29.845) (angle -90) (layer Edge.Cuts) (width 0.05) (tstamp 5F121335))
  (gr_line (start 67.31 53.34) (end 67.31 31.115) (layer Edge.Cuts) (width 0.05))
  (gr_arc (start 68.58 53.34) (end 67.31 53.34) (angle -90) (layer Edge.Cuts) (width 0.05) (tstamp 5F1211BE))
  (gr_arc (start 102.87 53.34) (end 102.87 54.61) (angle -90) (layer Edge.Cuts) (width 0.05))
  (gr_line (start 68.58 54.61) (end 102.87 54.61) (layer Edge.Cuts) (width 0.0508))

  (segment (start 94.0816 34.6456) (end 95.2246 35.7886) (width 0.508) (layer B.Cu) (net 1))
  (segment (start 86.7537 34.6456) (end 94.0816 34.6456) (width 0.508) (layer B.Cu) (net 1))
  (segment (start 85.5726 33.4645) (end 86.7537 34.6456) (width 0.508) (layer B.Cu) (net 1))
  (segment (start 95.2246 35.7886) (end 95.2246 40.7416) (width 0.508) (layer B.Cu) (net 1))
  (segment (start 85.5726 26.0858) (end 85.5726 33.4645) (width 0.508) (layer B.Cu) (net 1))
  (segment (start 77.5843 40.7416) (end 77.5843 34.4297) (width 0.508) (layer B.Cu) (net 1))
  (segment (start 77.5843 34.4297) (end 79.883 32.131) (width 0.508) (layer B.Cu) (net 1))
  (segment (start 85.5726 24.5364) (end 85.5726 26.0858) (width 0.508) (layer B.Cu) (net 1))
  (segment (start 79.883 32.131) (end 79.883 26.680927) (width 0.508) (layer B.Cu) (net 1))
  (segment (start 79.883 26.680927) (end 82.764127 23.7998) (width 0.508) (layer B.Cu) (net 1))
  (segment (start 82.764127 23.7998) (end 84.836 23.7998) (width 0.508) (layer B.Cu) (net 1))
  (segment (start 84.836 23.7998) (end 85.5726 24.5364) (width 0.508) (layer B.Cu) (net 1))
  (segment (start 88.138 26.1112) (end 88.1126 26.0858) (width 0.508) (layer B.Cu) (net 2))
  (segment (start 88.138 31.877) (end 88.138 26.1112) (width 0.508) (layer B.Cu) (net 2))
  (segment (start 89.339441 33.078441) (end 88.138 31.877) (width 0.508) (layer B.Cu) (net 2))
  (segment (start 96.901 34.925) (end 95.054441 33.078441) (width 0.508) (layer B.Cu) (net 2))
  (segment (start 99.197892 34.925) (end 96.901 34.925) (width 0.508) (layer B.Cu) (net 2))
  (segment (start 95.054441 33.078441) (end 89.339441 33.078441) (width 0.508) (layer B.Cu) (net 2))
  (segment (start 100.876099 36.603207) (end 99.197892 34.925) (width 0.508) (layer B.Cu) (net 2))
  (segment (start 100.876099 40.500301) (end 100.876099 36.603207) (width 0.508) (layer B.Cu) (net 2))
  (segment (start 98.064342 43.312058) (end 100.876099 40.500301) (width 0.508) (layer B.Cu) (net 2))
  (segment (start 92.905558 43.312058) (end 98.064342 43.312058) (width 0.508) (layer B.Cu) (net 2))
  (segment (start 92.6846 43.0911) (end 92.905558 43.312058) (width 0.508) (layer B.Cu) (net 2))
  (segment (start 92.6846 40.7416) (end 92.6846 43.0911) (width 0.508) (layer B.Cu) (net 2))
  (segment (start 87.9729 25.9461) (end 88.1126 26.0858) (width 0.508) (layer B.Cu) (net 2))
  (segment (start 87.9729 23.4569) (end 87.9729 25.9461) (width 0.508) (layer B.Cu) (net 2))
  (segment (start 86.233 21.717) (end 87.9729 23.4569) (width 0.508) (layer B.Cu) (net 2))
  (segment (start 78.105 26.162) (end 82.55 21.717) (width 0.508) (layer B.Cu) (net 2))
  (segment (start 78.105 31.2293) (end 78.105 26.162) (width 0.508) (layer B.Cu) (net 2))
  (segment (start 82.55 21.717) (end 86.233 21.717) (width 0.508) (layer B.Cu) (net 2))
  (segment (start 75.0443 34.29) (end 78.105 31.2293) (width 0.508) (layer B.Cu) (net 2))
  (segment (start 75.0443 40.7416) (end 75.0443 34.29) (width 0.508) (layer B.Cu) (net 2))
  (segment (start 102.3346 44.0416) (end 86.8446 44.0416) (width 0.508) (layer F.Cu) (net 3) (tstamp 5F1210B1))
  (segment (start 84.6943 44.0416) (end 69.2043 44.0416) (width 0.508) (layer F.Cu) (net 3) (tstamp 5F12107E))
  (segment (start 78.4626 22.7858) (end 93.9526 22.7858) (width 0.508) (layer F.Cu) (net 3) (tstamp 5F120FD3))
  (segment (start 101.63557 36.288624) (end 99.509946 34.163) (width 0.508) (layer B.Cu) (net 4))
  (segment (start 101.63557 40.814884) (end 101.63557 36.288624) (width 0.508) (layer B.Cu) (net 4))
  (segment (start 97.2185 34.163) (end 95.374471 32.318971) (width 0.508) (layer B.Cu) (net 4))
  (segment (start 89.4842 31.1912) (end 89.4842 28.6258) (width 0.508) (layer B.Cu) (net 4))
  (segment (start 91.313 38.2016) (end 91.41713 38.30573) (width 0.508) (layer B.Cu) (net 4))
  (segment (start 91.937829 44.071529) (end 98.378926 44.071528) (width 0.508) (layer B.Cu) (net 4))
  (segment (start 90.611971 32.318971) (end 89.4842 31.1912) (width 0.508) (layer B.Cu) (net 4))
  (segment (start 91.41713 38.30573) (end 91.41713 43.55083) (width 0.508) (layer B.Cu) (net 4))
  (segment (start 98.378926 44.071528) (end 101.63557 40.814884) (width 0.508) (layer B.Cu) (net 4))
  (segment (start 99.509946 34.163) (end 97.2185 34.163) (width 0.508) (layer B.Cu) (net 4))
  (segment (start 91.41713 43.55083) (end 91.937829 44.071529) (width 0.508) (layer B.Cu) (net 4))
  (segment (start 95.374471 32.318971) (end 90.611971 32.318971) (width 0.508) (layer B.Cu) (net 4))
  (segment (start 73.771761 38.300661) (end 73.6727 38.2016) (width 0.508) (layer B.Cu) (net 4))
  (segment (start 73.771761 44.307761) (end 73.771761 38.300661) (width 0.508) (layer B.Cu) (net 4))
  (segment (start 75.326229 49.799229) (end 74.7395 49.2125) (width 0.508) (layer B.Cu) (net 4))
  (segment (start 89.265771 49.799229) (end 75.326229 49.799229) (width 0.508) (layer B.Cu) (net 4))
  (segment (start 89.867939 49.197061) (end 89.265771 49.799229) (width 0.508) (layer B.Cu) (net 4))
  (segment (start 74.7395 45.2755) (end 73.771761 44.307761) (width 0.508) (layer B.Cu) (net 4))
  (segment (start 89.885222 49.197061) (end 89.867939 49.197061) (width 0.508) (layer B.Cu) (net 4))
  (segment (start 90.980061 48.102222) (end 89.885222 49.197061) (width 0.508) (layer B.Cu) (net 4))
  (segment (start 74.7395 49.2125) (end 74.7395 45.2755) (width 0.508) (layer B.Cu) (net 4))
  (segment (start 88.773 43.054808) (end 90.980061 45.261869) (width 0.508) (layer B.Cu) (net 4))
  (segment (start 88.773 39.70337) (end 88.773 43.054808) (width 0.508) (layer B.Cu) (net 4))
  (segment (start 91.313 38.2016) (end 90.27477 38.2016) (width 0.508) (layer B.Cu) (net 4))
  (segment (start 90.27477 38.2016) (end 88.773 39.70337) (width 0.508) (layer B.Cu) (net 4))
  (segment (start 90.980061 45.261869) (end 90.980061 48.102222) (width 0.508) (layer B.Cu) (net 4))
  (segment (start 90.1446 40.7416) (end 90.1446 43.1292) (width 0.508) (layer B.Cu) (net 5) (tstamp 5F12112F))
  (segment (start 90.1446 43.187254) (end 90.1446 43.352354) (width 0.508) (layer B.Cu) (net 5) (tstamp 5F1211A1))
  (segment (start 90.1446 43.187254) (end 90.1446 43.1292) (width 0.508) (layer B.Cu) (net 5) (tstamp 5F12104B))
  (segment (start 91.44 30.607) (end 91.44 26.8732) (width 0.508) (layer B.Cu) (net 5))
  (segment (start 95.6945 31.5595) (end 92.3925 31.5595) (width 0.508) (layer B.Cu) (net 5))
  (segment (start 97.4725 33.3375) (end 95.6945 31.5595) (width 0.508) (layer B.Cu) (net 5))
  (segment (start 91.44 26.8732) (end 90.6526 26.0858) (width 0.508) (layer B.Cu) (net 5))
  (segment (start 90.1446 43.352354) (end 91.623246 44.831) (width 0.508) (layer B.Cu) (net 5))
  (segment (start 102.395041 35.974041) (end 99.7585 33.3375) (width 0.508) (layer B.Cu) (net 5))
  (segment (start 102.395041 41.129465) (end 102.395041 35.974041) (width 0.508) (layer B.Cu) (net 5))
  (segment (start 92.3925 31.5595) (end 91.44 30.607) (width 0.508) (layer B.Cu) (net 5))
  (segment (start 91.623246 44.831) (end 98.693508 44.831) (width 0.508) (layer B.Cu) (net 5))
  (segment (start 98.693508 44.831) (end 102.395041 41.129465) (width 0.508) (layer B.Cu) (net 5))
  (segment (start 99.7585 33.3375) (end 97.4725 33.3375) (width 0.508) (layer B.Cu) (net 5))
  (segment (start 75.011646 50.5587) (end 89.597637 50.5587) (width 0.508) (layer B.Cu) (net 5))
  (segment (start 73.980029 49.527083) (end 75.011646 50.5587) (width 0.508) (layer B.Cu) (net 5))
  (segment (start 72.5043 44.114354) (end 73.980029 45.590083) (width 0.508) (layer B.Cu) (net 5))
  (segment (start 73.980029 45.590083) (end 73.980029 49.527083) (width 0.508) (layer B.Cu) (net 5))
  (segment (start 89.597637 50.5587) (end 91.739532 48.416805) (width 0.508) (layer B.Cu) (net 5))
  (segment (start 91.739532 48.416805) (end 91.739532 44.947286) (width 0.508) (layer B.Cu) (net 5))
  (segment (start 91.739532 44.947286) (end 90.1446 43.352354) (width 0.508) (layer B.Cu) (net 5))
  (segment (start 72.5043 40.7416) (end 72.5043 44.114354) (width 0.508) (layer B.Cu) (net 5))

  (zone (net 3) (net_name GND) (layer B.Cu) (tstamp 5F11A410) (hatch edge 0.508)
    (connect_pads (clearance 0))
    (min_thickness 0.254)
    (fill yes (arc_segments 32) (thermal_gap 0.79502) (thermal_bridge_width 0.889))
    (polygon
      (pts
        (xy 106.4006 6.1214) (xy 114.9604 60.8457) (xy 58.6105 58.5724) (xy 64.9859 8.0391)
      )
    )
    (filled_polygon
      (pts
        (xy 94.578017 12.239008) (xy 94.786758 12.302031) (xy 94.979288 12.404401) (xy 95.148265 12.542216) (xy 95.287259 12.71023)
        (xy 95.390972 12.902043) (xy 95.455452 13.110342) (xy 95.478997 13.334362) (xy 95.479001 13.335531) (xy 95.479 21.918334)
        (xy 95.478472 21.915094) (xy 95.370003 21.625207) (xy 95.207065 21.362051) (xy 94.995918 21.135739) (xy 94.744677 20.954968)
        (xy 94.504645 20.86493) (xy 94.2701 21.032842) (xy 94.2701 22.4683) (xy 94.2901 22.4683) (xy 94.2901 23.1033)
        (xy 94.2701 23.1033) (xy 94.2701 24.538758) (xy 94.504645 24.70667) (xy 94.744677 24.616632) (xy 94.995918 24.435861)
        (xy 95.207065 24.209549) (xy 95.370003 23.946393) (xy 95.478472 23.656506) (xy 95.479 23.653267) (xy 95.479 28.582461)
        (xy 95.479026 28.582727) (xy 95.479032 28.584397) (xy 95.479703 28.591006) (xy 95.479657 28.597642) (xy 95.479864 28.599754)
        (xy 95.505772 28.846257) (xy 95.508546 28.859771) (xy 95.511124 28.873285) (xy 95.511737 28.875317) (xy 95.585032 29.112093)
        (xy 95.590367 29.124785) (xy 95.595531 29.137566) (xy 95.596527 29.13944) (xy 95.714415 29.35747) (xy 95.722126 29.368902)
        (xy 95.729663 29.380419) (xy 95.731004 29.382064) (xy 95.888997 29.573044) (xy 95.898811 29.582789) (xy 95.908412 29.592594)
        (xy 95.910047 29.593947) (xy 96.102124 29.750601) (xy 96.113611 29.758233) (xy 96.124967 29.766009) (xy 96.126829 29.767015)
        (xy 96.126833 29.767018) (xy 96.126837 29.76702) (xy 96.345681 29.883381) (xy 96.358422 29.888632) (xy 96.371081 29.894058)
        (xy 96.373108 29.894685) (xy 96.610389 29.966325) (xy 96.623854 29.968991) (xy 96.637379 29.971866) (xy 96.639489 29.972088)
        (xy 96.886167 29.996275) (xy 96.886178 29.996275) (xy 96.893538 29.997) (xy 102.862561 29.997) (xy 103.087017 30.019008)
        (xy 103.295758 30.082031) (xy 103.488288 30.184401) (xy 103.657265 30.322216) (xy 103.796259 30.49023) (xy 103.899972 30.682043)
        (xy 103.964452 30.890342) (xy 103.987997 31.114362) (xy 103.988001 31.115531) (xy 103.988 53.332561) (xy 103.965992 53.557017)
        (xy 103.902969 53.765758) (xy 103.8006 53.958287) (xy 103.662784 54.127266) (xy 103.49477 54.266259) (xy 103.302957 54.369972)
        (xy 103.094658 54.434452) (xy 102.874414 54.4576) (xy 68.583359 54.4576) (xy 68.362983 54.435992) (xy 68.154242 54.372969)
        (xy 67.961713 54.2706) (xy 67.792734 54.132784) (xy 67.653741 53.96477) (xy 67.550028 53.772957) (xy 67.485548 53.564658)
        (xy 67.462003 53.340638) (xy 67.462 53.339755) (xy 67.462 44.606828) (xy 67.628598 44.606828) (xy 67.678428 44.912306)
        (xy 67.786897 45.202193) (xy 67.949835 45.465349) (xy 68.160982 45.691661) (xy 68.412223 45.872432) (xy 68.652255 45.96247)
        (xy 68.8868 45.794558) (xy 68.8868 44.3591) (xy 69.5218 44.3591) (xy 69.5218 45.794558) (xy 69.756345 45.96247)
        (xy 69.996377 45.872432) (xy 70.247618 45.691661) (xy 70.458765 45.465349) (xy 70.621703 45.202193) (xy 70.730172 44.912306)
        (xy 70.780002 44.606828) (xy 70.545777 44.3591) (xy 69.5218 44.3591) (xy 68.8868 44.3591) (xy 67.862823 44.3591)
        (xy 67.628598 44.606828) (xy 67.462 44.606828) (xy 67.462 43.476372) (xy 67.628598 43.476372) (xy 67.862823 43.7241)
        (xy 68.8868 43.7241) (xy 68.8868 42.288642) (xy 69.5218 42.288642) (xy 69.5218 43.7241) (xy 70.545777 43.7241)
        (xy 70.780002 43.476372) (xy 70.730172 43.170894) (xy 70.621703 42.881007) (xy 70.458765 42.617851) (xy 70.247618 42.391539)
        (xy 69.996377 42.210768) (xy 69.756345 42.12073) (xy 69.5218 42.288642) (xy 68.8868 42.288642) (xy 68.652255 42.12073)
        (xy 68.412223 42.210768) (xy 68.160982 42.391539) (xy 67.949835 42.617851) (xy 67.786897 42.881007) (xy 67.678428 43.170894)
        (xy 67.628598 43.476372) (xy 67.462 43.476372) (xy 67.462 40.1066) (xy 71.362009 40.1066) (xy 71.362009 42.1386)
        (xy 71.369316 42.212791) (xy 71.390957 42.284131) (xy 71.4261 42.349878) (xy 71.473394 42.407506) (xy 71.531022 42.4548)
        (xy 71.596769 42.489943) (xy 71.668109 42.511584) (xy 71.7423 42.518891) (xy 71.871841 42.518891) (xy 71.871841 44.083277)
        (xy 71.86878 44.114354) (xy 71.880992 44.238338) (xy 71.917157 44.357557) (xy 71.975885 44.46743) (xy 72.05492 44.563735)
        (xy 72.07906 44.583546) (xy 73.347569 45.852056) (xy 73.34757 49.496006) (xy 73.344509 49.527083) (xy 73.355409 49.637746)
        (xy 73.356721 49.651067) (xy 73.392886 49.770286) (xy 73.451614 49.880159) (xy 73.530649 49.976464) (xy 73.554789 49.996275)
        (xy 74.542453 50.98394) (xy 74.562265 51.008081) (xy 74.658569 51.087115) (xy 74.65857 51.087116) (xy 74.768443 51.145844)
        (xy 74.887662 51.182009) (xy 75.011646 51.19422) (xy 75.042716 51.19116) (xy 89.56657 51.19116) (xy 89.597637 51.19422)
        (xy 89.628704 51.19116) (xy 89.628707 51.19116) (xy 89.721621 51.182009) (xy 89.84084 51.145844) (xy 89.950713 51.087116)
        (xy 90.047018 51.008081) (xy 90.066834 50.983935) (xy 92.164774 48.885996) (xy 92.188913 48.866186) (xy 92.267948 48.769881)
        (xy 92.326676 48.660008) (xy 92.348158 48.589192) (xy 92.362841 48.54079) (xy 92.375052 48.416805) (xy 92.371992 48.385735)
        (xy 92.371992 45.46346) (xy 98.662439 45.46346) (xy 98.693508 45.46652) (xy 98.724575 45.46346) (xy 98.724578 45.46346)
        (xy 98.817492 45.454309) (xy 98.936711 45.418144) (xy 99.046584 45.359416) (xy 99.142889 45.280381) (xy 99.1627 45.25624)
        (xy 99.812112 44.606828) (xy 100.758898 44.606828) (xy 100.808728 44.912306) (xy 100.917197 45.202193) (xy 101.080135 45.465349)
        (xy 101.291282 45.691661) (xy 101.542523 45.872432) (xy 101.782555 45.96247) (xy 102.0171 45.794558) (xy 102.0171 44.3591)
        (xy 102.6521 44.3591) (xy 102.6521 45.794558) (xy 102.886645 45.96247) (xy 103.126677 45.872432) (xy 103.377918 45.691661)
        (xy 103.589065 45.465349) (xy 103.752003 45.202193) (xy 103.860472 44.912306) (xy 103.910302 44.606828) (xy 103.676077 44.3591)
        (xy 102.6521 44.3591) (xy 102.0171 44.3591) (xy 100.993123 44.3591) (xy 100.758898 44.606828) (xy 99.812112 44.606828)
        (xy 100.84816 43.57078) (xy 100.993123 43.7241) (xy 102.0171 43.7241) (xy 102.0171 43.7041) (xy 102.6521 43.7041)
        (xy 102.6521 43.7241) (xy 103.676077 43.7241) (xy 103.910302 43.476372) (xy 103.860472 43.170894) (xy 103.752003 42.881007)
        (xy 103.589065 42.617851) (xy 103.377918 42.391539) (xy 103.126677 42.210768) (xy 102.886645 42.12073) (xy 102.652102 42.288641)
        (xy 102.652102 42.01958) (xy 102.399359 42.01958) (xy 102.820283 41.598656) (xy 102.844422 41.578846) (xy 102.923457 41.482541)
        (xy 102.982185 41.372668) (xy 103.01835 41.253449) (xy 103.027501 41.160535) (xy 103.027501 41.160534) (xy 103.030561 41.129465)
        (xy 103.027501 41.098395) (xy 103.027501 36.005107) (xy 103.030561 35.97404) (xy 103.022696 35.894186) (xy 103.01835 35.850057)
        (xy 102.982185 35.730838) (xy 102.923457 35.620965) (xy 102.844422 35.52466) (xy 102.820282 35.504849) (xy 100.227697 32.912265)
        (xy 100.207881 32.888119) (xy 100.111576 32.809084) (xy 100.001703 32.750356) (xy 99.882484 32.714191) (xy 99.78957 32.70504)
        (xy 99.789567 32.70504) (xy 99.7585 32.70198) (xy 99.727433 32.70504) (xy 97.734473 32.70504) (xy 96.163697 31.134265)
        (xy 96.143881 31.110119) (xy 96.047576 31.031084) (xy 95.937703 30.972356) (xy 95.818484 30.936191) (xy 95.72557 30.92704)
        (xy 95.725567 30.92704) (xy 95.6945 30.92398) (xy 95.663433 30.92704) (xy 92.654474 30.92704) (xy 92.07246 30.345028)
        (xy 92.07246 26.90427) (xy 92.07552 26.8732) (xy 92.063309 26.749216) (xy 92.027144 26.629997) (xy 91.968416 26.520124)
        (xy 91.960966 26.511046) (xy 91.889381 26.423819) (xy 91.86524 26.404007) (xy 91.794891 26.333658) (xy 91.794891 24.6888)
        (xy 91.787584 24.614609) (xy 91.765943 24.543269) (xy 91.7308 24.477522) (xy 91.683506 24.419894) (xy 91.625878 24.3726)
        (xy 91.560131 24.337457) (xy 91.488791 24.315816) (xy 91.4146 24.308509) (xy 89.8906 24.308509) (xy 89.816409 24.315816)
        (xy 89.745069 24.337457) (xy 89.679322 24.3726) (xy 89.621694 24.419894) (xy 89.5744 24.477522) (xy 89.539257 24.543269)
        (xy 89.517616 24.614609) (xy 89.510309 24.6888) (xy 89.510309 26.7208) (xy 89.517616 26.794991) (xy 89.539257 26.866331)
        (xy 89.5744 26.932078) (xy 89.621694 26.989706) (xy 89.679322 27.037) (xy 89.745069 27.072143) (xy 89.816409 27.093784)
        (xy 89.8906 27.101091) (xy 90.773458 27.101091) (xy 90.807541 27.135174) (xy 90.80754 30.575933) (xy 90.80448 30.607)
        (xy 90.80754 30.638067) (xy 90.80754 30.638069) (xy 90.816691 30.730983) (xy 90.852856 30.850202) (xy 90.911584 30.960075)
        (xy 90.990619 31.056381) (xy 91.014764 31.076197) (xy 91.625078 31.686511) (xy 90.873944 31.686511) (xy 90.11666 30.929228)
        (xy 90.11666 30.469896) (xy 90.12087 30.467646) (xy 90.294529 30.325129) (xy 90.437046 30.151471) (xy 90.542946 29.953347)
        (xy 90.608158 29.738369) (xy 90.62466 29.570824) (xy 90.62466 28.696777) (xy 90.608158 28.529232) (xy 90.542946 28.314253)
        (xy 90.437046 28.116129) (xy 90.294529 27.942471) (xy 90.120871 27.799954) (xy 89.922747 27.694054) (xy 89.707769 27.628842)
        (xy 89.4842 27.606822) (xy 89.260632 27.628842) (xy 89.045654 27.694054) (xy 88.84753 27.799954) (xy 88.77046 27.863204)
        (xy 88.77046 27.021256) (xy 88.922929 26.896129) (xy 89.065446 26.722471) (xy 89.171346 26.524347) (xy 89.236558 26.309369)
        (xy 89.25306 26.141824) (xy 89.25306 25.267777) (xy 89.236558 25.100232) (xy 89.171346 24.885253) (xy 89.065446 24.687129)
        (xy 88.922929 24.513471) (xy 88.749271 24.370954) (xy 88.60536 24.294032) (xy 88.60536 23.487966) (xy 88.60842 23.456899)
        (xy 88.60536 23.42583) (xy 88.597993 23.351028) (xy 92.376898 23.351028) (xy 92.426728 23.656506) (xy 92.535197 23.946393)
        (xy 92.698135 24.209549) (xy 92.909282 24.435861) (xy 93.160523 24.616632) (xy 93.400555 24.70667) (xy 93.6351 24.538758)
        (xy 93.6351 23.1033) (xy 92.611123 23.1033) (xy 92.376898 23.351028) (xy 88.597993 23.351028) (xy 88.596209 23.332916)
        (xy 88.560044 23.213697) (xy 88.501316 23.103824) (xy 88.422281 23.007519) (xy 88.398147 22.987713) (xy 87.631006 22.220572)
        (xy 92.376898 22.220572) (xy 92.611123 22.4683) (xy 93.6351 22.4683) (xy 93.6351 21.032842) (xy 93.400555 20.86493)
        (xy 93.160523 20.954968) (xy 92.909282 21.135739) (xy 92.698135 21.362051) (xy 92.535197 21.625207) (xy 92.426728 21.915094)
        (xy 92.376898 22.220572) (xy 87.631006 22.220572) (xy 86.702197 21.291765) (xy 86.682381 21.267619) (xy 86.586076 21.188584)
        (xy 86.476203 21.129856) (xy 86.356984 21.093691) (xy 86.26407 21.08454) (xy 86.264067 21.08454) (xy 86.233 21.08148)
        (xy 86.201933 21.08454) (xy 82.581066 21.08454) (xy 82.549999 21.08148) (xy 82.518932 21.08454) (xy 82.51893 21.08454)
        (xy 82.426016 21.093691) (xy 82.306797 21.129856) (xy 82.196924 21.188584) (xy 82.100619 21.267619) (xy 82.080812 21.291754)
        (xy 80.030155 23.342412) (xy 79.804077 23.1033) (xy 78.7801 23.1033) (xy 78.7801 24.538758) (xy 78.811401 24.561167)
        (xy 77.67976 25.692808) (xy 77.65562 25.712619) (xy 77.576585 25.808924) (xy 77.517857 25.918797) (xy 77.481692 26.038016)
        (xy 77.46948 26.162) (xy 77.472541 26.193077) (xy 77.47254 30.967326) (xy 74.61906 33.820808) (xy 74.59492 33.840619)
        (xy 74.554603 33.889746) (xy 74.515885 33.936924) (xy 74.457157 34.046797) (xy 74.420992 34.166016) (xy 74.40878 34.29)
        (xy 74.411841 34.321077) (xy 74.411841 36.443849) (xy 74.30937 36.359754) (xy 74.111246 36.253854) (xy 73.896268 36.188642)
        (xy 73.6727 36.166622) (xy 73.449131 36.188642) (xy 73.234153 36.253854) (xy 73.036029 36.359754) (xy 72.862371 36.502271)
        (xy 72.719854 36.67593) (xy 72.613954 36.874054) (xy 72.548742 37.089032) (xy 72.53224 37.256577) (xy 72.53224 38.130624)
        (xy 72.548742 38.298169) (xy 72.613954 38.513147) (xy 72.719855 38.711271) (xy 72.862372 38.884929) (xy 73.03603 39.027446)
        (xy 73.139302 39.082646) (xy 73.139302 39.726309) (xy 71.7423 39.726309) (xy 71.668109 39.733616) (xy 71.596769 39.755257)
        (xy 71.531022 39.7904) (xy 71.473394 39.837694) (xy 71.4261 39.895322) (xy 71.390957 39.961069) (xy 71.369316 40.032409)
        (xy 71.362009 40.1066) (xy 67.462 40.1066) (xy 67.462 31.122439) (xy 67.484008 30.897983) (xy 67.547031 30.689242)
        (xy 67.649401 30.496712) (xy 67.787216 30.327735) (xy 67.95523 30.188741) (xy 68.147043 30.085028) (xy 68.355342 30.020548)
        (xy 68.579362 29.997003) (xy 68.580245 29.997) (xy 75.572462 29.997) (xy 75.572728 29.996974) (xy 75.574397 29.996968)
        (xy 75.581006 29.996297) (xy 75.587642 29.996343) (xy 75.589754 29.996136) (xy 75.836257 29.970228) (xy 75.849771 29.967454)
        (xy 75.863285 29.964876) (xy 75.865317 29.964263) (xy 76.102093 29.890968) (xy 76.114785 29.885633) (xy 76.127566 29.880469)
        (xy 76.12944 29.879473) (xy 76.34747 29.761585) (xy 76.358902 29.753874) (xy 76.370419 29.746337) (xy 76.372064 29.744996)
        (xy 76.563044 29.587003) (xy 76.572789 29.577189) (xy 76.582594 29.567588) (xy 76.583947 29.565953) (xy 76.740601 29.373876)
        (xy 76.748233 29.362389) (xy 76.756009 29.351033) (xy 76.757015 29.349171) (xy 76.757018 29.349167) (xy 76.75702 29.349163)
        (xy 76.873381 29.130319) (xy 76.878632 29.117578) (xy 76.884058 29.104919) (xy 76.884685 29.102892) (xy 76.956325 28.865611)
        (xy 76.958991 28.852146) (xy 76.961866 28.838621) (xy 76.962088 28.836511) (xy 76.986275 28.589833) (xy 76.986275 28.589822)
        (xy 76.987 28.582462) (xy 76.987 23.79086) (xy 77.045197 23.946393) (xy 77.208135 24.209549) (xy 77.419282 24.435861)
        (xy 77.670523 24.616632) (xy 77.910555 24.70667) (xy 78.1451 24.538758) (xy 78.1451 23.1033) (xy 78.1251 23.1033)
        (xy 78.1251 22.4683) (xy 78.1451 22.4683) (xy 78.1451 21.032842) (xy 78.7801 21.032842) (xy 78.7801 22.4683)
        (xy 79.804077 22.4683) (xy 80.038302 22.220572) (xy 79.988472 21.915094) (xy 79.880003 21.625207) (xy 79.717065 21.362051)
        (xy 79.505918 21.135739) (xy 79.254677 20.954968) (xy 79.014645 20.86493) (xy 78.7801 21.032842) (xy 78.1451 21.032842)
        (xy 77.910555 20.86493) (xy 77.670523 20.954968) (xy 77.419282 21.135739) (xy 77.208135 21.362051) (xy 77.045197 21.625207)
        (xy 76.987 21.78074) (xy 76.987 13.53312) (xy 79.468255 13.53312) (xy 79.468255 17.97304) (xy 93.251746 17.97304)
        (xy 93.251746 13.53312) (xy 79.468255 13.53312) (xy 76.987 13.53312) (xy 76.987 13.342439) (xy 77.009008 13.117983)
        (xy 77.072031 12.909242) (xy 77.174401 12.716712) (xy 77.312216 12.547735) (xy 77.48023 12.408741) (xy 77.672043 12.305028)
        (xy 77.880342 12.240548) (xy 78.104362 12.217003) (xy 78.105245 12.217) (xy 94.353561 12.217)
      )
    )
    (filled_polygon
      (pts
        (xy 87.34044 23.718874) (xy 87.34044 24.482147) (xy 87.302272 24.513471) (xy 87.159755 24.687129) (xy 87.053854 24.885253)
        (xy 86.988642 25.100231) (xy 86.97214 25.267776) (xy 86.97214 26.141823) (xy 86.988642 26.309368) (xy 87.053854 26.524346)
        (xy 87.159754 26.72247) (xy 87.302271 26.896129) (xy 87.475929 27.038646) (xy 87.505541 27.054474) (xy 87.505541 27.204541)
        (xy 87.414905 27.16901) (xy 87.1601 27.334386) (xy 87.1601 28.8163) (xy 87.1801 28.8163) (xy 87.1801 29.4513)
        (xy 87.1601 29.4513) (xy 87.1601 30.933214) (xy 87.414905 31.09859) (xy 87.50554 31.063059) (xy 87.50554 31.845933)
        (xy 87.50248 31.877) (xy 87.50554 31.908067) (xy 87.50554 31.908069) (xy 87.514691 32.000983) (xy 87.550856 32.120202)
        (xy 87.609584 32.230075) (xy 87.688619 32.326381) (xy 87.712765 32.346197) (xy 88.870253 33.503687) (xy 88.89006 33.527822)
        (xy 88.986365 33.606857) (xy 89.096238 33.665585) (xy 89.215457 33.70175) (xy 89.308371 33.710901) (xy 89.308373 33.710901)
        (xy 89.33944 33.713961) (xy 89.370507 33.710901) (xy 94.792469 33.710901) (xy 96.431808 35.35024) (xy 96.451619 35.374381)
        (xy 96.526124 35.435525) (xy 96.547924 35.453416) (xy 96.657797 35.512144) (xy 96.777016 35.548309) (xy 96.901 35.56052)
        (xy 96.93207 35.55746) (xy 98.93592 35.55746) (xy 99.00704 35.62858) (xy 98.717098 35.62858) (xy 98.717098 35.894185)
        (xy 98.462295 35.72881) (xy 98.269401 35.804429) (xy 97.989875 35.982691) (xy 97.8154 36.149871) (xy 97.640925 35.982691)
        (xy 97.361399 35.804429) (xy 97.168505 35.72881) (xy 96.9137 35.894186) (xy 96.9137 37.3761) (xy 98.7171 37.3761)
        (xy 98.7171 37.3561) (xy 99.3521 37.3561) (xy 99.3521 37.3761) (xy 99.3721 37.3761) (xy 99.3721 38.0111)
        (xy 99.3521 38.0111) (xy 99.3521 39.493014) (xy 99.606905 39.65839) (xy 99.799799 39.582771) (xy 100.079325 39.404509)
        (xy 100.243639 39.247064) (xy 100.243639 40.238328) (xy 99.704241 40.777726) (xy 99.696923 40.499777) (xy 99.612617 40.127446)
        (xy 99.505619 39.869128) (xy 99.182193 39.77302) (xy 98.213613 40.7416) (xy 98.227755 40.755742) (xy 97.778742 41.204755)
        (xy 97.7646 41.190613) (xy 96.79602 42.159193) (xy 96.892128 42.482619) (xy 97.248548 42.619376) (xy 97.599327 42.679598)
        (xy 93.31706 42.679598) (xy 93.31706 42.458697) (xy 93.321271 42.456446) (xy 93.494929 42.313929) (xy 93.637446 42.140271)
        (xy 93.743346 41.942147) (xy 93.808558 41.727168) (xy 93.82506 41.559623) (xy 93.82506 40.685576) (xy 93.808558 40.518031)
        (xy 93.743346 40.303053) (xy 93.637446 40.104929) (xy 93.494929 39.931271) (xy 93.32127 39.788754) (xy 93.123146 39.682854)
        (xy 92.908168 39.617642) (xy 92.6846 39.595622) (xy 92.461031 39.617642) (xy 92.246053 39.682854) (xy 92.04959 39.787866)
        (xy 92.04959 38.945445) (xy 92.123329 38.884929) (xy 92.265846 38.711271) (xy 92.340721 38.57119) (xy 92.347085 38.59996)
        (xy 92.480466 38.903476) (xy 92.670497 39.175139) (xy 92.909875 39.404509) (xy 93.189401 39.582771) (xy 93.382295 39.65839)
        (xy 93.6371 39.493014) (xy 93.6371 38.0111) (xy 93.6171 38.0111) (xy 93.6171 37.3761) (xy 93.6371 37.3761)
        (xy 93.6371 35.894186) (xy 93.382295 35.72881) (xy 93.189401 35.804429) (xy 92.909875 35.982691) (xy 92.670497 36.212061)
        (xy 92.480466 36.483724) (xy 92.347085 36.78724) (xy 92.340721 36.81601) (xy 92.265846 36.675929) (xy 92.123329 36.502271)
        (xy 91.94967 36.359754) (xy 91.751546 36.253854) (xy 91.536568 36.188642) (xy 91.313 36.166622) (xy 91.089431 36.188642)
        (xy 90.874453 36.253854) (xy 90.676329 36.359754) (xy 90.502671 36.502271) (xy 90.360154 36.67593) (xy 90.254254 36.874054)
        (xy 90.189042 37.089032) (xy 90.17254 37.256577) (xy 90.17254 37.576148) (xy 90.150786 37.578291) (xy 90.031567 37.614456)
        (xy 89.921694 37.673184) (xy 89.825389 37.752219) (xy 89.805577 37.77636) (xy 88.347765 39.234173) (xy 88.323619 39.253989)
        (xy 88.244584 39.350295) (xy 88.185856 39.460168) (xy 88.149691 39.579387) (xy 88.14191 39.65839) (xy 88.13748 39.70337)
        (xy 88.14054 39.734437) (xy 88.140541 42.684837) (xy 88.099065 42.617851) (xy 87.887918 42.391539) (xy 87.636677 42.210768)
        (xy 87.396645 42.12073) (xy 87.1621 42.288642) (xy 87.1621 43.7241) (xy 88.186077 43.7241) (xy 88.3619 43.53814)
        (xy 90.347601 45.523842) (xy 90.347602 47.840247) (xy 89.524193 48.663658) (xy 89.514863 48.668645) (xy 89.418558 48.74768)
        (xy 89.398751 48.771815) (xy 89.003798 49.166769) (xy 75.588202 49.166769) (xy 75.37196 48.950527) (xy 75.37196 45.30657)
        (xy 75.37502 45.2755) (xy 75.362809 45.151516) (xy 75.326644 45.032297) (xy 75.267916 44.922424) (xy 75.256729 44.908793)
        (xy 75.188881 44.826119) (xy 75.16474 44.806307) (xy 74.965261 44.606828) (xy 83.118598 44.606828) (xy 83.168428 44.912306)
        (xy 83.276897 45.202193) (xy 83.439835 45.465349) (xy 83.650982 45.691661) (xy 83.902223 45.872432) (xy 84.142255 45.96247)
        (xy 84.3768 45.794558) (xy 84.3768 44.3591) (xy 85.0118 44.3591) (xy 85.0118 45.794558) (xy 85.246345 45.96247)
        (xy 85.486377 45.872432) (xy 85.737618 45.691661) (xy 85.76945 45.657543) (xy 85.801282 45.691661) (xy 86.052523 45.872432)
        (xy 86.292555 45.96247) (xy 86.5271 45.794558) (xy 86.5271 44.3591) (xy 87.1621 44.3591) (xy 87.1621 45.794558)
        (xy 87.396645 45.96247) (xy 87.636677 45.872432) (xy 87.887918 45.691661) (xy 88.099065 45.465349) (xy 88.262003 45.202193)
        (xy 88.370472 44.912306) (xy 88.420302 44.606828) (xy 88.186077 44.3591) (xy 87.1621 44.3591) (xy 86.5271 44.3591)
        (xy 85.0118 44.3591) (xy 84.3768 44.3591) (xy 83.352823 44.3591) (xy 83.118598 44.606828) (xy 74.965261 44.606828)
        (xy 74.404221 44.045789) (xy 74.404221 43.476372) (xy 83.118598 43.476372) (xy 83.352823 43.7241) (xy 84.3768 43.7241)
        (xy 84.3768 42.288642) (xy 85.0118 42.288642) (xy 85.0118 43.7241) (xy 86.5271 43.7241) (xy 86.5271 42.288642)
        (xy 86.292555 42.12073) (xy 86.052523 42.210768) (xy 85.801282 42.391539) (xy 85.76945 42.425657) (xy 85.737618 42.391539)
        (xy 85.486377 42.210768) (xy 85.246345 42.12073) (xy 85.0118 42.288642) (xy 84.3768 42.288642) (xy 84.142255 42.12073)
        (xy 83.902223 42.210768) (xy 83.650982 42.391539) (xy 83.439835 42.617851) (xy 83.276897 42.881007) (xy 83.168428 43.170894)
        (xy 83.118598 43.476372) (xy 74.404221 43.476372) (xy 74.404221 42.453648) (xy 74.40763 42.456446) (xy 74.605754 42.562346)
        (xy 74.820732 42.627558) (xy 75.0443 42.649578) (xy 75.267869 42.627558) (xy 75.482847 42.562346) (xy 75.680971 42.456446)
        (xy 75.854629 42.313929) (xy 75.997146 42.140271) (xy 76.103046 41.942147) (xy 76.168258 41.727168) (xy 76.18476 41.559623)
        (xy 76.18476 40.685577) (xy 76.44384 40.685577) (xy 76.44384 41.559624) (xy 76.460342 41.727169) (xy 76.525554 41.942147)
        (xy 76.631455 42.140271) (xy 76.773972 42.313929) (xy 76.94763 42.456446) (xy 77.145754 42.562346) (xy 77.360732 42.627558)
        (xy 77.5843 42.649578) (xy 77.807869 42.627558) (xy 78.022847 42.562346) (xy 78.220971 42.456446) (xy 78.394629 42.313929)
        (xy 78.521617 42.159193) (xy 79.15572 42.159193) (xy 79.251828 42.482619) (xy 79.608248 42.619376) (xy 79.984499 42.683971)
        (xy 80.366123 42.673923) (xy 80.738454 42.589617) (xy 80.996772 42.482619) (xy 81.09288 42.159193) (xy 80.1243 41.190613)
        (xy 79.15572 42.159193) (xy 78.521617 42.159193) (xy 78.537146 42.140271) (xy 78.643046 41.942147) (xy 78.708258 41.727168)
        (xy 78.710283 41.706604) (xy 79.675287 40.7416) (xy 80.573313 40.7416) (xy 81.541893 41.71018) (xy 81.865319 41.614072)
        (xy 82.002076 41.257652) (xy 82.066671 40.881401) (xy 82.056623 40.499777) (xy 81.972317 40.127446) (xy 81.865319 39.869128)
        (xy 81.541893 39.77302) (xy 80.573313 40.7416) (xy 79.675287 40.7416) (xy 78.706707 39.77302) (xy 78.383281 39.869128)
        (xy 78.367865 39.909306) (xy 78.22097 39.788754) (xy 78.21676 39.786504) (xy 78.21676 39.592987) (xy 78.383595 39.65839)
        (xy 78.6384 39.493014) (xy 78.6384 39.324007) (xy 79.15572 39.324007) (xy 79.2734 39.441687) (xy 79.2734 39.493014)
        (xy 79.419643 39.58793) (xy 80.1243 40.292587) (xy 80.776379 39.640508) (xy 80.821995 39.65839) (xy 81.0768 39.493014)
        (xy 81.0768 39.340087) (xy 81.09288 39.324007) (xy 81.0768 39.269894) (xy 81.0768 38.0111) (xy 81.7118 38.0111)
        (xy 81.7118 39.493014) (xy 81.966605 39.65839) (xy 82.159499 39.582771) (xy 82.439025 39.404509) (xy 82.678403 39.175139)
        (xy 82.868434 38.903476) (xy 83.001815 38.59996) (xy 83.07342 38.276255) (xy 82.853788 38.0111) (xy 81.7118 38.0111)
        (xy 81.0768 38.0111) (xy 79.2734 38.0111) (xy 79.2734 38.991646) (xy 79.251828 39.000581) (xy 79.15572 39.324007)
        (xy 78.6384 39.324007) (xy 78.6384 38.0111) (xy 78.6184 38.0111) (xy 78.6184 37.3761) (xy 78.6384 37.3761)
        (xy 78.6384 35.894186) (xy 79.2734 35.894186) (xy 79.2734 37.3761) (xy 81.0768 37.3761) (xy 81.0768 35.894186)
        (xy 81.7118 35.894186) (xy 81.7118 37.3761) (xy 82.853788 37.3761) (xy 83.07342 37.110945) (xy 83.001815 36.78724)
        (xy 82.868434 36.483724) (xy 82.678403 36.212061) (xy 82.439025 35.982691) (xy 82.159499 35.804429) (xy 81.966605 35.72881)
        (xy 81.7118 35.894186) (xy 81.0768 35.894186) (xy 80.821995 35.72881) (xy 80.629101 35.804429) (xy 80.349575 35.982691)
        (xy 80.1751 36.149871) (xy 80.000625 35.982691) (xy 79.721099 35.804429) (xy 79.528205 35.72881) (xy 79.2734 35.894186)
        (xy 78.6384 35.894186) (xy 78.383595 35.72881) (xy 78.21676 35.794213) (xy 78.21676 34.691672) (xy 80.308242 32.600191)
        (xy 80.332381 32.580381) (xy 80.411416 32.484076) (xy 80.470144 32.374203) (xy 80.506309 32.254984) (xy 80.51546 32.16207)
        (xy 80.51546 32.162069) (xy 80.51852 32.131) (xy 80.51546 32.09993) (xy 80.51546 30.650757) (xy 80.717875 30.844709)
        (xy 80.997401 31.022971) (xy 81.190295 31.09859) (xy 81.4451 30.933214) (xy 81.4451 29.4513) (xy 82.0801 29.4513)
        (xy 82.0801 30.933214) (xy 82.334905 31.09859) (xy 82.527799 31.022971) (xy 82.807325 30.844709) (xy 82.9818 30.677529)
        (xy 83.156275 30.844709) (xy 83.435801 31.022971) (xy 83.628695 31.09859) (xy 83.8835 30.933214) (xy 83.8835 29.4513)
        (xy 82.0801 29.4513) (xy 81.4451 29.4513) (xy 81.4251 29.4513) (xy 81.4251 28.8163) (xy 81.4451 28.8163)
        (xy 81.4451 27.503393) (xy 82.06402 27.503393) (xy 82.0801 27.557506) (xy 82.0801 28.8163) (xy 83.8835 28.8163)
        (xy 83.8835 27.835754) (xy 83.905072 27.826819) (xy 84.00118 27.503393) (xy 83.8835 27.385713) (xy 83.8835 27.334386)
        (xy 83.737257 27.23947) (xy 83.0326 26.534813) (xy 82.380521 27.186892) (xy 82.334905 27.16901) (xy 82.0801 27.334386)
        (xy 82.0801 27.487313) (xy 82.06402 27.503393) (xy 81.4451 27.503393) (xy 81.4451 27.334386) (xy 81.190295 27.16901)
        (xy 80.997401 27.244629) (xy 80.717875 27.422891) (xy 80.51546 27.616843) (xy 80.51546 26.942899) (xy 81.105901 26.352459)
        (xy 81.184583 26.699954) (xy 81.291581 26.958272) (xy 81.615007 27.05438) (xy 82.583587 26.0858) (xy 82.569445 26.071658)
        (xy 83.018458 25.622645) (xy 83.0326 25.636787) (xy 84.00118 24.668207) (xy 83.931067 24.43226) (xy 84.574028 24.43226)
        (xy 84.714026 24.572259) (xy 84.619755 24.687129) (xy 84.513854 24.885253) (xy 84.448642 25.100231) (xy 84.446616 25.120797)
        (xy 83.481613 26.0858) (xy 84.450193 27.05438) (xy 84.773619 26.958272) (xy 84.789035 26.918094) (xy 84.935929 27.038646)
        (xy 84.94014 27.040897) (xy 84.94014 27.234413) (xy 84.773305 27.16901) (xy 84.5185 27.334386) (xy 84.5185 28.8163)
        (xy 84.5385 28.8163) (xy 84.5385 29.4513) (xy 84.5185 29.4513) (xy 84.5185 30.933214) (xy 84.773305 31.09859)
        (xy 84.940141 31.033186) (xy 84.940141 33.433423) (xy 84.93708 33.4645) (xy 84.945268 33.547627) (xy 84.949292 33.588484)
        (xy 84.985457 33.707703) (xy 85.044185 33.817576) (xy 85.12322 33.913881) (xy 85.14736 33.933692) (xy 86.284507 35.07084)
        (xy 86.304319 35.094981) (xy 86.393541 35.168203) (xy 86.400624 35.174016) (xy 86.510497 35.232744) (xy 86.629716 35.268909)
        (xy 86.7537 35.28112) (xy 86.78477 35.27806) (xy 93.819628 35.27806) (xy 94.371342 35.829775) (xy 94.2721 35.894186)
        (xy 94.2721 37.3761) (xy 94.2921 37.3761) (xy 94.2921 38.0111) (xy 94.2721 38.0111) (xy 94.2721 39.493014)
        (xy 94.526905 39.65839) (xy 94.592141 39.632816) (xy 94.592141 39.786503) (xy 94.587929 39.788754) (xy 94.414271 39.931271)
        (xy 94.271754 40.10493) (xy 94.165854 40.303054) (xy 94.100642 40.518032) (xy 94.08414 40.685577) (xy 94.08414 41.559624)
        (xy 94.100642 41.727169) (xy 94.165854 41.942147) (xy 94.271755 42.140271) (xy 94.414272 42.313929) (xy 94.58793 42.456446)
        (xy 94.786054 42.562346) (xy 95.001032 42.627558) (xy 95.2246 42.649578) (xy 95.448169 42.627558) (xy 95.663147 42.562346)
        (xy 95.861271 42.456446) (xy 96.034929 42.313929) (xy 96.177446 42.140271) (xy 96.283346 41.942147) (xy 96.348558 41.727168)
        (xy 96.350583 41.706604) (xy 97.315587 40.7416) (xy 96.347007 39.77302) (xy 96.023581 39.869128) (xy 96.008165 39.909306)
        (xy 95.86127 39.788754) (xy 95.85706 39.786504) (xy 95.85706 39.592987) (xy 96.023895 39.65839) (xy 96.2787 39.493014)
        (xy 96.2787 39.324007) (xy 96.79602 39.324007) (xy 96.9137 39.441687) (xy 96.9137 39.493014) (xy 97.059943 39.58793)
        (xy 97.7646 40.292587) (xy 98.416679 39.640508) (xy 98.462295 39.65839) (xy 98.7171 39.493014) (xy 98.7171 39.340087)
        (xy 98.73318 39.324007) (xy 98.7171 39.269894) (xy 98.7171 38.0111) (xy 96.9137 38.0111) (xy 96.9137 38.991646)
        (xy 96.892128 39.000581) (xy 96.79602 39.324007) (xy 96.2787 39.324007) (xy 96.2787 38.0111) (xy 96.2587 38.0111)
        (xy 96.2587 37.3761) (xy 96.2787 37.3761) (xy 96.2787 35.894186) (xy 96.023895 35.72881) (xy 95.859668 35.793191)
        (xy 95.86012 35.788599) (xy 95.854231 35.72881) (xy 95.847909 35.664616) (xy 95.811744 35.545397) (xy 95.753016 35.435524)
        (xy 95.673981 35.339219) (xy 95.649847 35.319413) (xy 94.550797 34.220365) (xy 94.530981 34.196219) (xy 94.434676 34.117184)
        (xy 94.324803 34.058456) (xy 94.205584 34.022291) (xy 94.11267 34.01314) (xy 94.112667 34.01314) (xy 94.0816 34.01008)
        (xy 94.050533 34.01314) (xy 87.015673 34.01314) (xy 86.20506 33.202528) (xy 86.20506 31.073016) (xy 86.270295 31.09859)
        (xy 86.5251 30.933214) (xy 86.5251 29.4513) (xy 86.5051 29.4513) (xy 86.5051 28.8163) (xy 86.5251 28.8163)
        (xy 86.5251 27.334386) (xy 86.270295 27.16901) (xy 86.20506 27.194584) (xy 86.20506 27.040896) (xy 86.20927 27.038646)
        (xy 86.382929 26.896129) (xy 86.525446 26.722471) (xy 86.631346 26.524347) (xy 86.696558 26.309369) (xy 86.71306 26.141824)
        (xy 86.71306 25.267777) (xy 86.696558 25.100232) (xy 86.631346 24.885253) (xy 86.525446 24.687129) (xy 86.382929 24.513471)
        (xy 86.209271 24.370954) (xy 86.178312 24.354406) (xy 86.159744 24.293197) (xy 86.101016 24.183324) (xy 86.021981 24.087019)
        (xy 85.997841 24.067209) (xy 85.305197 23.374565) (xy 85.285381 23.350419) (xy 85.189076 23.271384) (xy 85.079203 23.212656)
        (xy 84.959984 23.176491) (xy 84.86707 23.16734) (xy 84.867067 23.16734) (xy 84.836 23.16428) (xy 84.804933 23.16734)
        (xy 82.795197 23.16734) (xy 82.764127 23.16428) (xy 82.640142 23.176491) (xy 82.520924 23.212656) (xy 82.41105 23.271384)
        (xy 82.380902 23.296126) (xy 82.314746 23.350419) (xy 82.294935 23.374559) (xy 79.45776 26.211735) (xy 79.43362 26.231546)
        (xy 79.378118 26.299176) (xy 79.354585 26.327851) (xy 79.295857 26.437724) (xy 79.259692 26.556943) (xy 79.24748 26.680927)
        (xy 79.250541 26.712004) (xy 79.25054 31.869027) (xy 77.15906 33.960508) (xy 77.13492 33.980319) (xy 77.070795 34.058456)
        (xy 77.055885 34.076624) (xy 76.997157 34.186497) (xy 76.960992 34.305716) (xy 76.94878 34.4297) (xy 76.951841 34.460777)
        (xy 76.951841 35.754384) (xy 76.886605 35.72881) (xy 76.6318 35.894186) (xy 76.6318 37.3761) (xy 76.6518 37.3761)
        (xy 76.6518 38.0111) (xy 76.6318 38.0111) (xy 76.6318 39.493014) (xy 76.886605 39.65839) (xy 76.95184 39.632816)
        (xy 76.95184 39.786503) (xy 76.947629 39.788754) (xy 76.773971 39.931271) (xy 76.631454 40.10493) (xy 76.525554 40.303054)
        (xy 76.460342 40.518032) (xy 76.44384 40.685577) (xy 76.18476 40.685577) (xy 76.18476 40.685576) (xy 76.168258 40.518031)
        (xy 76.103046 40.303053) (xy 75.997146 40.104929) (xy 75.854629 39.931271) (xy 75.68097 39.788754) (xy 75.67676 39.786504)
        (xy 75.67676 39.632816) (xy 75.741995 39.65839) (xy 75.9968 39.493014) (xy 75.9968 38.0111) (xy 75.9768 38.0111)
        (xy 75.9768 37.3761) (xy 75.9968 37.3761) (xy 75.9968 35.894186) (xy 75.741995 35.72881) (xy 75.67676 35.754384)
        (xy 75.67676 34.551972) (xy 78.530247 31.698487) (xy 78.554381 31.678681) (xy 78.633416 31.582376) (xy 78.692144 31.472503)
        (xy 78.728309 31.353284) (xy 78.73746 31.26037) (xy 78.73746 31.260368) (xy 78.74052 31.229301) (xy 78.73746 31.198234)
        (xy 78.73746 26.423972) (xy 82.811974 22.34946) (xy 85.971028 22.34946)
      )
    )
  )
)
