(kicad_symbol_lib (version 20211014) (generator kicad_symbol_editor)
  (symbol "Adafruit_ADS1X15" (pin_names (offset 1.016)) (in_bom yes) (on_board yes)
    (property "Reference" "U" (id 0) (at 0 1.27 0)
      (effects (font (size 1.27 1.27)))
    )
    (property "Value" "Adafruit_ADS1X15" (id 1) (at 0 -2.54 0)
      (effects (font (size 1.27 1.27)))
    )
    (property "Footprint" "CO2Mofetten:Adafruit_ADS1X15_PinSocket" (id 2) (at 0 1.27 0)
      (effects (font (size 1.27 1.27)) hide)
    )
    (property "Datasheet" "" (id 3) (at 0 1.27 0)
      (effects (font (size 1.27 1.27)) hide)
    )
    (symbol "Adafruit_ADS1X15_0_1"
      (rectangle (start -7.62 8.89) (end 7.62 -7.62)
        (stroke (width 0) (type default) (color 0 0 0 0))
        (fill (type background))
      )
    )
    (symbol "Adafruit_ADS1X15_1_1"
      (pin input line (at -2.54 -10.16 90) (length 2.54)
        (name "A0" (effects (font (size 1.27 1.27))))
        (number "A0" (effects (font (size 1.27 1.27))))
      )
      (pin input line (at 0 -10.16 90) (length 2.54)
        (name "A1" (effects (font (size 1.27 1.27))))
        (number "A1" (effects (font (size 1.27 1.27))))
      )
      (pin input line (at 2.54 -10.16 90) (length 2.54)
        (name "A2" (effects (font (size 1.27 1.27))))
        (number "A2" (effects (font (size 1.27 1.27))))
      )
      (pin input line (at 5.08 -10.16 90) (length 2.54)
        (name "A3" (effects (font (size 1.27 1.27))))
        (number "A3" (effects (font (size 1.27 1.27))))
      )
      (pin passive line (at -10.16 -1.27 0) (length 2.54)
        (name "ADDR" (effects (font (size 1.27 1.27))))
        (number "ADDR" (effects (font (size 1.27 1.27))))
      )
      (pin output line (at 10.16 1.27 180) (length 2.54)
        (name "ALRT" (effects (font (size 1.27 1.27))))
        (number "ALRT" (effects (font (size 1.27 1.27))))
      )
      (pin power_out line (at -1.27 11.43 270) (length 2.54)
        (name "GND" (effects (font (size 1.27 1.27))))
        (number "GND" (effects (font (size 1.27 1.27))))
      )
      (pin input line (at -10.16 3.81 0) (length 2.54)
        (name "SCL" (effects (font (size 1.27 1.27))))
        (number "SCL" (effects (font (size 1.27 1.27))))
      )
      (pin bidirectional line (at -10.16 1.27 0) (length 2.54)
        (name "SDA" (effects (font (size 1.27 1.27))))
        (number "SDA" (effects (font (size 1.27 1.27))))
      )
      (pin power_in line (at 1.27 11.43 270) (length 2.54)
        (name "Vdd" (effects (font (size 1.27 1.27))))
        (number "Vdd" (effects (font (size 1.27 1.27))))
      )
    )
  )
  (symbol "Adafruit_DS3231" (pin_names (offset 1.016)) (in_bom yes) (on_board yes)
    (property "Reference" "U" (id 0) (at 0 11.43 0)
      (effects (font (size 1.27 1.27)))
    )
    (property "Value" "Adafruit_DS3231" (id 1) (at 0 -15.24 0)
      (effects (font (size 1.27 1.27)))
    )
    (property "Footprint" "CO2Mofetten:Adafruit_DS3231_PinSocket" (id 2) (at 0 11.43 0)
      (effects (font (size 1.27 1.27)) hide)
    )
    (property "Datasheet" "https://learn.adafruit.com/adafruit-ds3231-precision-rtc-breakout/overview" (id 3) (at 0 11.43 0)
      (effects (font (size 1.27 1.27)) hide)
    )
    (property "ki_keywords" "RTC" (id 4) (at 0 0 0)
      (effects (font (size 1.27 1.27)) hide)
    )
    (property "ki_description" "Extremely Accurate I²C-Integrated RTC/TCXO/Crystal (Breakout)" (id 5) (at 0 0 0)
      (effects (font (size 1.27 1.27)) hide)
    )
    (symbol "Adafruit_DS3231_0_1"
      (rectangle (start -6.35 10.16) (end 7.62 -12.7)
        (stroke (width 0) (type default) (color 0 0 0 0))
        (fill (type background))
      )
    )
    (symbol "Adafruit_DS3231_1_1"
      (pin power_in line (at -8.89 7.62 0) (length 2.54)
        (name "Vin" (effects (font (size 1.27 1.27))))
        (number "1" (effects (font (size 1.27 1.27))))
      )
      (pin power_in line (at -8.89 5.08 0) (length 2.54)
        (name "GND" (effects (font (size 1.27 1.27))))
        (number "2" (effects (font (size 1.27 1.27))))
      )
      (pin input line (at -8.89 2.54 0) (length 2.54)
        (name "SCL" (effects (font (size 1.27 1.27))))
        (number "3" (effects (font (size 1.27 1.27))))
      )
      (pin bidirectional line (at -8.89 0 0) (length 2.54)
        (name "SDA" (effects (font (size 1.27 1.27))))
        (number "4" (effects (font (size 1.27 1.27))))
      )
      (pin power_out line (at -8.89 -2.54 0) (length 2.54)
        (name "BAT" (effects (font (size 1.27 1.27))))
        (number "5" (effects (font (size 1.27 1.27))))
      )
      (pin output line (at -8.89 -5.08 0) (length 2.54)
        (name "32K" (effects (font (size 1.27 1.27))))
        (number "6" (effects (font (size 1.27 1.27))))
      )
      (pin unspecified line (at -8.89 -7.62 0) (length 2.54)
        (name "SQW" (effects (font (size 1.27 1.27))))
        (number "7" (effects (font (size 1.27 1.27))))
      )
      (pin input line (at -8.89 -10.16 0) (length 2.54)
        (name "RST" (effects (font (size 1.27 1.27))))
        (number "8" (effects (font (size 1.27 1.27))))
      )
    )
  )
  (symbol "Adafruit_MicroSD" (pin_names (offset 1.016)) (in_bom yes) (on_board yes)
    (property "Reference" "U" (id 0) (at 0 17.78 0)
      (effects (font (size 1.27 1.27)))
    )
    (property "Value" "Adafruit_MicroSD" (id 1) (at 0 -7.62 0)
      (effects (font (size 1.27 1.27)))
    )
    (property "Footprint" "" (id 2) (at 0 17.78 0)
      (effects (font (size 1.27 1.27)) hide)
    )
    (property "Datasheet" "" (id 3) (at 0 17.78 0)
      (effects (font (size 1.27 1.27)) hide)
    )
    (symbol "Adafruit_MicroSD_0_1"
      (rectangle (start -7.62 16.51) (end 8.89 -6.35)
        (stroke (width 0) (type default) (color 0 0 0 0))
        (fill (type background))
      )
    )
    (symbol "Adafruit_MicroSD_1_1"
      (pin power_out line (at -10.16 -1.27 0) (length 2.54)
        (name "3V" (effects (font (size 1.27 1.27))))
        (number "3v" (effects (font (size 1.27 1.27))))
      )
      (pin power_in line (at -10.16 -3.81 0) (length 2.54)
        (name "5V" (effects (font (size 1.27 1.27))))
        (number "5v" (effects (font (size 1.27 1.27))))
      )
      (pin output line (at -10.16 13.97 0) (length 2.54)
        (name "CD" (effects (font (size 1.27 1.27))))
        (number "CD" (effects (font (size 1.27 1.27))))
      )
      (pin input line (at -10.16 3.81 0) (length 2.54)
        (name "SCK" (effects (font (size 1.27 1.27))))
        (number "CLK" (effects (font (size 1.27 1.27))))
      )
      (pin input line (at -10.16 11.43 0) (length 2.54)
        (name "CS" (effects (font (size 1.27 1.27))))
        (number "CS" (effects (font (size 1.27 1.27))))
      )
      (pin input line (at -10.16 8.89 0) (length 2.54)
        (name "SDI" (effects (font (size 1.27 1.27))))
        (number "DI" (effects (font (size 1.27 1.27))))
      )
      (pin output line (at -10.16 6.35 0) (length 2.54)
        (name "SDO" (effects (font (size 1.27 1.27))))
        (number "DO" (effects (font (size 1.27 1.27))))
      )
      (pin power_in line (at -10.16 1.27 0) (length 2.54)
        (name "GND" (effects (font (size 1.27 1.27))))
        (number "GND" (effects (font (size 1.27 1.27))))
      )
    )
  )
  (symbol "Adafruit_TCA9548A" (pin_names (offset 1.016)) (in_bom yes) (on_board yes)
    (property "Reference" "U" (id 0) (at 0 15.24 0)
      (effects (font (size 1.27 1.27)))
    )
    (property "Value" "Adafruit_TCA9548A" (id 1) (at 0 -20.32 0)
      (effects (font (size 1.27 1.27)))
    )
    (property "Footprint" "" (id 2) (at 0 15.24 0)
      (effects (font (size 1.27 1.27)) hide)
    )
    (property "Datasheet" "https://cdn-shop.adafruit.com/datasheets/tca9548a.pdf" (id 3) (at 0 15.24 0)
      (effects (font (size 1.27 1.27)) hide)
    )
    (property "URL" "https://learn.adafruit.com/adafruit-tca9548a-1-to-8-i2c-multiplexer-breakout/overview" (id 4) (at 1.27 -22.86 0)
      (effects (font (size 1.27 1.27)) hide)
    )
    (property "ki_keywords" "Adafruit,I2C,multiplexer,breakout" (id 5) (at 0 0 0)
      (effects (font (size 1.27 1.27)) hide)
    )
    (property "ki_description" "Adafruit TCA9548A 1-to-8 I2C Multiplexer Breakout" (id 6) (at 0 0 0)
      (effects (font (size 1.27 1.27)) hide)
    )
    (symbol "Adafruit_TCA9548A_0_1"
      (rectangle (start -7.62 13.97) (end 7.62 -19.05)
        (stroke (width 0) (type default) (color 0 0 0 0))
        (fill (type background))
      )
    )
    (symbol "Adafruit_TCA9548A_1_1"
      (pin input line (at -10.16 -1.27 0) (length 2.54)
        (name "A0" (effects (font (size 1.27 1.27))))
        (number "A0" (effects (font (size 1.27 1.27))))
      )
      (pin input line (at -10.16 -3.81 0) (length 2.54)
        (name "A1" (effects (font (size 1.27 1.27))))
        (number "A1" (effects (font (size 1.27 1.27))))
      )
      (pin input line (at -10.16 -6.35 0) (length 2.54)
        (name "A2" (effects (font (size 1.27 1.27))))
        (number "A2" (effects (font (size 1.27 1.27))))
      )
      (pin power_in line (at -10.16 8.89 0) (length 2.54)
        (name "GND" (effects (font (size 1.27 1.27))))
        (number "GND" (effects (font (size 1.27 1.27))))
      )
      (pin input line (at -10.16 1.27 0) (length 2.54)
        (name "RST" (effects (font (size 1.27 1.27))))
        (number "RST" (effects (font (size 1.27 1.27))))
      )
      (pin output line (at -10.16 -11.43 0) (length 2.54)
        (name "SC0" (effects (font (size 1.27 1.27))))
        (number "SC0" (effects (font (size 1.27 1.27))))
      )
      (pin output line (at -10.16 -16.51 0) (length 2.54)
        (name "SC1" (effects (font (size 1.27 1.27))))
        (number "SC1" (effects (font (size 1.27 1.27))))
      )
      (pin output line (at 10.16 -13.97 180) (length 2.54)
        (name "SC2" (effects (font (size 1.27 1.27))))
        (number "SC2" (effects (font (size 1.27 1.27))))
      )
      (pin output line (at 10.16 -8.89 180) (length 2.54)
        (name "SC3" (effects (font (size 1.27 1.27))))
        (number "SC3" (effects (font (size 1.27 1.27))))
      )
      (pin output line (at 10.16 -3.81 180) (length 2.54)
        (name "SC4" (effects (font (size 1.27 1.27))))
        (number "SC4" (effects (font (size 1.27 1.27))))
      )
      (pin output line (at 10.16 1.27 180) (length 2.54)
        (name "SC5" (effects (font (size 1.27 1.27))))
        (number "SC5" (effects (font (size 1.27 1.27))))
      )
      (pin output line (at 10.16 6.35 180) (length 2.54)
        (name "SC6" (effects (font (size 1.27 1.27))))
        (number "SC6" (effects (font (size 1.27 1.27))))
      )
      (pin output line (at 10.16 11.43 180) (length 2.54)
        (name "SC7" (effects (font (size 1.27 1.27))))
        (number "SC7" (effects (font (size 1.27 1.27))))
      )
      (pin input line (at -10.16 3.81 0) (length 2.54)
        (name "SCL" (effects (font (size 1.27 1.27))))
        (number "SCL" (effects (font (size 1.27 1.27))))
      )
      (pin bidirectional line (at -10.16 -8.89 0) (length 2.54)
        (name "SD0" (effects (font (size 1.27 1.27))))
        (number "SD0" (effects (font (size 1.27 1.27))))
      )
      (pin bidirectional line (at -10.16 -13.97 0) (length 2.54)
        (name "SD1" (effects (font (size 1.27 1.27))))
        (number "SD1" (effects (font (size 1.27 1.27))))
      )
      (pin bidirectional line (at 10.16 -16.51 180) (length 2.54)
        (name "SD2" (effects (font (size 1.27 1.27))))
        (number "SD2" (effects (font (size 1.27 1.27))))
      )
      (pin bidirectional line (at 10.16 -11.43 180) (length 2.54)
        (name "SD3" (effects (font (size 1.27 1.27))))
        (number "SD3" (effects (font (size 1.27 1.27))))
      )
      (pin bidirectional line (at 10.16 -6.35 180) (length 2.54)
        (name "SD4" (effects (font (size 1.27 1.27))))
        (number "SD4" (effects (font (size 1.27 1.27))))
      )
      (pin bidirectional line (at 10.16 -1.27 180) (length 2.54)
        (name "SD5" (effects (font (size 1.27 1.27))))
        (number "SD5" (effects (font (size 1.27 1.27))))
      )
      (pin bidirectional line (at 10.16 3.81 180) (length 2.54)
        (name "SD6" (effects (font (size 1.27 1.27))))
        (number "SD6" (effects (font (size 1.27 1.27))))
      )
      (pin bidirectional line (at 10.16 8.89 180) (length 2.54)
        (name "SD7" (effects (font (size 1.27 1.27))))
        (number "SD7" (effects (font (size 1.27 1.27))))
      )
      (pin bidirectional line (at -10.16 6.35 0) (length 2.54)
        (name "SDA" (effects (font (size 1.27 1.27))))
        (number "SDA" (effects (font (size 1.27 1.27))))
      )
      (pin power_in line (at -10.16 11.43 0) (length 2.54)
        (name "Vin" (effects (font (size 1.27 1.27))))
        (number "VIN" (effects (font (size 1.27 1.27))))
      )
    )
  )
  (symbol "Bosch_BME280_I2C" (pin_names (offset 1.016)) (in_bom yes) (on_board yes)
    (property "Reference" "U" (id 0) (at 0 8.89 0)
      (effects (font (size 1.27 1.27)))
    )
    (property "Value" "Bosch_BME280_I2C" (id 1) (at 0 -6.35 0)
      (effects (font (size 1.27 1.27)))
    )
    (property "Footprint" "CO2Mofetten:gy-bme280" (id 2) (at 0 11.43 0)
      (effects (font (size 1.27 1.27)) hide)
    )
    (property "Datasheet" "" (id 3) (at 0 8.89 0)
      (effects (font (size 1.27 1.27)) hide)
    )
    (property "ki_keywords" "Bosch BME280 Temperature Humidity Pressure" (id 4) (at 0 0 0)
      (effects (font (size 1.27 1.27)) hide)
    )
    (property "ki_description" "Bosch BME280 Environmental Sensor" (id 5) (at 0 0 0)
      (effects (font (size 1.27 1.27)) hide)
    )
    (symbol "Bosch_BME280_I2C_0_1"
      (polyline
        (pts
          (xy -3.81 7.62)
          (xy -3.81 -5.08)
          (xy 5.08 -5.08)
          (xy 5.08 7.62)
          (xy -3.81 7.62)
        )
        (stroke (width 0) (type default) (color 0 0 0 0))
        (fill (type background))
      )
    )
    (symbol "Bosch_BME280_I2C_1_1"
      (pin power_in line (at -6.35 5.08 0) (length 2.54)
        (name "Vin" (effects (font (size 1.27 1.27))))
        (number "1" (effects (font (size 1.27 1.27))))
      )
      (pin power_out line (at -6.35 2.54 0) (length 2.54)
        (name "GND" (effects (font (size 1.27 1.27))))
        (number "2" (effects (font (size 1.27 1.27))))
      )
      (pin input line (at -6.35 0 0) (length 2.54)
        (name "SCL" (effects (font (size 1.27 1.27))))
        (number "3" (effects (font (size 1.27 1.27))))
      )
      (pin bidirectional line (at -6.35 -2.54 0) (length 2.54)
        (name "SDA" (effects (font (size 1.27 1.27))))
        (number "4" (effects (font (size 1.27 1.27))))
      )
    )
  )
  (symbol "Bosch_BME280_I2C+SPI" (pin_names (offset 1.016)) (in_bom yes) (on_board yes)
    (property "Reference" "U" (id 0) (at 0 8.89 0)
      (effects (font (size 1.27 1.27)))
    )
    (property "Value" "Bosch_BME280_I2C+SPI" (id 1) (at -1.27 -6.35 0)
      (effects (font (size 1.27 1.27)))
    )
    (property "Footprint" "CO2Mofetten:Adafruit_BME280_PinSocket" (id 2) (at 1.27 20.32 0)
      (effects (font (size 1.27 1.27)) hide)
    )
    (property "Datasheet" "" (id 3) (at 0 8.89 0)
      (effects (font (size 1.27 1.27)) hide)
    )
    (property "ki_keywords" "Bosch BME280 Temperature Humidity Pressure" (id 4) (at 0 0 0)
      (effects (font (size 1.27 1.27)) hide)
    )
    (property "ki_description" "Bosch BME280 Environmental Sensor" (id 5) (at 0 0 0)
      (effects (font (size 1.27 1.27)) hide)
    )
    (symbol "Bosch_BME280_I2C+SPI_0_1"
      (polyline
        (pts
          (xy -3.81 7.62)
          (xy -3.81 -5.08)
          (xy 3.81 -5.08)
          (xy 3.81 7.62)
          (xy -3.81 7.62)
        )
        (stroke (width 0) (type default) (color 0 0 0 0))
        (fill (type background))
      )
    )
    (symbol "Bosch_BME280_I2C+SPI_1_1"
      (pin power_out line (at -6.35 -1.27 0) (length 2.54)
        (name "3Vo" (effects (font (size 1.27 1.27))))
        (number "3Vo" (effects (font (size 1.27 1.27))))
      )
      (pin input line (at 6.35 0 180) (length 2.54)
        (name "CS" (effects (font (size 1.27 1.27))))
        (number "CS" (effects (font (size 1.27 1.27))))
      )
      (pin power_out line (at -6.35 1.27 0) (length 2.54)
        (name "GND" (effects (font (size 1.27 1.27))))
        (number "GND" (effects (font (size 1.27 1.27))))
      )
      (pin input line (at 6.35 -2.54 180) (length 2.54)
        (name "SCK" (effects (font (size 1.27 1.27))))
        (number "SCK" (effects (font (size 1.27 1.27))))
      )
      (pin bidirectional line (at 6.35 2.54 180) (length 2.54)
        (name "SDI" (effects (font (size 1.27 1.27))))
        (number "SDI" (effects (font (size 1.27 1.27))))
      )
      (pin bidirectional line (at 6.35 5.08 180) (length 2.54)
        (name "SDO" (effects (font (size 1.27 1.27))))
        (number "SDO" (effects (font (size 1.27 1.27))))
      )
      (pin power_in line (at -6.35 3.81 0) (length 2.54)
        (name "Vin" (effects (font (size 1.27 1.27))))
        (number "Vin" (effects (font (size 1.27 1.27))))
      )
    )
  )
  (symbol "Cubic_CM1106" (pin_names (offset 1.016)) (in_bom yes) (on_board yes)
    (property "Reference" "U" (id 0) (at 0 21.59 0)
      (effects (font (size 1.27 1.27)))
    )
    (property "Value" "Cubic_CM1106" (id 1) (at 0 -7.62 0)
      (effects (font (size 1.27 1.27)))
    )
    (property "Footprint" "CO2Mofetten:Cubic_CM1106" (id 2) (at 0 21.59 0)
      (effects (font (size 1.27 1.27)) hide)
    )
    (property "Datasheet" "" (id 3) (at 0 21.59 0)
      (effects (font (size 1.27 1.27)) hide)
    )
    (property "ki_keywords" "co2" (id 4) (at 0 0 0)
      (effects (font (size 1.27 1.27)) hide)
    )
    (property "ki_description" "CUBIC CM1106 co2 sensor" (id 5) (at 0 0 0)
      (effects (font (size 1.27 1.27)) hide)
    )
    (symbol "Cubic_CM1106_0_1"
      (rectangle (start -7.62 7.62) (end 7.62 -6.35)
        (stroke (width 0) (type default) (color 0 0 0 0))
        (fill (type background))
      )
    )
    (symbol "Cubic_CM1106_1_0"
      (pin input line (at 10.16 -3.81 180) (length 2.54)
        (name "CALIB" (effects (font (size 1.27 1.27))))
        (number "CALIB" (effects (font (size 1.27 1.27))))
      )
    )
    (symbol "Cubic_CM1106_1_1"
      (pin power_out line (at -2.54 10.16 270) (length 2.54)
        (name "3.3Vo" (effects (font (size 1.27 1.27))))
        (number "3.3Vo" (effects (font (size 1.27 1.27))))
      )
      (pin output line (at 10.16 1.27 180) (length 2.54)
        (name "Alarm" (effects (font (size 1.27 1.27))))
        (number "ALARM" (effects (font (size 1.27 1.27))))
      )
      (pin power_in line (at 0 10.16 270) (length 2.54)
        (name "GND" (effects (font (size 1.27 1.27))))
        (number "GND" (effects (font (size 1.27 1.27))))
      )
      (pin output line (at 10.16 -1.27 180) (length 2.54)
        (name "PWM" (effects (font (size 1.27 1.27))))
        (number "PWM" (effects (font (size 1.27 1.27))))
      )
      (pin bidirectional line (at -10.16 1.27 0) (length 2.54)
        (name "RX/SDA" (effects (font (size 1.27 1.27))))
        (number "RX/SDA" (effects (font (size 1.27 1.27))))
      )
      (pin input line (at -10.16 -3.81 0) (length 2.54)
        (name "SELECT" (effects (font (size 1.27 1.27))))
        (number "SELECT" (effects (font (size 1.27 1.27))))
      )
      (pin input line (at -10.16 -1.27 0) (length 2.54)
        (name "TX/SCL" (effects (font (size 1.27 1.27))))
        (number "TX/SCL" (effects (font (size 1.27 1.27))))
      )
      (pin power_in line (at 2.54 10.16 270) (length 2.54)
        (name "Vcc" (effects (font (size 1.27 1.27))))
        (number "Vcc" (effects (font (size 1.27 1.27))))
      )
    )
  )
  (symbol "GSS_ExplorIR_M_CO2" (pin_names (offset 1.016)) (in_bom yes) (on_board yes)
    (property "Reference" "U" (id 0) (at 0 11.43 0)
      (effects (font (size 1.27 1.27)))
    )
    (property "Value" "GSS_ExplorIR_M_CO2" (id 1) (at 0 -7.62 0)
      (effects (font (size 1.27 1.27)))
    )
    (property "Footprint" "CO2Mofetten:GSS_ExplorIR_M_CO2_PinSocket" (id 2) (at 0 11.43 0)
      (effects (font (size 1.27 1.27)) hide)
    )
    (property "Datasheet" "" (id 3) (at 0 11.43 0)
      (effects (font (size 1.27 1.27)) hide)
    )
    (symbol "GSS_ExplorIR_M_CO2_0_1"
      (rectangle (start -1.27 8.89) (end 10.16 -6.35)
        (stroke (width 0) (type default) (color 0 0 0 0))
        (fill (type background))
      )
    )
    (symbol "GSS_ExplorIR_M_CO2_1_1"
      (pin input line (at -3.81 7.62 0) (length 2.54)
        (name "RX-IN" (effects (font (size 1.27 1.27))))
        (number "1" (effects (font (size 1.27 1.27))))
      )
      (pin output line (at -3.81 3.81 0) (length 2.54)
        (name "TX-OUT" (effects (font (size 1.27 1.27))))
        (number "2" (effects (font (size 1.27 1.27))))
      )
      (pin input line (at -3.81 0 0) (length 2.54)
        (name "0V" (effects (font (size 1.27 1.27))))
        (number "3" (effects (font (size 1.27 1.27))))
      )
      (pin input line (at -3.81 -3.81 0) (length 2.54)
        (name "V+" (effects (font (size 1.27 1.27))))
        (number "4" (effects (font (size 1.27 1.27))))
      )
    )
  )
  (symbol "HallSensor" (pin_names (offset 1.016)) (in_bom yes) (on_board yes)
    (property "Reference" "U" (id 0) (at 0 10.16 0)
      (effects (font (size 1.27 1.27)))
    )
    (property "Value" "HallSensor" (id 1) (at 0 -5.08 0)
      (effects (font (size 1.27 1.27)))
    )
    (property "Footprint" "Connector_PinSocket_2.54mm:PinSocket_1x04_P2.54mm_Horizontal" (id 2) (at 0 10.16 0)
      (effects (font (size 1.27 1.27)) hide)
    )
    (property "Datasheet" "" (id 3) (at 0 10.16 0)
      (effects (font (size 1.27 1.27)) hide)
    )
    (symbol "HallSensor_0_1"
      (rectangle (start 0 8.89) (end 7.62 -3.81)
        (stroke (width 0) (type default) (color 0 0 0 0))
        (fill (type background))
      )
    )
    (symbol "HallSensor_1_1"
      (pin power_in line (at -2.54 -1.27 0) (length 2.54)
        (name "D0" (effects (font (size 1.27 1.27))))
        (number "1" (effects (font (size 1.27 1.27))))
      )
      (pin power_in line (at -2.54 1.27 0) (length 2.54)
        (name "+" (effects (font (size 1.27 1.27))))
        (number "2" (effects (font (size 1.27 1.27))))
      )
      (pin power_out line (at -2.54 3.81 0) (length 2.54)
        (name "GND" (effects (font (size 1.27 1.27))))
        (number "3" (effects (font (size 1.27 1.27))))
      )
      (pin output line (at -2.54 6.35 0) (length 2.54)
        (name "A0" (effects (font (size 1.27 1.27))))
        (number "4" (effects (font (size 1.27 1.27))))
      )
    )
  )
  (symbol "LogicLevelTranslator_4Channel" (pin_names (offset 1.016)) (in_bom yes) (on_board yes)
    (property "Reference" "U" (id 0) (at 0 17.78 0)
      (effects (font (size 1.27 1.27)))
    )
    (property "Value" "LogicLevelTranslator_4Channel" (id 1) (at 0 -11.43 0)
      (effects (font (size 1.27 1.27)))
    )
    (property "Footprint" "CO2Mofetten:LevelTranslator_4Channel_KeeYees_Breakout" (id 2) (at 0 17.78 0)
      (effects (font (size 1.27 1.27)) hide)
    )
    (property "Datasheet" "" (id 3) (at 0 17.78 0)
      (effects (font (size 1.27 1.27)) hide)
    )
    (property "Amazon" "https://www.amazon.de/gp/product/B07LG6RK7L/ref=ppx_yo_dt_b_asin_title_o00_s00?ie=UTF8&psc=1" (id 4) (at 0 0 0)
      (effects (font (size 1.27 1.27)) hide)
    )
    (property "ki_description" "4 channel bidirectional logic level converter" (id 5) (at 0 0 0)
      (effects (font (size 1.27 1.27)) hide)
    )
    (symbol "LogicLevelTranslator_4Channel_0_1"
      (rectangle (start -6.35 5.08) (end 6.35 -10.16)
        (stroke (width 0) (type default) (color 0 0 0 0))
        (fill (type background))
      )
    )
    (symbol "LogicLevelTranslator_4Channel_1_1"
      (pin power_in line (at -3.81 7.62 270) (length 2.54)
        (name "GND" (effects (font (size 1.27 1.27))))
        (number "GNDh" (effects (font (size 1.27 1.27))))
      )
      (pin power_in line (at -1.27 7.62 270) (length 2.54)
        (name "GND" (effects (font (size 1.27 1.27))))
        (number "GNDl" (effects (font (size 1.27 1.27))))
      )
      (pin power_in line (at 3.81 7.62 270) (length 2.54)
        (name "HV" (effects (font (size 1.27 1.27))))
        (number "HV" (effects (font (size 1.27 1.27))))
      )
      (pin bidirectional line (at 8.89 -1.27 180) (length 2.54)
        (name "HV1" (effects (font (size 1.27 1.27))))
        (number "HV1" (effects (font (size 1.27 1.27))))
      )
      (pin bidirectional line (at 8.89 -3.81 180) (length 2.54)
        (name "HV2" (effects (font (size 1.27 1.27))))
        (number "HV2" (effects (font (size 1.27 1.27))))
      )
      (pin bidirectional line (at 8.89 -6.35 180) (length 2.54)
        (name "HV3" (effects (font (size 1.27 1.27))))
        (number "HV3" (effects (font (size 1.27 1.27))))
      )
      (pin bidirectional line (at 8.89 -8.89 180) (length 2.54)
        (name "HV4" (effects (font (size 1.27 1.27))))
        (number "HV4" (effects (font (size 1.27 1.27))))
      )
      (pin power_in line (at 1.27 7.62 270) (length 2.54)
        (name "LV" (effects (font (size 1.27 1.27))))
        (number "LV" (effects (font (size 1.27 1.27))))
      )
      (pin bidirectional line (at -8.89 -1.27 0) (length 2.54)
        (name "LV1" (effects (font (size 1.27 1.27))))
        (number "LV1" (effects (font (size 1.27 1.27))))
      )
      (pin bidirectional line (at -8.89 -3.81 0) (length 2.54)
        (name "LV2" (effects (font (size 1.27 1.27))))
        (number "LV2" (effects (font (size 1.27 1.27))))
      )
      (pin bidirectional line (at -8.89 -6.35 0) (length 2.54)
        (name "LV3" (effects (font (size 1.27 1.27))))
        (number "LV3" (effects (font (size 1.27 1.27))))
      )
      (pin bidirectional line (at -8.89 -8.89 0) (length 2.54)
        (name "LV4" (effects (font (size 1.27 1.27))))
        (number "LV4" (effects (font (size 1.27 1.27))))
      )
    )
  )
  (symbol "RJ45SensorCableConnector" (pin_names (offset 1.016)) (in_bom yes) (on_board yes)
    (property "Reference" "J" (id 0) (at -5.08 13.97 0)
      (effects (font (size 1.27 1.27)) (justify right))
    )
    (property "Value" "RJ45SensorCableConnector" (id 1) (at 2.54 13.97 0)
      (effects (font (size 1.27 1.27)) (justify left))
    )
    (property "Footprint" "CO2Mofetten:RJ45_econ_MEB8.8PG_Horizontal" (id 2) (at 0 0.635 90)
      (effects (font (size 1.27 1.27)) hide)
    )
    (property "Datasheet" "~" (id 3) (at 0 0.635 90)
      (effects (font (size 1.27 1.27)) hide)
    )
    (property "ki_keywords" "8P8C RJ female connector" (id 4) (at 0 0 0)
      (effects (font (size 1.27 1.27)) hide)
    )
    (property "ki_description" "RJ connector, 8P8C (8 positions 8 connected), RJ31/RJ32/RJ33/RJ34/RJ35/RJ41/RJ45/RJ49/RJ61" (id 5) (at 0 0 0)
      (effects (font (size 1.27 1.27)) hide)
    )
    (property "ki_fp_filters" "RJ45*" (id 6) (at 0 0 0)
      (effects (font (size 1.27 1.27)) hide)
    )
    (symbol "RJ45SensorCableConnector_0_1"
      (polyline
        (pts
          (xy -5.08 4.445)
          (xy -6.35 4.445)
        )
        (stroke (width 0) (type default) (color 0 0 0 0))
        (fill (type none))
      )
      (polyline
        (pts
          (xy -5.08 5.715)
          (xy -6.35 5.715)
        )
        (stroke (width 0) (type default) (color 0 0 0 0))
        (fill (type none))
      )
      (polyline
        (pts
          (xy -6.35 -3.175)
          (xy -5.08 -3.175)
          (xy -5.08 -3.175)
        )
        (stroke (width 0) (type default) (color 0 0 0 0))
        (fill (type none))
      )
      (polyline
        (pts
          (xy -6.35 -1.905)
          (xy -5.08 -1.905)
          (xy -5.08 -1.905)
        )
        (stroke (width 0) (type default) (color 0 0 0 0))
        (fill (type none))
      )
      (polyline
        (pts
          (xy -6.35 -0.635)
          (xy -5.08 -0.635)
          (xy -5.08 -0.635)
        )
        (stroke (width 0) (type default) (color 0 0 0 0))
        (fill (type none))
      )
      (polyline
        (pts
          (xy -6.35 0.635)
          (xy -5.08 0.635)
          (xy -5.08 0.635)
        )
        (stroke (width 0) (type default) (color 0 0 0 0))
        (fill (type none))
      )
      (polyline
        (pts
          (xy -6.35 1.905)
          (xy -5.08 1.905)
          (xy -5.08 1.905)
        )
        (stroke (width 0) (type default) (color 0 0 0 0))
        (fill (type none))
      )
      (polyline
        (pts
          (xy -5.08 3.175)
          (xy -6.35 3.175)
          (xy -6.35 3.175)
        )
        (stroke (width 0) (type default) (color 0 0 0 0))
        (fill (type none))
      )
      (polyline
        (pts
          (xy -6.35 -4.445)
          (xy -6.35 6.985)
          (xy 3.81 6.985)
          (xy 3.81 4.445)
          (xy 5.08 4.445)
          (xy 5.08 3.175)
          (xy 6.35 3.175)
          (xy 6.35 -0.635)
          (xy 5.08 -0.635)
          (xy 5.08 -1.905)
          (xy 3.81 -1.905)
          (xy 3.81 -4.445)
          (xy -6.35 -4.445)
          (xy -6.35 -4.445)
        )
        (stroke (width 0) (type default) (color 0 0 0 0))
        (fill (type none))
      )
      (rectangle (start 7.62 12.7) (end -7.62 -10.16)
        (stroke (width 0.254) (type default) (color 0 0 0 0))
        (fill (type background))
      )
    )
    (symbol "RJ45SensorCableConnector_1_1"
      (pin power_in line (at 10.16 -7.62 180) (length 2.54)
        (name "5V" (effects (font (size 1.27 1.27))))
        (number "1" (effects (font (size 1.27 1.27))))
      )
      (pin power_in line (at 10.16 -5.08 180) (length 2.54)
        (name "3.3V" (effects (font (size 1.27 1.27))))
        (number "2" (effects (font (size 1.27 1.27))))
      )
      (pin bidirectional line (at 10.16 -2.54 180) (length 2.54)
        (name "SDA" (effects (font (size 1.27 1.27))))
        (number "3" (effects (font (size 1.27 1.27))))
      )
      (pin passive line (at 10.16 0 180) (length 2.54)
        (name "GND" (effects (font (size 1.27 1.27))))
        (number "4" (effects (font (size 1.27 1.27))))
      )
      (pin bidirectional line (at 10.16 2.54 180) (length 2.54)
        (name "SCL" (effects (font (size 1.27 1.27))))
        (number "5" (effects (font (size 1.27 1.27))))
      )
      (pin passive line (at 10.16 5.08 180) (length 2.54)
        (name "GND" (effects (font (size 1.27 1.27))))
        (number "6" (effects (font (size 1.27 1.27))))
      )
      (pin passive line (at 10.16 7.62 180) (length 2.54)
        (name "GND" (effects (font (size 1.27 1.27))))
        (number "7" (effects (font (size 1.27 1.27))))
      )
      (pin passive line (at 10.16 10.16 180) (length 2.54)
        (name "GND" (effects (font (size 1.27 1.27))))
        (number "8" (effects (font (size 1.27 1.27))))
      )
      (pin passive line (at -2.54 -12.7 90) (length 2.54)
        (name "Fl" (effects (font (size 1.27 1.27))))
        (number "Fl" (effects (font (size 1.27 1.27))))
      )
      (pin passive line (at 2.54 -12.7 90) (length 2.54)
        (name "Fr" (effects (font (size 1.27 1.27))))
        (number "Fr" (effects (font (size 1.27 1.27))))
      )
      (pin passive line (at -5.08 -12.7 90) (length 2.54)
        (name "Hl" (effects (font (size 1.27 1.27))))
        (number "Hl" (effects (font (size 1.27 1.27))))
      )
      (pin passive line (at 5.08 -12.7 90) (length 2.54)
        (name "Hr" (effects (font (size 1.27 1.27))))
        (number "Hr" (effects (font (size 1.27 1.27))))
      )
    )
  )
  (symbol "RJ45Stc31EvalulationKitSocket" (pin_names (offset 1.016)) (in_bom yes) (on_board yes)
    (property "Reference" "J" (id 0) (at -5.08 13.97 0)
      (effects (font (size 1.27 1.27)) (justify right))
    )
    (property "Value" "RJ45Stc31EvalulationKitSocket" (id 1) (at 2.54 13.97 0)
      (effects (font (size 1.27 1.27)) (justify left))
    )
    (property "Footprint" "CO2Mofetten:RJ45_econ_MEB8.8PG_Horizontal" (id 2) (at 0 0.635 90)
      (effects (font (size 1.27 1.27)) hide)
    )
    (property "Datasheet" "~" (id 3) (at 0 0.635 90)
      (effects (font (size 1.27 1.27)) hide)
    )
    (property "ki_keywords" "8P8C RJ female connector" (id 4) (at 0 0 0)
      (effects (font (size 1.27 1.27)) hide)
    )
    (property "ki_description" "RJ connector, 8P8C (8 positions 8 connected), RJ31/RJ32/RJ33/RJ34/RJ35/RJ41/RJ45/RJ49/RJ61" (id 5) (at 0 0 0)
      (effects (font (size 1.27 1.27)) hide)
    )
    (property "ki_fp_filters" "RJ45*" (id 6) (at 0 0 0)
      (effects (font (size 1.27 1.27)) hide)
    )
    (symbol "RJ45Stc31EvalulationKitSocket_0_1"
      (polyline
        (pts
          (xy -5.08 4.445)
          (xy -6.35 4.445)
        )
        (stroke (width 0) (type default) (color 0 0 0 0))
        (fill (type none))
      )
      (polyline
        (pts
          (xy -5.08 5.715)
          (xy -6.35 5.715)
        )
        (stroke (width 0) (type default) (color 0 0 0 0))
        (fill (type none))
      )
      (polyline
        (pts
          (xy -6.35 -3.175)
          (xy -5.08 -3.175)
          (xy -5.08 -3.175)
        )
        (stroke (width 0) (type default) (color 0 0 0 0))
        (fill (type none))
      )
      (polyline
        (pts
          (xy -6.35 -1.905)
          (xy -5.08 -1.905)
          (xy -5.08 -1.905)
        )
        (stroke (width 0) (type default) (color 0 0 0 0))
        (fill (type none))
      )
      (polyline
        (pts
          (xy -6.35 -0.635)
          (xy -5.08 -0.635)
          (xy -5.08 -0.635)
        )
        (stroke (width 0) (type default) (color 0 0 0 0))
        (fill (type none))
      )
      (polyline
        (pts
          (xy -6.35 0.635)
          (xy -5.08 0.635)
          (xy -5.08 0.635)
        )
        (stroke (width 0) (type default) (color 0 0 0 0))
        (fill (type none))
      )
      (polyline
        (pts
          (xy -6.35 1.905)
          (xy -5.08 1.905)
          (xy -5.08 1.905)
        )
        (stroke (width 0) (type default) (color 0 0 0 0))
        (fill (type none))
      )
      (polyline
        (pts
          (xy -5.08 3.175)
          (xy -6.35 3.175)
          (xy -6.35 3.175)
        )
        (stroke (width 0) (type default) (color 0 0 0 0))
        (fill (type none))
      )
      (polyline
        (pts
          (xy -6.35 -4.445)
          (xy -6.35 6.985)
          (xy 3.81 6.985)
          (xy 3.81 4.445)
          (xy 5.08 4.445)
          (xy 5.08 3.175)
          (xy 6.35 3.175)
          (xy 6.35 -0.635)
          (xy 5.08 -0.635)
          (xy 5.08 -1.905)
          (xy 3.81 -1.905)
          (xy 3.81 -4.445)
          (xy -6.35 -4.445)
          (xy -6.35 -4.445)
        )
        (stroke (width 0) (type default) (color 0 0 0 0))
        (fill (type none))
      )
      (rectangle (start 7.62 12.7) (end -7.62 -10.16)
        (stroke (width 0.254) (type default) (color 0 0 0 0))
        (fill (type background))
      )
    )
    (symbol "RJ45Stc31EvalulationKitSocket_1_1"
      (pin passive line (at 10.16 -7.62 180) (length 2.54)
        (name "GND" (effects (font (size 1.27 1.27))))
        (number "1" (effects (font (size 1.27 1.27))))
      )
      (pin no_connect line (at 10.16 -5.08 180) (length 2.54)
        (name "" (effects (font (size 1.27 1.27))))
        (number "2" (effects (font (size 1.27 1.27))))
      )
      (pin input line (at 10.16 -2.54 180) (length 2.54)
        (name "SCL" (effects (font (size 1.27 1.27))))
        (number "3" (effects (font (size 1.27 1.27))))
      )
      (pin no_connect line (at 10.16 0 180) (length 2.54)
        (name "" (effects (font (size 1.27 1.27))))
        (number "4" (effects (font (size 1.27 1.27))))
      )
      (pin power_in line (at 10.16 2.54 180) (length 2.54)
        (name "VCC" (effects (font (size 1.27 1.27))))
        (number "5" (effects (font (size 1.27 1.27))))
      )
      (pin no_connect line (at 10.16 5.08 180) (length 2.54)
        (name "" (effects (font (size 1.27 1.27))))
        (number "6" (effects (font (size 1.27 1.27))))
      )
      (pin bidirectional line (at 10.16 7.62 180) (length 2.54)
        (name "SDA" (effects (font (size 1.27 1.27))))
        (number "7" (effects (font (size 1.27 1.27))))
      )
      (pin no_connect line (at 10.16 10.16 180) (length 2.54)
        (name "" (effects (font (size 1.27 1.27))))
        (number "8" (effects (font (size 1.27 1.27))))
      )
      (pin passive line (at -2.54 -12.7 90) (length 2.54)
        (name "Fl" (effects (font (size 1.27 1.27))))
        (number "Fl" (effects (font (size 1.27 1.27))))
      )
      (pin passive line (at 2.54 -12.7 90) (length 2.54)
        (name "Fr" (effects (font (size 1.27 1.27))))
        (number "Fr" (effects (font (size 1.27 1.27))))
      )
      (pin passive line (at -5.08 -12.7 90) (length 2.54)
        (name "Hl" (effects (font (size 1.27 1.27))))
        (number "Hl" (effects (font (size 1.27 1.27))))
      )
      (pin passive line (at 5.08 -12.7 90) (length 2.54)
        (name "Hr" (effects (font (size 1.27 1.27))))
        (number "Hr" (effects (font (size 1.27 1.27))))
      )
    )
  )
  (symbol "Sensirion_SCD30" (pin_names (offset 1.016)) (in_bom yes) (on_board yes)
    (property "Reference" "U" (id 0) (at 0 10.16 0)
      (effects (font (size 1.27 1.27)))
    )
    (property "Value" "Sensirion_SCD30" (id 1) (at 0 -10.16 0)
      (effects (font (size 1.27 1.27)))
    )
    (property "Footprint" "" (id 2) (at 0 10.16 0)
      (effects (font (size 1.27 1.27)) hide)
    )
    (property "Datasheet" "https://www.sensirion.com/fileadmin/user_upload/customers/sensirion/Dokumente/0_Datasheets/CO2/Sensirion_CO2_Sensors_SCD30_Datasheet.pdf" (id 3) (at 0 10.16 0)
      (effects (font (size 1.27 1.27)) hide)
    )
    (property "ki_keywords" "CO2, humidity, temperature, I2C" (id 4) (at 0 0 0)
      (effects (font (size 1.27 1.27)) hide)
    )
    (property "ki_description" "CO2, humidity, and temperature sensor" (id 5) (at 0 0 0)
      (effects (font (size 1.27 1.27)) hide)
    )
    (symbol "Sensirion_SCD30_0_1"
      (polyline
        (pts
          (xy -6.35 8.89)
          (xy -6.35 -8.89)
          (xy 6.35 -8.89)
          (xy 6.35 8.89)
          (xy -6.35 8.89)
        )
        (stroke (width 0) (type default) (color 0 0 0 0))
        (fill (type background))
      )
    )
    (symbol "Sensirion_SCD30_1_1"
      (pin power_in line (at -8.89 7.62 0) (length 2.54)
        (name "VDD" (effects (font (size 1.27 1.27))))
        (number "1" (effects (font (size 1.27 1.27))))
      )
      (pin power_in line (at -8.89 5.08 0) (length 2.54)
        (name "GND" (effects (font (size 1.27 1.27))))
        (number "2" (effects (font (size 1.27 1.27))))
      )
      (pin bidirectional line (at -8.89 2.54 0) (length 2.54)
        (name "TX/SCL" (effects (font (size 1.27 1.27))))
        (number "3" (effects (font (size 1.27 1.27))))
      )
      (pin bidirectional line (at -8.89 0 0) (length 2.54)
        (name "RX/SDA" (effects (font (size 1.27 1.27))))
        (number "4" (effects (font (size 1.27 1.27))))
      )
      (pin output line (at -8.89 -2.54 0) (length 2.54)
        (name "RDY" (effects (font (size 1.27 1.27))))
        (number "5" (effects (font (size 1.27 1.27))))
      )
      (pin output line (at -8.89 -5.08 0) (length 2.54)
        (name "PWM" (effects (font (size 1.27 1.27))))
        (number "6" (effects (font (size 1.27 1.27))))
      )
      (pin input line (at -8.89 -7.62 0) (length 2.54)
        (name "SEL" (effects (font (size 1.27 1.27))))
        (number "7" (effects (font (size 1.27 1.27))))
      )
    )
  )
  (symbol "Sensirion_STC31" (in_bom yes) (on_board yes)
    (property "Reference" "U" (id 0) (at 0 26.67 0)
      (effects (font (size 1.27 1.27)))
    )
    (property "Value" "Sensirion_STC31" (id 1) (at 0 -26.67 0)
      (effects (font (size 1.27 1.27)))
    )
    (property "Footprint" "CO2Mofetten:Sensirion_STC3x" (id 2) (at 0 -3.81 0)
      (effects (font (size 1.27 1.27)) hide)
    )
    (property "Datasheet" "" (id 3) (at 0 -3.81 0)
      (effects (font (size 1.27 1.27)) hide)
    )
    (symbol "Sensirion_STC31_0_1"
      (rectangle (start -11.43 12.7) (end 11.43 -12.7)
        (stroke (width 0) (type default) (color 0 0 0 0))
        (fill (type background))
      )
      (rectangle (start 3.81 -12.7) (end 3.81 -12.7)
        (stroke (width 0) (type default) (color 0 0 0 0))
        (fill (type none))
      )
    )
    (symbol "Sensirion_STC31_1_1"
      (pin passive line (at 13.97 3.81 180) (length 2.54)
        (name "VSS" (effects (font (size 1.27 1.27))))
        (number "1" (effects (font (size 1.27 1.27))))
      )
      (pin no_connect line (at -5.08 15.24 270) (length 2.54)
        (name "Reserved" (effects (font (size 1.27 1.27))))
        (number "10" (effects (font (size 1.27 1.27))))
      )
      (pin passive line (at 0 15.24 270) (length 2.54)
        (name "VSS" (effects (font (size 1.27 1.27))))
        (number "11" (effects (font (size 1.27 1.27))))
      )
      (pin no_connect line (at 5.08 15.24 270) (length 2.54)
        (name "Reserved" (effects (font (size 1.27 1.27))))
        (number "12" (effects (font (size 1.27 1.27))))
      )
      (pin passive line (at 10.16 15.24 270) (length 2.54)
        (name "Die" (effects (font (size 1.27 1.27))))
        (number "13" (effects (font (size 1.27 1.27))))
      )
      (pin no_connect line (at 13.97 0 180) (length 2.54)
        (name "Reserved" (effects (font (size 1.27 1.27))))
        (number "2" (effects (font (size 1.27 1.27))))
      )
      (pin input line (at 13.97 -3.81 180) (length 2.54)
        (name "ADDR" (effects (font (size 1.27 1.27))))
        (number "3" (effects (font (size 1.27 1.27))))
      )
      (pin input line (at 5.08 -15.24 90) (length 2.54)
        (name "SCL" (effects (font (size 1.27 1.27))))
        (number "4" (effects (font (size 1.27 1.27))))
      )
      (pin passive line (at 0 -15.24 90) (length 2.54)
        (name "VSS" (effects (font (size 1.27 1.27))))
        (number "5" (effects (font (size 1.27 1.27))))
      )
      (pin power_in line (at -5.08 -15.24 90) (length 2.54)
        (name "VDD" (effects (font (size 1.27 1.27))))
        (number "6" (effects (font (size 1.27 1.27))))
      )
      (pin bidirectional line (at -13.97 -3.81 0) (length 2.54)
        (name "SDA" (effects (font (size 1.27 1.27))))
        (number "7" (effects (font (size 1.27 1.27))))
      )
      (pin no_connect line (at -13.97 0 0) (length 2.54)
        (name "Reserved" (effects (font (size 1.27 1.27))))
        (number "8" (effects (font (size 1.27 1.27))))
      )
      (pin passive line (at -13.97 3.81 0) (length 2.54)
        (name "VSS" (effects (font (size 1.27 1.27))))
        (number "9" (effects (font (size 1.27 1.27))))
      )
    )
  )
  (symbol "Sparkfun_MircoSD" (pin_names (offset 1.016)) (in_bom yes) (on_board yes)
    (property "Reference" "U" (id 0) (at 0 10.16 0)
      (effects (font (size 1.27 1.27)))
    )
    (property "Value" "Sparkfun_MircoSD" (id 1) (at 0 -10.16 0)
      (effects (font (size 1.27 1.27)))
    )
    (property "Footprint" "CO2Mofetten:SparkFun_MicroSD_PinSocket" (id 2) (at 0 10.16 0)
      (effects (font (size 1.27 1.27)) hide)
    )
    (property "Datasheet" "" (id 3) (at 0 10.16 0)
      (effects (font (size 1.27 1.27)) hide)
    )
    (symbol "Sparkfun_MircoSD_0_1"
      (rectangle (start 5.08 8.89) (end -5.08 -8.89)
        (stroke (width 0) (type default) (color 0 0 0 0))
        (fill (type background))
      )
    )
    (symbol "Sparkfun_MircoSD_1_1"
      (pin output line (at 7.62 7.62 180) (length 2.54)
        (name "CD" (effects (font (size 1.27 1.27))))
        (number "CD" (effects (font (size 1.27 1.27))))
      )
      (pin input line (at 7.62 -7.62 180) (length 2.54)
        (name "CS" (effects (font (size 1.27 1.27))))
        (number "CS" (effects (font (size 1.27 1.27))))
      )
      (pin input line (at 7.62 -5.08 180) (length 2.54)
        (name "DI" (effects (font (size 1.27 1.27))))
        (number "DI" (effects (font (size 1.27 1.27))))
      )
      (pin output line (at 7.62 5.08 180) (length 2.54)
        (name "DO" (effects (font (size 1.27 1.27))))
        (number "DO" (effects (font (size 1.27 1.27))))
      )
      (pin power_in line (at 7.62 2.54 180) (length 2.54)
        (name "GND" (effects (font (size 1.27 1.27))))
        (number "GND" (effects (font (size 1.27 1.27))))
      )
      (pin input line (at 7.62 0 180) (length 2.54)
        (name "SCK" (effects (font (size 1.27 1.27))))
        (number "SCK" (effects (font (size 1.27 1.27))))
      )
      (pin power_in line (at 7.62 -2.54 180) (length 2.54)
        (name "VCC" (effects (font (size 1.27 1.27))))
        (number "VCC" (effects (font (size 1.27 1.27))))
      )
    )
  )
  (symbol "Theben_CO2" (pin_names (offset 1.016)) (in_bom yes) (on_board yes)
    (property "Reference" "U" (id 0) (at 0 12.7 0)
      (effects (font (size 1.27 1.27)))
    )
    (property "Value" "Theben_CO2" (id 1) (at 0 -15.24 0)
      (effects (font (size 1.27 1.27)))
    )
    (property "Footprint" "CO2Mofetten:Theben_CO2" (id 2) (at -7.62 0 0)
      (effects (font (size 1.27 1.27)) hide)
    )
    (property "Datasheet" "" (id 3) (at -7.62 0 0)
      (effects (font (size 1.27 1.27)) hide)
    )
    (symbol "Theben_CO2_0_1"
      (rectangle (start -7.62 10.16) (end 7.62 -12.7)
        (stroke (width 0) (type default) (color 0 0 0 0))
        (fill (type background))
      )
    )
    (symbol "Theben_CO2_1_1"
      (pin power_in line (at -10.16 7.62 0) (length 2.54)
        (name "GND" (effects (font (size 1.27 1.27))))
        (number "GND" (effects (font (size 1.27 1.27))))
      )
      (pin output line (at -10.16 2.54 0) (length 2.54)
        (name "PWM1_CO2" (effects (font (size 1.27 1.27))))
        (number "PWM1_CO2" (effects (font (size 1.27 1.27))))
      )
      (pin output line (at -10.16 0 0) (length 2.54)
        (name "PWM2_Temp" (effects (font (size 1.27 1.27))))
        (number "PWM2_Temp" (effects (font (size 1.27 1.27))))
      )
      (pin input line (at -10.16 -7.62 0) (length 2.54)
        (name "RX" (effects (font (size 1.27 1.27))))
        (number "RX" (effects (font (size 1.27 1.27))))
      )
      (pin input line (at -10.16 -5.08 0) (length 2.54)
        (name "SCL" (effects (font (size 1.27 1.27))))
        (number "SCL" (effects (font (size 1.27 1.27))))
      )
      (pin bidirectional line (at -10.16 -2.54 0) (length 2.54)
        (name "SDA" (effects (font (size 1.27 1.27))))
        (number "SDA" (effects (font (size 1.27 1.27))))
      )
      (pin output line (at -10.16 -10.16 0) (length 2.54)
        (name "TX" (effects (font (size 1.27 1.27))))
        (number "TX" (effects (font (size 1.27 1.27))))
      )
      (pin power_in line (at -10.16 5.08 0) (length 2.54)
        (name "Vcc" (effects (font (size 1.27 1.27))))
        (number "Vcc" (effects (font (size 1.27 1.27))))
      )
    )
  )
)
