EESchema Schematic File Version 4
EELAYER 30 0
EELAYER END
$Descr A4 11693 8268
encoding utf-8
Sheet 1 1
Title ""
Date ""
Rev "v1.0.0"
Comp ""
Comment1 ""
Comment2 ""
Comment3 ""
Comment4 ""
$EndDescr
$Comp
L CO2Mofetten:HallSensor U1
U 1 1 5F3D1CEA
P 5700 3550
F 0 "U1" H 6028 3696 50  0000 L CNN
F 1 "HallSensor" H 6028 3605 50  0000 L CNN
F 2 "Connector_PinSocket_2.54mm:PinSocket_1x04_P2.54mm_Horizontal" H 5700 3950 50  0001 C CNN
F 3 "" H 5700 3950 50  0001 C CNN
	1    5700 3550
	1    0    0    -1  
$EndComp
$Comp
L CO2Mofetten:RJ45SensorCableConnector J1
U 1 1 5F3D277F
P 4100 3450
F 0 "J1" H 4157 4117 50  0000 C CNN
F 1 "RJ45SensorCableConnector" H 4157 4026 50  0000 C CNN
F 2 "CO2Mofetten:RJ45_econ_MEB8.8PG_Horizontal" V 4100 3475 50  0001 C CNN
F 3 "~" V 4100 3475 50  0001 C CNN
	1    4100 3450
	1    0    0    -1  
$EndComp
$Comp
L power:GND #PWR0101
U 1 1 5F3D320C
P 5250 4550
F 0 "#PWR0101" H 5250 4300 50  0001 C CNN
F 1 "GND" H 5255 4377 50  0000 C CNN
F 2 "" H 5250 4550 50  0001 C CNN
F 3 "" H 5250 4550 50  0001 C CNN
	1    5250 4550
	1    0    0    -1  
$EndComp
$Comp
L power:+5V #PWR0102
U 1 1 5F3D34EE
P 5350 2200
F 0 "#PWR0102" H 5350 2050 50  0001 C CNN
F 1 "+5V" H 5365 2373 50  0000 C CNN
F 2 "" H 5350 2200 50  0001 C CNN
F 3 "" H 5350 2200 50  0001 C CNN
	1    5350 2200
	1    0    0    -1  
$EndComp
$Comp
L power:+3V3 #PWR0103
U 1 1 5F3D3817
P 5100 2450
F 0 "#PWR0103" H 5100 2300 50  0001 C CNN
F 1 "+3V3" H 5115 2623 50  0000 C CNN
F 2 "" H 5100 2450 50  0001 C CNN
F 3 "" H 5100 2450 50  0001 C CNN
	1    5100 2450
	1    0    0    -1  
$EndComp
Wire Wire Line
	5600 3500 5100 3500
Wire Wire Line
	5100 3500 5100 2450
Wire Wire Line
	5350 2200 5350 3750
Wire Wire Line
	5350 3750 4500 3750
Wire Wire Line
	5100 3500 5100 3650
Wire Wire Line
	5100 3650 4500 3650
Connection ~ 5100 3500
Wire Wire Line
	4500 3450 4600 3450
Wire Wire Line
	4600 3450 4600 3400
Wire Wire Line
	4600 3050 4500 3050
Wire Wire Line
	4500 3050 4500 3150
Connection ~ 4500 3050
Connection ~ 4500 3150
Wire Wire Line
	4500 3150 4500 3250
Wire Wire Line
	3900 3950 4000 3950
Connection ~ 4000 3950
Wire Wire Line
	4000 3950 4200 3950
Connection ~ 4200 3950
Wire Wire Line
	4200 3950 4300 3950
Wire Wire Line
	4300 3950 4600 3950
Wire Wire Line
	4600 3950 4600 3450
Connection ~ 4300 3950
Connection ~ 4600 3450
NoConn ~ 4500 3350
Wire Wire Line
	4500 3550 5200 3550
Wire Wire Line
	5200 3550 5200 3600
Wire Wire Line
	5200 3600 5600 3600
NoConn ~ 5600 3300
Wire Wire Line
	5600 3400 5250 3400
Connection ~ 4600 3400
Wire Wire Line
	4600 3400 4600 3050
Wire Wire Line
	5250 4550 5250 3400
Connection ~ 5250 3400
Wire Wire Line
	5250 3400 4600 3400
$EndSCHEMATC
