(kicad_pcb (version 20171130) (host pcbnew "(5.1.5)-3")

  (general
    (thickness 1.6)
    (drawings 7)
    (tracks 32)
    (zones 0)
    (modules 2)
    (nets 6)
  )

  (page A4)
  (title_block
    (rev v1.0.1)
  )

  (layers
    (0 F.Cu signal)
    (31 B.Cu signal)
    (32 B.Adhes user)
    (33 F.Adhes user)
    (34 B.Paste user)
    (35 F.Paste user)
    (36 B.SilkS user)
    (37 F.SilkS user)
    (38 B.Mask user)
    (39 F.Mask user)
    (40 Dwgs.User user)
    (41 Cmts.User user)
    (42 Eco1.User user)
    (43 Eco2.User user)
    (44 Edge.Cuts user)
    (45 Margin user)
    (46 B.CrtYd user)
    (47 F.CrtYd user)
    (48 B.Fab user)
    (49 F.Fab user)
  )

  (setup
    (last_trace_width 0.508)
    (trace_clearance 0.79502)
    (zone_clearance 0.79502)
    (zone_45_only no)
    (trace_min 0.2)
    (via_size 0.8)
    (via_drill 0.4)
    (via_min_size 0.4)
    (via_min_drill 0.3)
    (uvia_size 0.3)
    (uvia_drill 0.1)
    (uvias_allowed no)
    (uvia_min_size 0.2)
    (uvia_min_drill 0.1)
    (edge_width 0.05)
    (segment_width 0.2)
    (pcb_text_width 0.3)
    (pcb_text_size 1.5 1.5)
    (mod_edge_width 0.12)
    (mod_text_size 1 1)
    (mod_text_width 0.15)
    (pad_size 1.524 1.524)
    (pad_drill 0.79502)
    (pad_to_mask_clearance 0.05)
    (aux_axis_origin 0 0)
    (visible_elements 7FFFFFFF)
    (pcbplotparams
      (layerselection 0x01000_ffffffff)
      (usegerberextensions false)
      (usegerberattributes true)
      (usegerberadvancedattributes true)
      (creategerberjobfile true)
      (excludeedgelayer true)
      (linewidth 0.100000)
      (plotframeref false)
      (viasonmask false)
      (mode 1)
      (useauxorigin false)
      (hpglpennumber 1)
      (hpglpenspeed 20)
      (hpglpendiameter 15.000000)
      (psnegative false)
      (psa4output false)
      (plotreference true)
      (plotvalue true)
      (plotinvisibletext false)
      (padsonsilk false)
      (subtractmaskfromsilk false)
      (outputformat 1)
      (mirror false)
      (drillshape 0)
      (scaleselection 1)
      (outputdirectory "plot/"))
  )

  (net 0 "")
  (net 1 +5V)
  (net 2 GND)
  (net 3 "Net-(J1-Pad5)")
  (net 4 "Net-(J1-Pad3)")
  (net 5 +3V3)

  (net_class Default "This is the default net class."
    (clearance 0.79502)
    (trace_width 0.508)
    (via_dia 0.8)
    (via_drill 0.4)
    (uvia_dia 0.3)
    (uvia_drill 0.1)
    (add_net +3V3)
    (add_net +5V)
    (add_net GND)
    (add_net "Net-(J1-Pad3)")
    (add_net "Net-(J1-Pad5)")
  )

  (module CO2Mofetten:GSS_ExplorIR_M_CO2_PinSocket (layer F.Cu) (tedit 5F48DBD9) (tstamp 5F3D4C78)
    (at 162.8902 99.13112)
    (path /5F3CF0A4)
    (fp_text reference U1 (at 0 -2) (layer F.SilkS)
      (effects (font (size 1 1) (thickness 0.15)))
    )
    (fp_text value GSS_ExplorIR_M_CO2 (at 0 3) (layer F.Fab)
      (effects (font (size 1 1) (thickness 0.15)))
    )
    (fp_circle (center -7 0) (end -17.05 0) (layer F.SilkS) (width 0.12))
    (fp_circle (center -7 0) (end -17.45 0) (layer F.CrtYd) (width 0.12))
    (fp_line (start -1 -2) (end -1 0) (layer F.SilkS) (width 0.12))
    (fp_line (start 1 -2) (end 1 0) (layer F.SilkS) (width 0.12))
    (fp_circle (center -12 0.5) (end -13 0.5) (layer F.SilkS) (width 0.12))
    (fp_circle (center -12 5.5) (end -13 5.5) (layer F.SilkS) (width 0.12))
    (fp_circle (center -7 -7) (end -8 -7) (layer F.SilkS) (width 0.12))
    (fp_circle (center -7 7) (end -8 7) (layer F.SilkS) (width 0.12))
    (fp_arc (start 0 0) (end 1 0) (angle 180) (layer F.SilkS) (width 0.12))
    (fp_arc (start 0 -2) (end -1 -2) (angle 180) (layer F.SilkS) (width 0.12))
    (pad 4 thru_hole oval (at -12 5.5) (size 2.54 1.524) (drill 0.79502) (layers *.Mask B.Cu)
      (net 1 +5V))
    (pad 3 thru_hole oval (at -12 0.5) (size 2.54 1.524) (drill 0.79502) (layers *.Mask B.Cu)
      (net 2 GND))
    (pad 2 thru_hole oval (at 0 -2) (size 2.54 1.524) (drill 0.79502 (offset 0 -0.254)) (layers *.Mask B.Cu)
      (net 3 "Net-(J1-Pad5)"))
    (pad 1 thru_hole oval (at 0 0) (size 2.54 1.524) (drill 0.79502 (offset 0 0.254)) (layers *.Mask B.Cu)
      (net 4 "Net-(J1-Pad3)"))
    (model ${KISYS3DMOD}/Connector_PinSocket_2.00mm.3dshapes/PinSocket_1x02_P2.00mm_Vertical.step
      (offset (xyz 0 2 0))
      (scale (xyz 1 1 1))
      (rotate (xyz 0 0 0))
    )
    (model ${KISYS3DMOD}/Connector_PinSocket_2.00mm.3dshapes/PinSocket_1x01_P2.00mm_Vertical.step
      (offset (xyz -12 -0.5 0))
      (scale (xyz 1 1 1))
      (rotate (xyz 0 0 0))
    )
    (model ${KISYS3DMOD}/Connector_PinSocket_2.00mm.3dshapes/PinSocket_1x01_P2.00mm_Vertical.step
      (offset (xyz -12 -5.5 0))
      (scale (xyz 1 1 1))
      (rotate (xyz 0 0 0))
    )
    (model ${KISYS3DMOD}/Inductor_THT.3dshapes/L_Radial_D21.0mm_P19.00mm.step
      (offset (xyz -16.5 0 5.6))
      (scale (xyz 1 1 1))
      (rotate (xyz 0 0 0))
    )
  )

  (module CO2Mofetten:RJ45_econ_MEB8.8PG_Horizontal (layer F.Cu) (tedit 5F48DFA5) (tstamp 5F3D6A4E)
    (at 160.5381 72.5217 180)
    (descr "Modular-Einbaubuchse Buchse, Einbau horizontal MEB8/8PG Metall econ connect MEB8/8PG 1 St. (https://asset.conrad.com/media10/add/160267/c1/-/en/001303852DS01/datenblatt-1303852-modular-einbaubuchse-buchse-einbau-horizontal-meb88pg-metall-econ-connect-meb88pg-1-st.pdf)")
    (tags RJ45)
    (path /5F3D0991)
    (fp_text reference J1 (at 4.445 -5) (layer F.SilkS)
      (effects (font (size 1 1) (thickness 0.15)))
    )
    (fp_text value RJ45SensorCableConnector (at 4.445 4) (layer F.Fab)
      (effects (font (size 1 1) (thickness 0.15)))
    )
    (fp_line (start 12.6 14.47) (end -3.71 14.47) (layer F.CrtYd) (width 0.05))
    (fp_line (start 12.6 14.47) (end 12.6 -4.27) (layer F.CrtYd) (width 0.05))
    (fp_line (start -3.71 -4.27) (end -3.71 14.47) (layer F.CrtYd) (width 0.05))
    (fp_line (start -3.71 -4.27) (end 12.6 -4.27) (layer F.CrtYd) (width 0.05))
    (fp_line (start -3.315 -3.88) (end -3.315 14.08) (layer F.SilkS) (width 0.12))
    (fp_line (start 12.205 -3.88) (end -3.315 -3.88) (layer F.SilkS) (width 0.12))
    (fp_line (start 12.205 -3.88) (end 12.205 14.08) (layer F.SilkS) (width 0.12))
    (fp_line (start -3.315 14.08) (end 12.205 14.08) (layer F.SilkS) (width 0.12))
    (fp_line (start -3.205 -2.77) (end -2.205 -3.77) (layer F.Fab) (width 0.12))
    (fp_line (start -2.205 -3.77) (end 12.095 -3.77) (layer F.Fab) (width 0.12))
    (fp_line (start 12.095 -3.77) (end 12.095 13.97) (layer F.Fab) (width 0.12))
    (fp_line (start 12.095 13.97) (end -3.205 13.97) (layer F.Fab) (width 0.12))
    (fp_line (start -3.205 13.97) (end -3.205 -2.77) (layer F.Fab) (width 0.12))
    (fp_line (start -3.5 0) (end -4 -0.5) (layer F.SilkS) (width 0.12))
    (fp_line (start -4 -0.5) (end -4 0.5) (layer F.SilkS) (width 0.12))
    (fp_line (start -4 0.5) (end -3.5 0) (layer F.SilkS) (width 0.12))
    (fp_text user %R (at 4.445 2) (layer F.Fab)
      (effects (font (size 1 1) (thickness 0.15)))
    )
    (pad Fr thru_hole circle (at 10.16 6.35 180) (size 3.200001 3.200001) (drill 3.200001) (layers *.Cu *.Mask)
      (net 2 GND) (zone_connect 2))
    (pad Fl thru_hole circle (at -1.27 6.35 180) (size 3.200001 3.200001) (drill 3.200001) (layers *.Cu *.Mask)
      (net 2 GND) (zone_connect 2))
    (pad 1 thru_hole rect (at 0 0 180) (size 1.5 1.5) (drill 0.79502) (layers *.Mask B.Cu)
      (net 1 +5V))
    (pad 2 thru_hole oval (at 1.27 -2.54 180) (size 1.524 2.54) (drill 0.79502 (offset 0 -0.508)) (layers *.Mask B.Cu)
      (net 5 +3V3))
    (pad 3 thru_hole oval (at 2.54 0 180) (size 1.524 2.54) (drill 0.79502 (offset 0 0.508)) (layers *.Mask B.Cu)
      (net 4 "Net-(J1-Pad3)"))
    (pad 4 thru_hole oval (at 3.81 -2.54 180) (size 1.524 2.286) (drill 0.79502 (offset 0 -0.254)) (layers *.Mask B.Cu)
      (net 2 GND))
    (pad 5 thru_hole oval (at 5.08 0 180) (size 1.524 2.54) (drill 0.79502 (offset 0 0.508)) (layers *.Mask B.Cu)
      (net 3 "Net-(J1-Pad5)"))
    (pad 6 thru_hole oval (at 6.35 -2.54 180) (size 1.524 1.524) (drill 0.79502 (offset 0 -0.254)) (layers *.Mask B.Cu)
      (net 2 GND))
    (pad 7 thru_hole oval (at 7.62 0 135) (size 1.524 1.524) (drill 0.79502) (layers *.Mask B.Cu)
      (net 2 GND))
    (pad 8 thru_hole oval (at 8.89 -2.54 180) (size 1.524 2.032) (drill 0.79502 (offset 0 -0.254)) (layers *.Mask B.Cu)
      (net 2 GND))
    (pad Hl thru_hole oval (at -3.3 3.3 180) (size 1.27 2.2) (drill oval 0.79502 1.65) (layers *.Mask B.Cu)
      (net 2 GND))
    (pad Hr thru_hole oval (at 12.19 3.3 180) (size 1.27 2.2) (drill oval 0.79502 1.65) (layers *.Mask B.Cu)
      (net 2 GND))
    (model ${KISYS3DMOD}/Connector_RJ.3dshapes/RJ45_Amphenol_RJHSE538X.step
      (offset (xyz 7.8486 -4.8768 0))
      (scale (xyz 0.95 1.15 1))
      (rotate (xyz 0 0 180))
    )
  )

  (gr_text v1.0.1 (at 151.9682 87.0458 270) (layer B.Cu)
    (effects (font (size 2.54 2.54) (thickness 0.381)) (justify mirror))
  )
  (gr_arc (start 165.5 60.5) (end 167.5 60.5) (angle -90) (layer Edge.Cuts) (width 0.05) (tstamp 5F3D6DD8))
  (gr_arc (start 146.5 60.5) (end 146.5 58.5) (angle -90) (layer Edge.Cuts) (width 0.05))
  (gr_line (start 165.5 58.5) (end 146.5 58.5) (layer Edge.Cuts) (width 0.05))
  (gr_line (start 144.5 94) (end 144.5 60.5) (layer Edge.Cuts) (width 0.05) (tstamp 5F3D6BCC))
  (gr_line (start 167.5 94) (end 167.5 60.5) (layer Edge.Cuts) (width 0.05))
  (gr_arc (start 156 99) (end 144.5 94) (angle -226.9971314) (layer Edge.Cuts) (width 0.05))

  (segment (start 158.46208 104.63112) (end 150.8902 104.63112) (width 0.508) (layer B.Cu) (net 1))
  (segment (start 159.258 103.8352) (end 158.46208 104.63112) (width 0.508) (layer B.Cu) (net 1))
  (segment (start 163.0172 94.3102) (end 162.2806 95.0468) (width 0.508) (layer B.Cu) (net 1))
  (segment (start 163.0172 73.406) (end 163.0172 94.3102) (width 0.508) (layer B.Cu) (net 1))
  (segment (start 159.258 96.3676) (end 159.258 103.8352) (width 0.508) (layer B.Cu) (net 1))
  (segment (start 160.5788 95.0468) (end 159.258 96.3676) (width 0.508) (layer B.Cu) (net 1))
  (segment (start 162.1329 72.5217) (end 163.0172 73.406) (width 0.508) (layer B.Cu) (net 1))
  (segment (start 162.2806 95.0468) (end 160.5788 95.0468) (width 0.508) (layer B.Cu) (net 1))
  (segment (start 160.5381 72.5217) (end 162.1329 72.5217) (width 0.508) (layer B.Cu) (net 1))
  (segment (start 148.3481 69.2217) (end 163.8381 69.2217) (width 0.508) (layer F.Cu) (net 2))
  (segment (start 160.57117 97.989394) (end 161.429444 97.13112) (width 0.508) (layer B.Cu) (net 3))
  (segment (start 160.57117 100.16997) (end 160.57117 97.989394) (width 0.508) (layer B.Cu) (net 3))
  (segment (start 164.445934 101.19615) (end 161.59735 101.19615) (width 0.508) (layer B.Cu) (net 3))
  (segment (start 155.4581 72.5217) (end 155.4581 65.4457) (width 0.508) (layer B.Cu) (net 3))
  (segment (start 161.59735 101.19615) (end 160.57117 100.16997) (width 0.508) (layer B.Cu) (net 3))
  (segment (start 165.6334 64.7446) (end 165.6334 94.677236) (width 0.508) (layer B.Cu) (net 3))
  (segment (start 166.51226 99.129824) (end 164.445934 101.19615) (width 0.508) (layer B.Cu) (net 3))
  (segment (start 157.381121 63.522679) (end 164.411479 63.522679) (width 0.508) (layer B.Cu) (net 3))
  (segment (start 165.6334 94.677236) (end 166.512261 95.556097) (width 0.508) (layer B.Cu) (net 3))
  (segment (start 164.411479 63.522679) (end 165.6334 64.7446) (width 0.508) (layer B.Cu) (net 3))
  (segment (start 155.4581 65.4457) (end 157.381121 63.522679) (width 0.508) (layer B.Cu) (net 3))
  (segment (start 161.429444 97.13112) (end 162.8902 97.13112) (width 0.508) (layer B.Cu) (net 3))
  (segment (start 166.512261 95.556097) (end 166.51226 99.129824) (width 0.508) (layer B.Cu) (net 3))
  (segment (start 164.320231 95.237968) (end 165.20923 96.126967) (width 0.508) (layer B.Cu) (net 4))
  (segment (start 164.320231 72.866267) (end 164.320231 95.237968) (width 0.508) (layer B.Cu) (net 4))
  (segment (start 165.20923 98.59009) (end 164.6682 99.13112) (width 0.508) (layer B.Cu) (net 4))
  (segment (start 158.75 70.1548) (end 161.608764 70.1548) (width 0.508) (layer B.Cu) (net 4))
  (segment (start 157.9981 70.9067) (end 158.75 70.1548) (width 0.508) (layer B.Cu) (net 4))
  (segment (start 157.9981 72.5217) (end 157.9981 70.9067) (width 0.508) (layer B.Cu) (net 4))
  (segment (start 164.6682 99.13112) (end 162.8902 99.13112) (width 0.508) (layer B.Cu) (net 4))
  (segment (start 161.608764 70.1548) (end 164.320231 72.866267) (width 0.508) (layer B.Cu) (net 4))
  (segment (start 165.20923 96.126967) (end 165.20923 98.59009) (width 0.508) (layer B.Cu) (net 4))

  (zone (net 2) (net_name GND) (layer B.Cu) (tstamp 5F3D6F68) (hatch edge 0.508)
    (connect_pads (clearance 0.79502))
    (min_thickness 0.254)
    (fill yes (arc_segments 32) (thermal_gap 0.79502) (thermal_bridge_width 0.889))
    (polygon
      (pts
        (xy 170.5 57) (xy 170.5 77) (xy 170.5 103.5) (xy 170.5 113) (xy 141 113)
        (xy 141 57) (xy 156.5 57)
      )
    )
    (filled_polygon
      (pts
        (xy 165.703642 59.471529) (xy 165.899531 59.530671) (xy 166.080195 59.626732) (xy 166.238767 59.75606) (xy 166.369195 59.913721)
        (xy 166.466516 60.093712) (xy 166.527024 60.289183) (xy 166.552981 60.536143) (xy 166.552981 64.011342) (xy 166.468995 63.909005)
        (xy 166.42412 63.872178) (xy 165.283907 62.731965) (xy 165.247074 62.687084) (xy 165.068002 62.540123) (xy 164.8637 62.430921)
        (xy 164.642019 62.363675) (xy 164.469251 62.346659) (xy 164.469241 62.346659) (xy 164.411479 62.34097) (xy 164.353717 62.346659)
        (xy 157.438882 62.346659) (xy 157.38112 62.34097) (xy 157.323358 62.346659) (xy 157.323349 62.346659) (xy 157.150581 62.363675)
        (xy 156.9289 62.430921) (xy 156.724598 62.540123) (xy 156.724596 62.540124) (xy 156.724597 62.540124) (xy 156.590399 62.650257)
        (xy 156.590396 62.65026) (xy 156.545526 62.687084) (xy 156.508702 62.731954) (xy 154.667381 64.573277) (xy 154.622506 64.610105)
        (xy 154.585678 64.65498) (xy 154.475545 64.789177) (xy 154.366342 64.99348) (xy 154.299097 65.21516) (xy 154.276391 65.4457)
        (xy 154.282081 65.503472) (xy 154.28208 70.292315) (xy 154.261558 70.309157) (xy 154.051115 70.565582) (xy 153.894741 70.858135)
        (xy 153.798447 71.175574) (xy 153.796616 71.194169) (xy 153.700035 71.290749) (xy 153.633334 70.997101) (xy 153.322156 70.886861)
        (xy 152.995451 70.839446) (xy 152.665774 70.856679) (xy 152.345793 70.937898) (xy 152.202872 70.997111) (xy 152.139636 71.294223)
        (xy 152.9181 72.072687) (xy 152.932242 72.058545) (xy 153.381255 72.507558) (xy 153.367113 72.5217) (xy 153.842517 72.997104)
        (xy 153.894741 73.169264) (xy 154.051114 73.461817) (xy 154.261557 73.718243) (xy 154.5056 73.918524) (xy 154.5056 74.9982)
        (xy 156.4106 74.9982) (xy 156.4106 74.9782) (xy 157.0456 74.9782) (xy 157.0456 74.9982) (xy 157.0656 74.9982)
        (xy 157.0656 75.6332) (xy 157.0456 75.6332) (xy 157.0456 77.115114) (xy 157.300405 77.28049) (xy 157.493299 77.204871)
        (xy 157.772825 77.026609) (xy 157.834319 76.967686) (xy 157.861114 77.017817) (xy 158.071557 77.274243) (xy 158.327982 77.484686)
        (xy 158.620535 77.641059) (xy 158.937974 77.737353) (xy 159.2681 77.769868) (xy 159.598225 77.737353) (xy 159.915664 77.641059)
        (xy 160.208217 77.484686) (xy 160.464643 77.274243) (xy 160.675086 77.017818) (xy 160.831459 76.725265) (xy 160.927753 76.407826)
        (xy 160.95212 76.160427) (xy 160.95212 74.978973) (xy 160.927753 74.731574) (xy 160.831459 74.414135) (xy 160.716029 74.198181)
        (xy 161.2881 74.198181) (xy 161.468847 74.180379) (xy 161.642649 74.127657) (xy 161.802825 74.042041) (xy 161.84118 74.010564)
        (xy 161.841181 93.823077) (xy 161.793478 93.87078) (xy 160.636561 93.87078) (xy 160.578799 93.865091) (xy 160.521037 93.87078)
        (xy 160.521028 93.87078) (xy 160.34826 93.887796) (xy 160.126579 93.955042) (xy 159.922277 94.064244) (xy 159.743205 94.211205)
        (xy 159.706377 94.25608) (xy 158.467286 95.495172) (xy 158.422405 95.532005) (xy 158.275444 95.711078) (xy 158.166242 95.91538)
        (xy 158.098996 96.137061) (xy 158.08198 96.309829) (xy 158.08198 96.309838) (xy 158.076291 96.3676) (xy 158.08198 96.425362)
        (xy 158.081981 103.348077) (xy 157.974958 103.4551) (xy 152.611586 103.4551) (xy 152.594743 103.434577) (xy 152.338318 103.224134)
        (xy 152.045765 103.067761) (xy 151.728326 102.971467) (xy 151.480927 102.9471) (xy 150.299473 102.9471) (xy 150.052074 102.971467)
        (xy 149.734635 103.067761) (xy 149.442082 103.224134) (xy 149.185657 103.434577) (xy 148.975214 103.691002) (xy 148.818841 103.983555)
        (xy 148.722547 104.300994) (xy 148.690032 104.63112) (xy 148.722547 104.961246) (xy 148.818841 105.278685) (xy 148.975214 105.571238)
        (xy 149.185657 105.827663) (xy 149.442082 106.038106) (xy 149.734635 106.194479) (xy 150.052074 106.290773) (xy 150.299473 106.31514)
        (xy 151.480927 106.31514) (xy 151.728326 106.290773) (xy 152.045765 106.194479) (xy 152.338318 106.038106) (xy 152.594743 105.827663)
        (xy 152.611586 105.80714) (xy 158.404318 105.80714) (xy 158.46208 105.812829) (xy 158.519842 105.80714) (xy 158.519852 105.80714)
        (xy 158.69262 105.790124) (xy 158.914301 105.722878) (xy 159.118603 105.613676) (xy 159.297675 105.466715) (xy 159.334508 105.421835)
        (xy 160.048719 104.707624) (xy 160.093595 104.670795) (xy 160.163537 104.585571) (xy 160.240556 104.491724) (xy 160.349758 104.287421)
        (xy 160.350897 104.283665) (xy 160.417004 104.06574) (xy 160.43402 103.892972) (xy 160.43402 103.892962) (xy 160.439709 103.8352)
        (xy 160.43402 103.777438) (xy 160.43402 101.695963) (xy 160.724926 101.986869) (xy 160.761755 102.031745) (xy 160.806629 102.068572)
        (xy 160.940827 102.178706) (xy 161.145129 102.287908) (xy 161.36681 102.355154) (xy 161.59735 102.37786) (xy 161.655122 102.37217)
        (xy 164.388172 102.37217) (xy 164.445934 102.377859) (xy 164.503696 102.37217) (xy 164.503706 102.37217) (xy 164.676474 102.355154)
        (xy 164.898155 102.287908) (xy 165.102457 102.178706) (xy 165.281529 102.031745) (xy 165.318362 101.986864) (xy 167.302984 100.002243)
        (xy 167.347854 99.965419) (xy 167.384678 99.920549) (xy 167.384682 99.920545) (xy 167.494815 99.786348) (xy 167.561732 99.661155)
        (xy 167.464072 100.71361) (xy 167.201613 101.980818) (xy 166.799536 103.210872) (xy 166.26285 104.388446) (xy 165.59825 105.498848)
        (xy 164.81401 106.528255) (xy 163.919909 107.463832) (xy 162.927103 108.293904) (xy 161.847945 109.008145) (xy 160.695911 109.597633)
        (xy 159.48533 110.055039) (xy 158.231326 110.374647) (xy 156.949491 110.552484) (xy 155.655838 110.586327) (xy 154.366463 110.475756)
        (xy 153.097451 110.222149) (xy 151.864625 109.82867) (xy 150.683336 109.300218) (xy 149.568315 108.643384) (xy 148.53346 107.866351)
        (xy 147.591673 106.978812) (xy 146.754679 105.991814) (xy 146.03293 104.91768) (xy 145.435407 103.76978) (xy 144.969564 102.562431)
        (xy 144.641206 101.310674) (xy 144.479705 100.203425) (xy 148.79841 100.203425) (xy 148.916406 100.516629) (xy 149.117325 100.785576)
        (xy 149.366852 101.010158) (xy 149.655399 101.181745) (xy 149.971876 101.293742) (xy 150.304122 101.341845) (xy 150.5727 101.102492)
        (xy 150.5727 99.94862) (xy 151.2077 99.94862) (xy 151.2077 101.102492) (xy 151.476278 101.341845) (xy 151.808524 101.293742)
        (xy 152.125001 101.181745) (xy 152.413548 101.010158) (xy 152.663075 100.785576) (xy 152.863994 100.516629) (xy 152.98199 100.203425)
        (xy 152.816614 99.94862) (xy 151.2077 99.94862) (xy 150.5727 99.94862) (xy 148.963786 99.94862) (xy 148.79841 100.203425)
        (xy 144.479705 100.203425) (xy 144.454427 100.030124) (xy 144.42223 99.058815) (xy 148.79841 99.058815) (xy 148.963786 99.31362)
        (xy 150.5727 99.31362) (xy 150.5727 98.159748) (xy 151.2077 98.159748) (xy 151.2077 99.31362) (xy 152.816614 99.31362)
        (xy 152.98199 99.058815) (xy 152.863994 98.745611) (xy 152.663075 98.476664) (xy 152.413548 98.252082) (xy 152.125001 98.080495)
        (xy 151.808524 97.968498) (xy 151.476278 97.920395) (xy 151.2077 98.159748) (xy 150.5727 98.159748) (xy 150.304122 97.920395)
        (xy 149.971876 97.968498) (xy 149.655399 98.080495) (xy 149.366852 98.252082) (xy 149.117325 98.476664) (xy 148.916406 98.745611)
        (xy 148.79841 99.058815) (xy 144.42223 99.058815) (xy 144.411553 98.736734) (xy 144.51312 97.446617) (xy 144.757859 96.175875)
        (xy 145.146921 94.926852) (xy 145.359081 94.401739) (xy 145.379166 94.364162) (xy 145.433317 94.185648) (xy 145.44702 94.046521)
        (xy 145.44702 80.127566) (xy 148.77923 80.127566) (xy 148.77923 93.964035) (xy 154.81427 93.964035) (xy 154.81427 80.127566)
        (xy 148.77923 80.127566) (xy 145.44702 80.127566) (xy 145.44702 75.894919) (xy 150.000668 75.894919) (xy 150.09577 76.210068)
        (xy 150.250527 76.500608) (xy 150.458992 76.755374) (xy 150.713154 76.964575) (xy 151.003245 77.120172) (xy 151.075795 77.15349)
        (xy 151.3306 76.988114) (xy 151.3306 75.6332) (xy 151.9656 75.6332) (xy 151.9656 76.988114) (xy 152.220405 77.15349)
        (xy 152.292955 77.120172) (xy 152.583046 76.964575) (xy 152.837208 76.755374) (xy 153.023852 76.527275) (xy 153.053262 76.559929)
        (xy 153.317805 76.757417) (xy 153.615793 76.899501) (xy 153.8706 76.739025) (xy 153.8706 75.6332) (xy 154.5056 75.6332)
        (xy 154.5056 76.739025) (xy 154.760407 76.899501) (xy 155.058395 76.757417) (xy 155.293414 76.58197) (xy 155.443997 76.797239)
        (xy 155.683375 77.026609) (xy 155.962901 77.204871) (xy 156.155795 77.28049) (xy 156.4106 77.115114) (xy 156.4106 75.6332)
        (xy 154.5056 75.6332) (xy 153.8706 75.6332) (xy 151.9656 75.6332) (xy 151.3306 75.6332) (xy 150.20058 75.6332)
        (xy 150.000668 75.894919) (xy 145.44702 75.894919) (xy 145.44702 74.736481) (xy 150.000668 74.736481) (xy 150.20058 74.9982)
        (xy 151.3306 74.9982) (xy 151.3306 73.643286) (xy 151.9656 73.643286) (xy 151.9656 74.9982) (xy 153.8706 74.9982)
        (xy 153.8706 73.892375) (xy 153.69026 73.778798) (xy 153.696564 73.749177) (xy 152.9181 72.970713) (xy 152.348039 73.540774)
        (xy 152.292955 73.511228) (xy 152.220405 73.47791) (xy 151.9656 73.643286) (xy 151.3306 73.643286) (xy 151.075795 73.47791)
        (xy 151.003245 73.511228) (xy 150.713154 73.666825) (xy 150.458992 73.876026) (xy 150.250527 74.130792) (xy 150.09577 74.421332)
        (xy 150.000668 74.736481) (xy 145.44702 74.736481) (xy 145.44702 72.599051) (xy 151.235846 72.599051) (xy 151.283261 72.925756)
        (xy 151.393501 73.236934) (xy 151.687151 73.303636) (xy 152.469087 72.5217) (xy 151.690623 71.743236) (xy 151.393511 71.806472)
        (xy 151.334298 71.949393) (xy 151.253079 72.269374) (xy 151.235846 72.599051) (xy 145.44702 72.599051) (xy 145.44702 69.786928)
        (xy 146.772398 69.786928) (xy 146.822228 70.092406) (xy 146.930697 70.382293) (xy 147.093635 70.645449) (xy 147.304782 70.871761)
        (xy 147.556023 71.052532) (xy 147.796055 71.14257) (xy 148.0306 70.974658) (xy 148.0306 69.5392) (xy 148.6656 69.5392)
        (xy 148.6656 70.974658) (xy 148.900145 71.14257) (xy 149.140177 71.052532) (xy 149.391418 70.871761) (xy 149.602565 70.645449)
        (xy 149.765503 70.382293) (xy 149.873972 70.092406) (xy 149.923802 69.786928) (xy 149.689577 69.5392) (xy 148.6656 69.5392)
        (xy 148.0306 69.5392) (xy 147.006623 69.5392) (xy 146.772398 69.786928) (xy 145.44702 69.786928) (xy 145.44702 68.656472)
        (xy 146.772398 68.656472) (xy 147.006623 68.9042) (xy 148.0306 68.9042) (xy 148.0306 67.468742) (xy 148.6656 67.468742)
        (xy 148.6656 68.9042) (xy 149.689577 68.9042) (xy 149.923802 68.656472) (xy 149.873972 68.350994) (xy 149.765503 68.061107)
        (xy 149.602565 67.797951) (xy 149.391418 67.571639) (xy 149.140177 67.390868) (xy 148.900145 67.30083) (xy 148.6656 67.468742)
        (xy 148.0306 67.468742) (xy 147.796055 67.30083) (xy 147.556023 67.390868) (xy 147.304782 67.571639) (xy 147.093635 67.797951)
        (xy 146.930697 68.061107) (xy 146.822228 68.350994) (xy 146.772398 68.656472) (xy 145.44702 68.656472) (xy 145.44702 60.546316)
        (xy 145.471529 60.296358) (xy 145.530671 60.100469) (xy 145.626732 59.919805) (xy 145.75606 59.761233) (xy 145.913721 59.630805)
        (xy 146.093712 59.533484) (xy 146.289183 59.472976) (xy 146.536134 59.44702) (xy 165.453684 59.44702)
      )
    )
    (filled_polygon
      (pts
        (xy 164.45738 65.231723) (xy 164.45738 67.32605) (xy 164.390145 67.30083) (xy 164.1556 67.468742) (xy 164.1556 68.9042)
        (xy 164.1756 68.9042) (xy 164.1756 69.5392) (xy 164.1556 69.5392) (xy 164.1556 69.5592) (xy 163.5206 69.5592)
        (xy 163.5206 69.5392) (xy 163.5006 69.5392) (xy 163.5006 68.9042) (xy 163.5206 68.9042) (xy 163.5206 67.468742)
        (xy 163.286055 67.30083) (xy 163.046023 67.390868) (xy 162.794782 67.571639) (xy 162.583635 67.797951) (xy 162.420697 68.061107)
        (xy 162.312228 68.350994) (xy 162.262398 68.656472) (xy 162.496621 68.904198) (xy 162.28108 68.904198) (xy 162.28108 69.185205)
        (xy 162.265287 69.172244) (xy 162.060985 69.063042) (xy 161.839304 68.995796) (xy 161.666536 68.97878) (xy 161.666526 68.97878)
        (xy 161.608764 68.973091) (xy 161.551002 68.97878) (xy 158.807761 68.97878) (xy 158.749999 68.973091) (xy 158.692237 68.97878)
        (xy 158.692228 68.97878) (xy 158.51946 68.995796) (xy 158.297779 69.063042) (xy 158.093477 69.172244) (xy 157.914405 69.319205)
        (xy 157.877572 69.364086) (xy 157.240503 70.001155) (xy 157.057983 70.098714) (xy 156.801558 70.309157) (xy 156.728101 70.398665)
        (xy 156.654643 70.309157) (xy 156.63412 70.292314) (xy 156.63412 65.932822) (xy 157.868245 64.698699) (xy 163.924357 64.698699)
      )
    )
  )
)
