(export (version D)
  (design
    (source /home/yann/code/kicad/esp-station-board/esp-station-board.sch)
    (date "Mo 10 Feb 2020 14:24:37 CET")
    (tool "Eeschema 5.1.5")
    (sheet (number 1) (name /) (tstamps /)
      (title_block
        (title)
        (company)
        (rev)
        (date)
        (source esp-station-board.sch)
        (comment (number 1) (value ""))
        (comment (number 2) (value ""))
        (comment (number 3) (value ""))
        (comment (number 4) (value "")))))
  (components
    (comp (ref J1)
      (value RJ45SensorCableConnector)
      (footprint CO2Mofetten:RJ45_econ_MEB8.8PG_Horizontal)
      (datasheet ~)
      (libsource (lib CO2Mofetten) (part RJ45SensorCableConnector) (description "RJ connector, 8P8C (8 positions 8 connected), RJ31/RJ32/RJ33/RJ34/RJ35/RJ41/RJ45/RJ49/RJ61"))
      (sheetpath (names /) (tstamps /))
      (tstamp 5E39CEBA))
    (comp (ref MOD1)
      (value XBP24CZ7SIT-004)
      (footprint digikey-footprints:XBEE-20_THT)
      (datasheet https://www.digi.com/resources/documentation/digidocs/pdfs/90001500.pdf)
      (fields
        (field (name Category) "RF/IF and RFID")
        (field (name DK_Datasheet_Link) https://www.digi.com/resources/documentation/digidocs/pdfs/90001500.pdf)
        (field (name DK_Detail_Page) /product-detail/en/digi-international/XBP24CZ7SIT-004/602-1562-ND/5322376)
        (field (name Description) "RF TXRX MODULE 802.15.4 RP-SMA")
        (field (name Digi-Key_PN) 602-1562-ND)
        (field (name Family) "RF Transceiver Modules")
        (field (name MPN) XBP24CZ7SIT-004)
        (field (name Manufacturer) "Digi International")
        (field (name Status) Active))
      (libsource (lib dk_RF-Transceiver-Modules) (part XBP24CZ7SIT-004) (description "RF TXRX MODULE 802.15.4 RP-SMA"))
      (sheetpath (names /) (tstamps /))
      (tstamp 5E3ADB43))
    (comp (ref U3)
      (value Adafruit_MicroSD)
      (footprint CO2Mofetten:Adafruit_MicroSD_PinSocket)
      (libsource (lib CO2Mofetten) (part Adafruit_MicroSD) (description ""))
      (sheetpath (names /) (tstamps /))
      (tstamp 5E3A141D))
    (comp (ref U1)
      (value TSR_1-2433)
      (footprint Converter_DCDC:Converter_DCDC_TRACO_TSR-1_THT)
      (datasheet http://www.tracopower.com/products/tsr1.pdf)
      (libsource (lib Regulator_Switching) (part TSR_1-2433) (description "1A step-down regulator module, fixed 3.3V output voltage, 5-36V input voltage, -40°C to +85°C temperature range, TO-220 compatible LM78xx replacement"))
      (sheetpath (names /) (tstamps /))
      (tstamp 5E420AF7))
    (comp (ref J2)
      (value Screw_Terminal_01x02)
      (footprint TerminalBlock:TerminalBlock_bornier-2_P5.08mm)
      (datasheet ~)
      (libsource (lib Connector) (part Screw_Terminal_01x02) (description "Generic screw terminal, single row, 01x02, script generated (kicad-library-utils/schlib/autogen/connector/)"))
      (sheetpath (names /) (tstamps /))
      (tstamp 5E45774A))
    (comp (ref U2)
      (value WeMos_D1_mini)
      (footprint Module:WEMOS_D1_mini_light)
      (datasheet https://wiki.wemos.cc/products:d1:d1_mini#documentation)
      (libsource (lib MCU_Module) (part WeMos_D1_mini) (description "32-bit microcontroller module with WiFi"))
      (sheetpath (names /) (tstamps /))
      (tstamp 5E39C2EF))
    (comp (ref Q1)
      (value IRLML6402TRPBF)
      (footprint Package_TO_SOT_SMD:SOT-23_Handsoldering)
      (datasheet https://www.infineon.com/dgdl/irlml6402pbf.pdf?fileId=5546d462533600a401535668d5c2263c)
      (fields
        (field (name Category) "Discrete Semiconductor Products")
        (field (name DK_Datasheet_Link) https://www.infineon.com/dgdl/irlml6402pbf.pdf?fileId=5546d462533600a401535668d5c2263c)
        (field (name DK_Detail_Page) /product-detail/en/infineon-technologies/IRLML6402TRPBF/IRLML6402PBFCT-ND/812500)
        (field (name Description) "MOSFET P-CH 20V 3.7A SOT-23")
        (field (name Digi-Key_PN) IRLML6402PBFCT-ND)
        (field (name Family) "Transistors - FETs, MOSFETs - Single")
        (field (name MPN) IRLML6402TRPBF)
        (field (name Manufacturer) "Infineon Technologies")
        (field (name Status) Active))
      (libsource (lib dk_Transistors-FETs-MOSFETs-Single) (part IRLML6402TRPBF) (description "MOSFET P-CH 20V 3.7A SOT-23"))
      (sheetpath (names /) (tstamps /))
      (tstamp 5E4A3D32))
    (comp (ref U4)
      (value Adafruit_DS3231)
      (footprint CO2Mofetten:Adafruit_DS3231_PinSocket)
      (datasheet https://learn.adafruit.com/adafruit-ds3231-precision-rtc-breakout/overview)
      (libsource (lib CO2Mofetten) (part Adafruit_DS3231) (description "Extremely Accurate I²C-Integrated RTC/TCXO/Crystal (Breakout)"))
      (sheetpath (names /) (tstamps /))
      (tstamp 5E41719C)))
  (libparts
    (libpart (lib CO2Mofetten) (part Adafruit_DS3231)
      (description "Extremely Accurate I²C-Integrated RTC/TCXO/Crystal (Breakout)")
      (docs https://learn.adafruit.com/adafruit-ds3231-precision-rtc-breakout/overview)
      (fields
        (field (name Reference) U)
        (field (name Value) Adafruit_DS3231)
        (field (name Footprint) CO2Mofetten:Adafruit_DS3231_PinSocket))
      (pins
        (pin (num 1) (name Vin) (type power_in))
        (pin (num 2) (name GND) (type power_in))
        (pin (num 3) (name SCL) (type input))
        (pin (num 4) (name SDA) (type BiDi))
        (pin (num 5) (name BAT) (type power_out))
        (pin (num 6) (name 32K) (type output))
        (pin (num 7) (name SQW) (type unspc))
        (pin (num 8) (name RST) (type input))))
    (libpart (lib CO2Mofetten) (part Adafruit_MicroSD)
      (fields
        (field (name Reference) U)
        (field (name Value) Adafruit_MicroSD))
      (pins
        (pin (num 3v) (name 3V) (type power_out))
        (pin (num 5v) (name 5V) (type power_in))
        (pin (num CD) (name CD) (type output))
        (pin (num CLK) (name SCK) (type input))
        (pin (num CS) (name CS) (type input))
        (pin (num DI) (name SDI) (type input))
        (pin (num DO) (name SDO) (type output))
        (pin (num GND) (name GND) (type power_in))))
    (libpart (lib CO2Mofetten) (part RJ45SensorCableConnector)
      (description "RJ connector, 8P8C (8 positions 8 connected), RJ31/RJ32/RJ33/RJ34/RJ35/RJ41/RJ45/RJ49/RJ61")
      (docs ~)
      (footprints
        (fp RJ45*))
      (fields
        (field (name Reference) J)
        (field (name Value) RJ45SensorCableConnector)
        (field (name Footprint) Connector_RJ:RJ45_Amphenol_54602-x08_Horizontal))
      (pins
        (pin (num 1) (name Vcc) (type power_in))
        (pin (num 2) (name Vcc) (type power_in))
        (pin (num 3) (name SDA) (type BiDi))
        (pin (num 4) (name GND) (type power_in))
        (pin (num 5) (name SCL) (type BiDi))
        (pin (num 6) (name GND) (type power_in))
        (pin (num 7) (name GND) (type power_in))
        (pin (num 8) (name GND) (type power_in))
        (pin (num Fl) (name Fl) (type passive))
        (pin (num Fr) (name Fr) (type passive))
        (pin (num Hl) (name Hl) (type passive))
        (pin (num Hr) (name Hr) (type passive))))
    (libpart (lib Connector) (part Screw_Terminal_01x02)
      (description "Generic screw terminal, single row, 01x02, script generated (kicad-library-utils/schlib/autogen/connector/)")
      (docs ~)
      (footprints
        (fp TerminalBlock*:*))
      (fields
        (field (name Reference) J)
        (field (name Value) Screw_Terminal_01x02))
      (pins
        (pin (num 1) (name Pin_1) (type passive))
        (pin (num 2) (name Pin_2) (type passive))))
    (libpart (lib MCU_Module) (part WeMos_D1_mini)
      (description "32-bit microcontroller module with WiFi")
      (docs https://wiki.wemos.cc/products:d1:d1_mini#documentation)
      (footprints
        (fp WEMOS*D1*mini*))
      (fields
        (field (name Reference) U)
        (field (name Value) WeMos_D1_mini)
        (field (name Footprint) Module:WEMOS_D1_mini_light))
      (pins
        (pin (num 1) (name ~RST) (type input))
        (pin (num 2) (name A0) (type input))
        (pin (num 3) (name D0) (type BiDi))
        (pin (num 4) (name SCK/D5) (type BiDi))
        (pin (num 5) (name MISO/D6) (type BiDi))
        (pin (num 6) (name MOSI/D7) (type BiDi))
        (pin (num 7) (name CS/D8) (type BiDi))
        (pin (num 8) (name 3V3) (type power_out))
        (pin (num 9) (name 5V) (type power_in))
        (pin (num 10) (name GND) (type power_in))
        (pin (num 11) (name D4) (type BiDi))
        (pin (num 12) (name D3) (type BiDi))
        (pin (num 13) (name SDA/D2) (type BiDi))
        (pin (num 14) (name SCL/D1) (type BiDi))
        (pin (num 15) (name RX) (type input))
        (pin (num 16) (name TX) (type output))))
    (libpart (lib Regulator_Switching) (part TSR_1-2450)
      (aliases
        (alias TSR_1-2412)
        (alias TSR_1-2415)
        (alias TSR_1-2418)
        (alias TSR_1-2425)
        (alias TSR_1-2433)
        (alias TSR_1-2465)
        (alias TSR_1-2490)
        (alias TSR_1-24120)
        (alias TSR_1-24150))
      (description "1A step-down regulator module, fixed 5V output voltage, 5-36V input voltage, -40°C to +85°C temperature range, TO-220 compatible LM78xx replacement")
      (docs http://www.tracopower.com/products/tsr1.pdf)
      (footprints
        (fp Converter*DCDC*TRACO*TSR?1*))
      (fields
        (field (name Reference) U)
        (field (name Value) TSR_1-2450)
        (field (name Footprint) Converter_DCDC:Converter_DCDC_TRACO_TSR-1_THT))
      (pins
        (pin (num 1) (name Vin) (type power_in))
        (pin (num 2) (name GND) (type power_in))
        (pin (num 3) (name Vout) (type power_out))))
    (libpart (lib dk_RF-Transceiver-Modules) (part XBP24CZ7SIT-004)
      (description "RF TXRX MODULE 802.15.4 RP-SMA")
      (docs https://www.digi.com/resources/documentation/digidocs/pdfs/90001500.pdf)
      (fields
        (field (name Reference) MOD)
        (field (name Value) XBP24CZ7SIT-004)
        (field (name Footprint) digikey-footprints:XBEE_PRO-20_THT)
        (field (name Datasheet) https://www.digi.com/resources/documentation/digidocs/pdfs/90001500.pdf)
        (field (name Digi-Key_PN) 602-1562-ND)
        (field (name MPN) XBP24CZ7SIT-004)
        (field (name Category) "RF/IF and RFID")
        (field (name Family) "RF Transceiver Modules")
        (field (name DK_Datasheet_Link) https://www.digi.com/resources/documentation/digidocs/pdfs/90001500.pdf)
        (field (name DK_Detail_Page) /product-detail/en/digi-international/XBP24CZ7SIT-004/602-1562-ND/5322376)
        (field (name Description) "RF TXRX MODULE 802.15.4 RP-SMA")
        (field (name Manufacturer) "Digi International")
        (field (name Status) Active))
      (pins
        (pin (num 1) (name Vcc) (type power_in))
        (pin (num 2) (name UART_Data_Out) (type output))
        (pin (num 3) (name UART_Data_in/Config) (type input))
        (pin (num 4) (name DO8) (type output))
        (pin (num 5) (name /Reset) (type input))
        (pin (num 6) (name PWM0-RSSI) (type output))
        (pin (num 7) (name PWM1) (type output))
        (pin (num 8) (name Reserved) (type BiDi))
        (pin (num 9) (name DTR-SLEEP-RQ-DI8) (type input))
        (pin (num 10) (name GND) (type power_in))
        (pin (num 11) (name AD4-DIO4) (type BiDi))
        (pin (num 12) (name DIO7-/CTS) (type BiDi))
        (pin (num 13) (name ON-/SLEEP) (type output))
        (pin (num 14) (name VREF) (type input))
        (pin (num 15) (name AD5-DIO5) (type BiDi))
        (pin (num 16) (name AD6-DIO6-/RTS) (type BiDi))
        (pin (num 17) (name AD3-DIO3) (type BiDi))
        (pin (num 18) (name AD2-DIO2) (type BiDi))
        (pin (num 19) (name AD1-DIO1) (type BiDi))
        (pin (num 20) (name AD0-DIO0) (type BiDi))))
    (libpart (lib dk_Transistors-FETs-MOSFETs-Single) (part IRLML6402TRPBF)
      (description "MOSFET P-CH 20V 3.7A SOT-23")
      (docs https://www.infineon.com/dgdl/irlml6402pbf.pdf?fileId=5546d462533600a401535668d5c2263c)
      (fields
        (field (name Reference) Q)
        (field (name Value) IRLML6402TRPBF)
        (field (name Footprint) digikey-footprints:SOT-23-3)
        (field (name Datasheet) https://www.infineon.com/dgdl/irlml6402pbf.pdf?fileId=5546d462533600a401535668d5c2263c)
        (field (name Digi-Key_PN) IRLML6402PBFCT-ND)
        (field (name MPN) IRLML6402TRPBF)
        (field (name Category) "Discrete Semiconductor Products")
        (field (name Family) "Transistors - FETs, MOSFETs - Single")
        (field (name DK_Datasheet_Link) https://www.infineon.com/dgdl/irlml6402pbf.pdf?fileId=5546d462533600a401535668d5c2263c)
        (field (name DK_Detail_Page) /product-detail/en/infineon-technologies/IRLML6402TRPBF/IRLML6402PBFCT-ND/812500)
        (field (name Description) "MOSFET P-CH 20V 3.7A SOT-23")
        (field (name Manufacturer) "Infineon Technologies")
        (field (name Status) Active))
      (pins
        (pin (num 1) (name G) (type BiDi))
        (pin (num 2) (name S) (type BiDi))
        (pin (num 3) (name D) (type BiDi)))))
  (libraries
    (library (logical CO2Mofetten)
      (uri /home/yann/code/kicad/esp-station-board/kicad-library/symbols/CO2Mofetten.lib))
    (library (logical Connector)
      (uri /usr/share/kicad/library/Connector.lib))
    (library (logical MCU_Module)
      (uri /usr/share/kicad/library/MCU_Module.lib))
    (library (logical Regulator_Switching)
      (uri /usr/share/kicad/library/Regulator_Switching.lib))
    (library (logical dk_RF-Transceiver-Modules)
      (uri /home/yann/code/kicad/esp-station-board/digikey-kicad-library/digikey-symbols/dk_RF-Transceiver-Modules.lib))
    (library (logical dk_Transistors-FETs-MOSFETs-Single)
      (uri /home/yann/code/kicad/esp-station-board/digikey-kicad-library/digikey-symbols/dk_Transistors-FETs-MOSFETs-Single.lib)))
  (nets
    (net (code 1) (name "Net-(MOD1-Pad3)")
      (node (ref MOD1) (pin 3))
      (node (ref U2) (pin 12)))
    (net (code 2) (name "Net-(J1-Pad3)")
      (node (ref U2) (pin 13))
      (node (ref U4) (pin 4))
      (node (ref J1) (pin 3)))
    (net (code 3) (name "Net-(U2-Pad15)")
      (node (ref U2) (pin 15)))
    (net (code 4) (name "Net-(U2-Pad16)")
      (node (ref U2) (pin 16)))
    (net (code 5) (name "Net-(U2-Pad2)")
      (node (ref U2) (pin 2)))
    (net (code 6) (name "Net-(U2-Pad3)")
      (node (ref U2) (pin 3))
      (node (ref U3) (pin CD)))
    (net (code 7) (name "Net-(U3-Pad5v)")
      (node (ref U3) (pin 5v)))
    (net (code 8) (name "Net-(U2-Pad9)")
      (node (ref U2) (pin 9)))
    (net (code 9) (name "Net-(MOD1-Pad2)")
      (node (ref MOD1) (pin 2))
      (node (ref U2) (pin 11)))
    (net (code 10) (name VCC)
      (node (ref J2) (pin 1))
      (node (ref U1) (pin 1)))
    (net (code 11) (name "Net-(U4-Pad5)")
      (node (ref U4) (pin 5)))
    (net (code 12) (name "Net-(U4-Pad6)")
      (node (ref U4) (pin 6)))
    (net (code 13) (name "Net-(U4-Pad7)")
      (node (ref U4) (pin 7)))
    (net (code 14) (name "Net-(U4-Pad8)")
      (node (ref U4) (pin 8)))
    (net (code 15) (name "Net-(U2-Pad6)")
      (node (ref U2) (pin 6))
      (node (ref U3) (pin DI)))
    (net (code 16) (name "Net-(Q1-Pad1)")
      (node (ref Q1) (pin 1))
      (node (ref U2) (pin 7)))
    (net (code 17) (name "Net-(Q1-Pad3)")
      (node (ref U3) (pin 3v))
      (node (ref Q1) (pin 3)))
    (net (code 18) (name "Net-(MOD1-Pad6)")
      (node (ref MOD1) (pin 6)))
    (net (code 19) (name "Net-(U2-Pad4)")
      (node (ref U3) (pin CLK))
      (node (ref U2) (pin 4)))
    (net (code 20) (name "Net-(MOD1-Pad4)")
      (node (ref MOD1) (pin 4)))
    (net (code 21) (name "Net-(MOD1-Pad5)")
      (node (ref MOD1) (pin 5)))
    (net (code 22) (name "Net-(MOD1-Pad7)")
      (node (ref MOD1) (pin 7)))
    (net (code 23) (name "Net-(MOD1-Pad8)")
      (node (ref MOD1) (pin 8)))
    (net (code 24) (name "Net-(MOD1-Pad9)")
      (node (ref MOD1) (pin 9)))
    (net (code 25) (name "Net-(MOD1-Pad20)")
      (node (ref MOD1) (pin 20)))
    (net (code 26) (name "Net-(MOD1-Pad11)")
      (node (ref MOD1) (pin 11))
      (node (ref U2) (pin 1)))
    (net (code 27) (name "Net-(MOD1-Pad12)")
      (node (ref MOD1) (pin 12)))
    (net (code 28) (name "Net-(MOD1-Pad13)")
      (node (ref MOD1) (pin 13)))
    (net (code 29) (name "Net-(MOD1-Pad14)")
      (node (ref MOD1) (pin 14)))
    (net (code 30) (name "Net-(MOD1-Pad15)")
      (node (ref MOD1) (pin 15)))
    (net (code 31) (name "Net-(MOD1-Pad16)")
      (node (ref MOD1) (pin 16)))
    (net (code 32) (name "Net-(MOD1-Pad17)")
      (node (ref MOD1) (pin 17)))
    (net (code 33) (name "Net-(MOD1-Pad18)")
      (node (ref MOD1) (pin 18)))
    (net (code 34) (name "Net-(J1-Pad5)")
      (node (ref U2) (pin 14))
      (node (ref U4) (pin 3))
      (node (ref J1) (pin 5)))
    (net (code 35) (name "Net-(MOD1-Pad19)")
      (node (ref MOD1) (pin 19)))
    (net (code 36) (name "Net-(U2-Pad5)")
      (node (ref U2) (pin 5))
      (node (ref U3) (pin DO)))
    (net (code 38) (name +3V3)
      (node (ref U4) (pin 1))
      (node (ref J1) (pin 1))
      (node (ref J1) (pin 2))
      (node (ref MOD1) (pin 1))
      (node (ref Q1) (pin 2))
      (node (ref U2) (pin 8))
      (node (ref U1) (pin 3)))
    (net (code 39) (name GND)
      (node (ref U2) (pin 10))
      (node (ref U1) (pin 2))
      (node (ref J2) (pin 2))
      (node (ref MOD1) (pin 10))
      (node (ref U3) (pin GND))
      (node (ref U3) (pin CS))
      (node (ref J1) (pin Fr))
      (node (ref J1) (pin Hr))
      (node (ref J1) (pin Hl))
      (node (ref J1) (pin Fl))
      (node (ref J1) (pin 8))
      (node (ref J1) (pin 7))
      (node (ref J1) (pin 6))
      (node (ref J1) (pin 4))
      (node (ref U4) (pin 2)))))