EESchema Schematic File Version 4
EELAYER 30 0
EELAYER END
$Descr A4 11693 8268
encoding utf-8
Sheet 1 1
Title "Calibration Plate"
Date "2020-01-08"
Rev "v1.1.0"
Comp ""
Comment1 ""
Comment2 ""
Comment3 ""
Comment4 ""
$EndDescr
$Comp
L CO2Mofetten:RJ45SensorCableConnector J1
U 1 1 5E3AA6D9
P 2250 6800
F 0 "J1" H 2307 7467 50  0000 C CNN
F 1 "RJ45SensorCableConnector" H 2307 7376 50  0000 C CNN
F 2 "CO2Mofetten:RJ45_econ_MEB8.8PG_Horizontal" V 2250 6825 50  0001 C CNN
F 3 "~" V 2250 6825 50  0001 C CNN
	1    2250 6800
	1    0    0    -1  
$EndComp
$Comp
L calPlate-rescue:BME280_small-calPlate P1
U 1 1 5E3AF161
P 2150 4100
F 0 "P1" H 2628 4151 50  0000 L CNN
F 1 "BME280_small" H 2628 4060 50  0000 L CNN
F 2 "CO2Mofetten:gy-bme280" H 2150 4100 50  0001 C CNN
F 3 "" H 2150 4100 50  0001 C CNN
	1    2150 4100
	1    0    0    -1  
$EndComp
$Comp
L CO2Mofetten:Sensirion_SCD30 P9
U 1 1 5E3B363D
P 9700 1650
F 0 "P9" H 9483 2175 50  0000 C CNN
F 1 "SCD30" H 9483 2084 50  0000 C CNN
F 2 "CO2Mofetten:Sensirion_SCD30_45deg" H 9700 1850 50  0001 C CNN
F 3 "" H 9700 1850 50  0001 C CNN
	1    9700 1650
	-1   0    0    -1  
$EndComp
$Comp
L CO2Mofetten:Sensirion_SCD30 P6
U 1 1 5E3BC4B4
P 6300 4300
F 0 "P6" H 6083 4825 50  0000 C CNN
F 1 "SCD30" H 6083 4734 50  0000 C CNN
F 2 "CO2Mofetten:Sensirion_SCD30_45deg" H 6300 4500 50  0001 C CNN
F 3 "" H 6300 4500 50  0001 C CNN
	1    6300 4300
	-1   0    0    -1  
$EndComp
$Comp
L CO2Mofetten:Sensirion_SCD30 P8
U 1 1 5E3BD1E8
P 8100 4300
F 0 "P8" H 7883 4825 50  0000 C CNN
F 1 "SCD30" H 7883 4734 50  0000 C CNN
F 2 "CO2Mofetten:Sensirion_SCD30_45deg" H 8100 4500 50  0001 C CNN
F 3 "" H 8100 4500 50  0001 C CNN
	1    8100 4300
	-1   0    0    -1  
$EndComp
$Comp
L CO2Mofetten:Sensirion_SCD30 P10
U 1 1 5E3BD588
P 9700 4300
F 0 "P10" H 9483 4825 50  0000 C CNN
F 1 "SCD30" H 9483 4734 50  0000 C CNN
F 2 "CO2Mofetten:Sensirion_SCD30_45deg" H 9700 4500 50  0001 C CNN
F 3 "" H 9700 4500 50  0001 C CNN
	1    9700 4300
	-1   0    0    -1  
$EndComp
$Comp
L calPlate-rescue:GND-power #PWR0101
U 1 1 5E5094AA
P 1600 5850
F 0 "#PWR0101" H 1600 5600 50  0001 C CNN
F 1 "GND" V 1605 5722 50  0000 R CNN
F 2 "" H 1600 5850 50  0001 C CNN
F 3 "" H 1600 5850 50  0001 C CNN
	1    1600 5850
	0    1    1    0   
$EndComp
$Comp
L calPlate-rescue:+5V-power #PWR0102
U 1 1 5E512D12
P 1600 6050
F 0 "#PWR0102" H 1600 5900 50  0001 C CNN
F 1 "+5V" V 1615 6178 50  0000 L CNN
F 2 "" H 1600 6050 50  0001 C CNN
F 3 "" H 1600 6050 50  0001 C CNN
	1    1600 6050
	0    -1   -1   0   
$EndComp
Wire Wire Line
	2650 6400 2950 6400
Wire Wire Line
	2950 6400 2950 5850
Wire Wire Line
	2950 5850 1600 5850
Wire Wire Line
	2650 6500 2950 6500
Wire Wire Line
	2950 6500 2950 6400
Connection ~ 2950 6400
Wire Wire Line
	2650 6600 2950 6600
Wire Wire Line
	2950 6600 2950 6500
Connection ~ 2950 6500
Wire Wire Line
	2650 6800 2750 6800
Wire Wire Line
	2950 6800 2950 6600
Connection ~ 2950 6600
Wire Wire Line
	2950 7100 2650 7100
Wire Wire Line
	1750 7400 1750 6050
Wire Wire Line
	1750 6050 1600 6050
Wire Wire Line
	2950 5850 5300 5850
Wire Wire Line
	5300 5850 5300 4100
Connection ~ 2950 5850
Wire Wire Line
	5300 5850 7050 5850
Wire Wire Line
	7050 5850 7050 4100
Connection ~ 5300 5850
Wire Wire Line
	7050 5850 8750 5850
Wire Wire Line
	8750 5850 8750 4100
Connection ~ 7050 5850
Wire Wire Line
	8750 5850 10550 5850
Wire Wire Line
	10550 5850 10550 4100
Connection ~ 8750 5850
Wire Wire Line
	2950 5850 2950 5250
Wire Wire Line
	2950 5250 1400 5250
Wire Wire Line
	1400 5250 1400 4050
Wire Wire Line
	1400 4050 2000 4050
Wire Wire Line
	1400 4050 1400 1500
Connection ~ 1400 4050
Wire Wire Line
	1400 1500 1400 800 
Wire Wire Line
	1400 800  5450 800 
Wire Wire Line
	5450 800  5450 1400
Connection ~ 1400 1500
Wire Wire Line
	5450 800  7250 800 
Wire Wire Line
	7250 800  7250 1450
Connection ~ 5450 800 
Wire Wire Line
	7250 800  8850 800 
Wire Wire Line
	8850 800  8850 1450
Connection ~ 7250 800 
Wire Wire Line
	8850 800  10750 800 
Wire Wire Line
	10750 800  10750 1450
Connection ~ 8850 800 
Wire Wire Line
	1000 3950 2000 3950
Wire Wire Line
	1000 3950 1000 1400
Wire Wire Line
	1000 1400 1000 650 
Wire Wire Line
	1000 650  5300 650 
Wire Wire Line
	5300 650  5300 1300
Connection ~ 1000 1400
Wire Wire Line
	5300 650  7100 650 
Wire Wire Line
	7100 650  7100 1350
Connection ~ 5300 650 
Wire Wire Line
	7100 650  8700 650 
Wire Wire Line
	8700 650  8700 1350
Connection ~ 7100 650 
Wire Wire Line
	8700 650  10600 650 
Wire Wire Line
	10600 650  10600 1350
Connection ~ 8700 650 
Wire Wire Line
	5250 7000 5250 6100
Wire Wire Line
	5250 6100 7000 6100
Connection ~ 5250 6100
Wire Wire Line
	5250 6100 5250 4000
Wire Wire Line
	7000 6100 8700 6100
Wire Wire Line
	8700 6100 8700 4000
Connection ~ 7000 6100
Wire Wire Line
	8700 6100 10500 6100
Wire Wire Line
	10500 6100 10500 4000
Connection ~ 8700 6100
Wire Wire Line
	2650 6700 3200 6700
Wire Wire Line
	3200 6700 3200 4750
Wire Wire Line
	3200 4750 1600 4750
Wire Wire Line
	1600 4750 1600 4150
Wire Wire Line
	1600 4150 2000 4150
Wire Wire Line
	2650 6900 3450 6900
Wire Wire Line
	3450 6900 3450 4500
Wire Wire Line
	3450 4500 1750 4500
Wire Wire Line
	1750 4500 1750 4250
Wire Wire Line
	1750 4250 2000 4250
Wire Wire Line
	1750 4250 1750 3250
Wire Wire Line
	1750 3250 1700 3250
Connection ~ 1750 4250
Wire Wire Line
	1900 2700 2300 2700
Wire Wire Line
	1950 2300 1900 2300
Wire Wire Line
	1700 3250 1700 1600
Wire Wire Line
	1600 4150 1600 1700
Connection ~ 1600 4150
Wire Wire Line
	2300 2700 2300 3100
Wire Wire Line
	2300 3100 5450 3100
Wire Wire Line
	5450 3100 5450 1500
Connection ~ 2300 2700
Wire Wire Line
	5450 3100 7250 3100
Wire Wire Line
	7250 3100 7250 1550
Connection ~ 5450 3100
Wire Wire Line
	7250 3100 8850 3100
Wire Wire Line
	8850 3100 8850 1550
Connection ~ 7250 3100
Wire Wire Line
	10750 3100 10750 1550
Connection ~ 8850 3100
Wire Wire Line
	5450 3100 5450 4200
Wire Wire Line
	8850 3100 10750 3100
Wire Wire Line
	8850 3100 8850 4200
Wire Wire Line
	10750 3100 10750 4200
Connection ~ 10750 3100
Wire Wire Line
	3900 1500 3900 2700
Wire Wire Line
	3900 2700 5250 2700
Wire Wire Line
	5250 2700 5250 1600
Wire Wire Line
	3750 1700 3750 2850
Wire Wire Line
	3750 2850 6950 2850
Wire Wire Line
	6950 2850 6950 1650
Wire Wire Line
	3600 1900 3600 2950
Wire Wire Line
	3600 2950 8700 2950
Wire Wire Line
	8700 2950 8700 1650
Wire Wire Line
	3400 2100 3400 3050
Wire Wire Line
	3400 3050 10450 3050
Wire Wire Line
	10450 3050 10450 1650
Wire Wire Line
	3300 2300 3300 3300
Wire Wire Line
	3300 3300 10300 3300
Wire Wire Line
	10300 3300 10300 4300
Wire Wire Line
	3150 2500 3150 3450
Wire Wire Line
	3150 3450 8550 3450
Wire Wire Line
	8550 3450 8550 4300
Wire Wire Line
	7250 3100 7250 4200
Wire Wire Line
	1800 3700 1800 2400
Wire Wire Line
	1850 3600 1850 2200
Wire Wire Line
	6850 3700 6850 4300
Wire Wire Line
	1800 3700 6850 3700
Wire Wire Line
	1850 3600 5200 3600
Wire Wire Line
	5200 3600 5200 4300
Wire Wire Line
	2050 7300 2150 7300
Connection ~ 2150 7300
Wire Wire Line
	2150 7300 2350 7300
Connection ~ 2350 7300
Wire Wire Line
	2350 7300 2450 7300
Wire Wire Line
	2950 7100 2950 7400
Wire Wire Line
	2950 7400 1750 7400
Wire Wire Line
	2450 7300 2750 7300
Wire Wire Line
	2750 7300 2750 6800
Connection ~ 2450 7300
Connection ~ 2750 6800
Wire Wire Line
	2750 6800 2950 6800
$Comp
L CO2Mofetten:Sensirion_SCD30 P7
U 1 1 5E3B21C0
P 8100 1650
F 0 "P7" H 7883 2175 50  0000 C CNN
F 1 "SCD30" H 7883 2084 50  0000 C CNN
F 2 "CO2Mofetten:Sensirion_SCD30_45deg" H 8100 1850 50  0001 C CNN
F 3 "" H 8100 1850 50  0001 C CNN
	1    8100 1650
	-1   0    0    -1  
$EndComp
Wire Wire Line
	8450 1550 8850 1550
Wire Wire Line
	8450 1450 8850 1450
Wire Wire Line
	8450 1350 8700 1350
Wire Wire Line
	8450 1650 8700 1650
$Comp
L CO2Mofetten:Sensirion_SCD30 P3
U 1 1 5E3B0B05
P 4750 1600
F 0 "P3" H 4533 2125 50  0000 C CNN
F 1 "SCD30" H 4533 2034 50  0000 C CNN
F 2 "CO2Mofetten:Sensirion_SCD30_45deg" H 4750 1800 50  0001 C CNN
F 3 "" H 4750 1800 50  0001 C CNN
	1    4750 1600
	-1   0    0    -1  
$EndComp
$Comp
L CO2Mofetten:Sensirion_SCD30 P5
U 1 1 5E3B11BF
P 6300 1650
F 0 "P5" H 6083 2175 50  0000 C CNN
F 1 "SCD30" H 6083 2084 50  0000 C CNN
F 2 "CO2Mofetten:Sensirion_SCD30_45deg" H 6300 1850 50  0001 C CNN
F 3 "" H 6300 1850 50  0001 C CNN
	1    6300 1650
	-1   0    0    -1  
$EndComp
Wire Wire Line
	10050 1550 10750 1550
Wire Wire Line
	10050 1450 10750 1450
Wire Wire Line
	10050 1350 10600 1350
Wire Wire Line
	10050 1650 10450 1650
Wire Wire Line
	6650 1550 7250 1550
Wire Wire Line
	6650 1450 7250 1450
Wire Wire Line
	6650 1350 7100 1350
Wire Wire Line
	6650 1650 6950 1650
Wire Wire Line
	5100 1500 5450 1500
Wire Wire Line
	5100 1400 5450 1400
Wire Wire Line
	5100 1300 5300 1300
Wire Wire Line
	5100 1600 5250 1600
Wire Wire Line
	10050 4200 10750 4200
Wire Wire Line
	10050 4100 10550 4100
Wire Wire Line
	10050 4000 10500 4000
Wire Wire Line
	10050 4300 10300 4300
Wire Wire Line
	8450 4200 8850 4200
Wire Wire Line
	8450 4100 8750 4100
Wire Wire Line
	8450 4000 8700 4000
Wire Wire Line
	8450 4300 8550 4300
Wire Wire Line
	6650 4000 7000 4000
Wire Wire Line
	6650 4300 6850 4300
Wire Wire Line
	6650 4100 7050 4100
Wire Wire Line
	6650 4200 7250 4200
$Comp
L CO2Mofetten:Adafruit_TCA9548A P2
U 1 1 5E3AC638
P 2350 1850
F 0 "P2" H 2350 2625 50  0000 C CNN
F 1 "Multiplexer" H 2350 2534 50  0000 C CNN
F 2 "CO2Mofetten:Adafruit_TCA9548A_PinSocket" H 2500 2500 50  0001 C CNN
F 3 "" H 2500 2500 50  0001 C CNN
	1    2350 1850
	1    0    0    -1  
$EndComp
$Comp
L CO2Mofetten:Sensirion_SCD30 P4
U 1 1 5E3B40E6
P 4750 4300
F 0 "P4" H 4533 4825 50  0000 C CNN
F 1 "SCD30" H 4533 4734 50  0000 C CNN
F 2 "CO2Mofetten:Sensirion_SCD30_45deg" H 4750 4500 50  0001 C CNN
F 3 "" H 4750 4500 50  0001 C CNN
	1    4750 4300
	-1   0    0    -1  
$EndComp
Wire Wire Line
	5100 4300 5200 4300
Wire Wire Line
	5100 4000 5250 4000
Wire Wire Line
	5100 4100 5300 4100
Wire Wire Line
	5100 4200 5450 4200
Wire Wire Line
	1400 1500 1950 1500
Wire Wire Line
	1000 1400 1950 1400
Wire Wire Line
	1600 1700 1950 1700
Wire Wire Line
	1700 1600 1950 1600
Wire Wire Line
	1850 2200 1950 2200
Wire Wire Line
	1900 2500 1900 2700
Wire Wire Line
	1950 2500 1900 2500
Wire Wire Line
	7000 4000 7000 6100
Wire Wire Line
	1800 2400 1950 2400
Wire Wire Line
	2850 2700 2850 2400
Wire Wire Line
	2850 2400 2750 2400
Wire Wire Line
	2300 2700 2850 2700
Wire Wire Line
	2850 2400 2850 2200
Wire Wire Line
	2850 2200 2750 2200
Connection ~ 2850 2400
Wire Wire Line
	2850 2000 2750 2000
Wire Wire Line
	2850 2000 2850 2200
Connection ~ 2850 2200
Wire Wire Line
	2850 2000 2850 1800
Wire Wire Line
	2850 1800 2750 1800
Connection ~ 2850 2000
Wire Wire Line
	2850 1800 2850 1600
Wire Wire Line
	2850 1600 2750 1600
Connection ~ 2850 1800
Wire Wire Line
	2850 1600 2850 1400
Wire Wire Line
	2850 1400 2750 1400
Connection ~ 2850 1600
Wire Wire Line
	2750 1500 3900 1500
Wire Wire Line
	1900 2500 1900 2300
Connection ~ 1900 2500
Wire Wire Line
	2750 2500 3150 2500
Wire Wire Line
	2750 2300 3300 2300
Wire Wire Line
	2750 2100 3400 2100
Wire Wire Line
	2750 1900 3600 1900
Wire Wire Line
	2750 1700 3750 1700
Wire Wire Line
	2650 7000 3150 7000
$Comp
L power:+3.3V #PWR0103
U 1 1 60BFD3BA
P 1400 6550
F 0 "#PWR0103" H 1400 6400 50  0001 C CNN
F 1 "+3.3V" H 1415 6723 50  0000 C CNN
F 2 "" H 1400 6550 50  0001 C CNN
F 3 "" H 1400 6550 50  0001 C CNN
	1    1400 6550
	1    0    0    -1  
$EndComp
Wire Wire Line
	3150 7000 3150 7600
Wire Wire Line
	3150 7600 1400 7600
Wire Wire Line
	1400 7600 1400 6550
Connection ~ 3150 7000
Wire Wire Line
	3150 7000 5250 7000
Wire Wire Line
	1400 7600 1000 7600
Wire Wire Line
	1000 7600 1000 3950
Connection ~ 1400 7600
Connection ~ 1000 3950
$EndSCHEMATC
