EESchema Schematic File Version 4
EELAYER 30 0
EELAYER END
$Descr A4 11693 8268
encoding utf-8
Sheet 1 1
Title ""
Date "2020-08-12"
Rev "v0.0.0"
Comp ""
Comment1 ""
Comment2 ""
Comment3 ""
Comment4 ""
$EndDescr
$Comp
L CO2Mofetten:Adafruit_ADS1X15 U1
U 1 1 5F34297F
P 5450 3700
F 0 "U1" H 5894 3771 50  0000 L CNN
F 1 "Adafruit_ADS1X15" H 5894 3680 50  0000 L CNN
F 2 "CO2Mofetten:Adafruit_ADS1X15_PinSocket" H 5450 3750 50  0001 C CNN
F 3 "" H 5450 3750 50  0001 C CNN
	1    5450 3700
	1    0    0    -1  
$EndComp
Connection ~ 4050 3450
Wire Wire Line
	4050 3450 4050 3550
Wire Wire Line
	4050 3750 4150 3750
Wire Wire Line
	4150 3750 4150 3450
Wire Wire Line
	4150 3450 4050 3450
Wire Wire Line
	4050 3650 4650 3650
Wire Wire Line
	4650 3650 4650 3550
Wire Wire Line
	4650 3550 5050 3550
Wire Wire Line
	4050 3850 4850 3850
Wire Wire Line
	4850 3850 4850 3650
Wire Wire Line
	4850 3650 5050 3650
NoConn ~ 5050 3750
NoConn ~ 5850 3650
$Comp
L Connector:Screw_Terminal_01x02 J2
U 1 1 5F3439D5
P 5400 4650
F 0 "J2" H 5480 4642 50  0000 L CNN
F 1 "Screw_Terminal_01x02" H 5480 4551 50  0000 L CNN
F 2 "TerminalBlock_Phoenix:TerminalBlock_Phoenix_MKDS-1,5-2-5.08_1x02_P5.08mm_Horizontal" H 5400 4650 50  0001 C CNN
F 3 "~" H 5400 4650 50  0001 C CNN
	1    5400 4650
	1    0    0    -1  
$EndComp
$Comp
L Device:R R1
U 1 1 5F347892
P 4750 4400
F 0 "R1" V 4543 4400 50  0000 C CNN
F 1 "100" V 4634 4400 50  0000 C CNN
F 2 "Resistor_THT:R_Axial_DIN0207_L6.3mm_D2.5mm_P7.62mm_Horizontal" V 4680 4400 50  0001 C CNN
F 3 "~" H 4750 4400 50  0001 C CNN
	1    4750 4400
	0    1    1    0   
$EndComp
Wire Wire Line
	3050 4250 3050 3000
Wire Wire Line
	3050 3000 4050 3000
Wire Wire Line
	4050 3950 4250 3950
Wire Wire Line
	4500 3950 4500 3150
Wire Wire Line
	4500 3150 5500 3150
Wire Wire Line
	5500 3150 5500 3250
Wire Wire Line
	5400 3250 5400 3000
Wire Wire Line
	5400 3000 4050 3000
Connection ~ 4050 3000
Wire Wire Line
	5500 3150 6050 3150
Wire Wire Line
	6050 3150 6050 4400
Wire Wire Line
	6050 4400 5200 4400
Wire Wire Line
	5200 4400 5200 4650
Connection ~ 5500 3150
Wire Wire Line
	5200 4750 4900 4750
Wire Wire Line
	4900 4750 4900 4500
Wire Wire Line
	4600 4400 4350 4400
Wire Wire Line
	4350 4400 4350 4250
Wire Wire Line
	5350 4100 5350 4150
Wire Wire Line
	5350 4150 4800 4150
Wire Wire Line
	4800 4150 4800 3950
Wire Wire Line
	4800 3950 4500 3950
Connection ~ 4500 3950
Wire Wire Line
	5450 4100 5450 4250
Wire Wire Line
	5450 4250 4350 4250
Connection ~ 4350 4250
Wire Wire Line
	5550 4100 5550 4300
Wire Wire Line
	5550 4300 5000 4300
Wire Wire Line
	5000 4300 5000 4500
Wire Wire Line
	5000 4500 4900 4500
Connection ~ 4900 4500
Wire Wire Line
	4900 4500 4900 4400
Wire Wire Line
	5650 4100 5650 4250
Wire Wire Line
	5650 4250 5450 4250
Connection ~ 5450 4250
$Comp
L power:GND #PWR0101
U 1 1 5F34DF0B
P 3200 4550
F 0 "#PWR0101" H 3200 4300 50  0001 C CNN
F 1 "GND" H 3205 4377 50  0000 C CNN
F 2 "" H 3200 4550 50  0001 C CNN
F 3 "" H 3200 4550 50  0001 C CNN
	1    3200 4550
	1    0    0    -1  
$EndComp
Wire Wire Line
	3200 4550 3200 4250
Connection ~ 3200 4250
Wire Wire Line
	3200 4250 3050 4250
$Comp
L power:+3.3V #PWR0102
U 1 1 5F34ECE9
P 4250 2600
F 0 "#PWR0102" H 4250 2450 50  0001 C CNN
F 1 "+3.3V" H 4265 2773 50  0000 C CNN
F 2 "" H 4250 2600 50  0001 C CNN
F 3 "" H 4250 2600 50  0001 C CNN
	1    4250 2600
	1    0    0    -1  
$EndComp
$Comp
L power:+5V #PWR0103
U 1 1 5F351085
P 4600 2600
F 0 "#PWR0103" H 4600 2450 50  0001 C CNN
F 1 "+5V" H 4615 2773 50  0000 C CNN
F 2 "" H 4600 2600 50  0001 C CNN
F 3 "" H 4600 2600 50  0001 C CNN
	1    4600 2600
	1    0    0    -1  
$EndComp
Wire Wire Line
	4250 2600 4250 3950
Connection ~ 4250 3950
Wire Wire Line
	4250 3950 4500 3950
Connection ~ 3850 4250
Connection ~ 4050 3350
Connection ~ 3450 4250
Wire Wire Line
	3450 4250 3200 4250
Wire Wire Line
	4350 4250 3850 4250
Wire Wire Line
	3750 4250 3850 4250
Connection ~ 3750 4250
Connection ~ 3550 4250
Wire Wire Line
	3550 4250 3750 4250
Wire Wire Line
	3450 4250 3550 4250
Wire Wire Line
	4050 3000 4050 3350
Wire Wire Line
	4050 3350 4050 3450
$Comp
L CO2Mofetten:RJ45SensorCableConnector J1
U 1 1 5F342402
P 3650 3750
F 0 "J1" H 3707 4417 50  0000 C CNN
F 1 "RJ45SensorCableConnector" H 3707 4326 50  0000 C CNN
F 2 "CO2Mofetten:RJ45_econ_MEB8.8PG_Horizontal" V 3650 3775 50  0001 C CNN
F 3 "~" V 3650 3775 50  0001 C CNN
	1    3650 3750
	1    0    0    -1  
$EndComp
Wire Wire Line
	4600 2600 4600 4050
Wire Wire Line
	4600 4050 4050 4050
$EndSCHEMATC
