ref_number;ref
[1];Standish, E. M. 1998. JPL Planetary and Lunar Ephemerides, DE405/LE405.
[2];Bills, B.G. and Ferrari, A.J. 1977. 'A Harmonic Analysis of Lunar Topography', Icarus 31, 244-259.
[3];Explanatory Supplement to the Astronomical Almanac 1992. (P. K. Seidelmann Ed.) University Science Books, Mill Valley, CA.
[4];Jacobson, R. A. 2010. 'The Orbits and Masses of the Martian Satellites and the Libration of Phobos', AJ 139, 668-679.
[5];Thomas, P.C. 1989b. 'Shapes of Small Satellites', Icarus 77, 248-274.
[6];Zellner, B., and Capen, R. C. 1974. 'Photometric Properties of the Martian Satellites', Icarus 23, 437-444.
[7];Thomas, P. C., Adinolfi, D., Helfenstein, P., Simonelli, D. and Veverka, J. 1996. 'The Surface of Deimos: Contribution of Materials and Processes to Its Unique Appearance', Icarus 123, 536-556.
[8];Jacobson, R. A. 2003b. private communication of constants used in the JUP230 ephemeris
[9];Thomas, P. C., Davies, M. E., Colvin, T. R., Oberst, J., Schuster, P., Neukum, G., Carr, M. H., McEwen, A., Schubert, G., Belton, M. J. S., and the Galileo Imaging Team 1998, 'The Shape of Io from Galileo Limb Measurements', Icarus 135, 175-180.
[10];Thomas, P.C. 2002. private communication of limb fit results
[11];Anderson, J. D., Jacobson, R. A., Lau, E. L., Moore, W. B., Olsen, O., Schubert, G., and Thomas, P. C. 2000. 'Shape, Mean Radius, Gravity Field and Interior Structure of Ganymede', Bulletin of the American Astronomical Society 33(3), 1101.
[12];Anderson, J.D., Jacobson, R.A., McElrath, T. P., Schubert,G., Moore, W.B., and Thomas, P. C. 2000a. 'Shape, Mean Radius, Gravity Field and Interior Structure of Callisto', Icarus 153, 157-161.
[13];Thomas, P.C. 2002. private communication of Amalthea volume based on its shape model
[14];Morrison, D., N. D. Morrison, and Lazarewicz, A. R. 1974. 'Four color photometry of the Galilean satellites', Icarus 23, 399-416.
[15];Thomas, P. and Veverka, J. 1982. 'Amalthea', In Satellites of Jupiter (D. Morrison Eds.) pp. 147-173. Univ. of Arizona Press, Tucson.
[16];Simonelli, D. P. and Veverka, J. 1984. 'Voyager Disk-Integrated Photometry of Io', Icarus 59, 406-425.
[17];Buratti, B. and Veverka, J. 1983. 'Voyager Photometry of Europa', Icarus 55, 93-110. (average of leading and trailing hemisphere values)
[18];Morrison, D. and Morrison, N. D. 1977. 'Photometry of the Galilean Satellites', In Planetary Satellites (J. A. Burns, Ed.) pp. 363-378. Univ. of Arizona Press, Tucson.
[19];Simonelli, D. P., Rossier, L., Thomas, P. C., Veverka, J., Burns, J. A., and Belton, M. J. S. 2000. 'Leading/Trailing Albedo Asymmetries of Thebe, Amalthea, and Metis', Icarus 147, 353-365.
[20];Rettig, T. W. and Walsh, K. W. 2001. 'Implied Evolutionary Differences of the Jovian Irregular Satellites from a BVR Color Survey', presented at Jupiter: Planet, Satellites, and Magnetosphere, Boulder Colorado
[21];Thomas, P. C., Burns, J. A., Rossier, L., Simonelli, D., Veverka, J., Chapman, C. R., Klaasen, K., Johnson, T. V., and Belton, M. J. S. 1998. 'The Small Inner Satellites of Jupiter', Icarus 135, 360-371.
[22];Veverka, J., Thomas, P., and Synnott, S. 1982. 'The Inner Satellites of Jupiter', Vistas in Astronomy 25, 245-262.
[23];Gladman, B. J. 2000. IAU Circular 7472
[24];Jewitt, D. C. 2001. personal communication
[25];Sheppard, S. S. 2010. http://www.dtm.ciw.edu/users/sheppard/satellites/jupsatdata.html
[26];Rettig, T. W., Walsh, K., and Consolmagno, G. 2001. 'Implied Evolutionary Differences of the Jovian Irregular Satellites from a BVR Color Survey', Icarus 154, 313-320.
[27];Jacobson, R. A., Antreasian, P. G., Ardalan, S., Criddle, K. E., Ionasescu, R., Jones, J. B., Parcher, D., Pelletier, F. J., Roth, D. C., Thompson, P., Vaughan, A. 2008. 'The Gravity Gield of the Saturnian System and the Orbits of the Major Saturnian satellites', Presented at the Saturn After Cassini-Huygens Symposium held at Imperial College London, UK
[28];Thomas, P. C., Burns, J. A., Helfenstein, P., Squyres, S., Veverka, J., Porco, C., Turtle, E. P., McEwen, A., Denk, T., Giese, B., Roatsch, T., Johnson, T. V., Jacobson, R. A. 2007. 'Shapes of the Saturnian icy satellites and their significance', Icarus 190, 573-584.
[29];Morrison, D., Johnson, T. V., Shoemaker, E. M., Soderbloom, L. A., Thomas, P., Veverka, J., and Smith, B. A. 1984. 'Satellites of Saturn: Geological Perspective', In Saturn (T. Gehrels and M. S. Matthews Eds.) pp. 609-639. Univ. of Arizona Press, Tucson.
[30];Simonelli, D. P., Kay, J., Adinolfi, D., Veverka, J., Thomas, P. C., and Helfenstein, P. 1999. 'Phoebe: Albedo Map and Photometric Properties', Icarus 138, 249-258.
[31];Jacobson, R. A., Spitale, J., Porco, C. C., Beurle, K., Cooper, N. J., Evans, M. W., Murray, C. D. 2008. 'Revised Orbits of Saturn's Small Inner Satellites', AJ 135, 261-263.
[32];Porco, C. C., Weiss, J. W. , Thomas, P. C., Richardson, D. C., Jacobson, R. A., Spitale, J. 2006. 'Physical Characteristics and Possible Accretionary Origins for Saturn's Small Satellites', Presented at the 37th Lunar and Planetary Science Conference, League City, TX
[33];Nicholson, P. D. 2001. private communication
[34];Grav, T., Holman, M. J., Gladman, B. J., and Aksnes, K. 2003. 'Photometric survey of the irregular satellites', Icarus 166, 33-45.
[35];Sheppard, S. S. 2010. http://www.dtm.ciw.edu/users/sheppard/satellites/satsatdata.html
[36];Jacobson, R. A. 2007. 'The Gravity Field of the Uranian System and the Orbits of the Uranian Satellites and Rings', BAAS 39, 453.
[37];Thomas, P.C. 1988. 'Radii, shapes, and topography of the satellites of Uranus from limb coordinates', Icarus 73, 427-441.
[38];Karkoschka, E. 2001a. 'Comprehensive Phometry of the Rings and 16 Satellites of Uranus with the Hubble Space Telescope', Icarus 151, 51-68.
[39];Veverka, J., Brown, R. H., and Bell, J. F. 1991. 'Uranus Satellites: Surface Properties', In Uranus (J. T. Bergstralh, E. D. Miner, and M. S. Matthews Eds.) pp. 528-560. Univ. of Arizona Press, Tucson.
[40];Karkoschka, E. 2001b. 'Voyager's Eleventh Discovery of a Satellite of Uranus and Phometry and the First Size Measurements of Nine Satellites', Icarus 151, 69-77
[41];Thomas, P.C., Weitz, C., and Veverka, J. 1989a. 'Small satellites of Uranus Disk-integrated photometry and estimated radii', Icarus 81, 92-101.
[42];Sheppard, S. S., Jewitt, D., Kleyna, J. 2005. 'An Ultradeep Survey for Irregular Satellites of Uranus: Limits to Completeness', Astronomical Journal 129, 518-525.
[43];Jacobson, R. A. 2009. 'The Orbits of the Neptunian Satellites and the Orientation of the Pole of Neptune', AJ137, 4322.
[44];Thomas, P. C. 2000. 'The Shape of Triton from Limb Profiles', Icarus 148, 587-588.
[45];Jacobson, R. A. 2008. 'Reconstruction of the Voyager~2 Neptune Encounter in the ICRF System', AIAA Paper~2008-7372 presented at the AIAA/AAS Astrodynamics Specialist Conference, Honolulu, HI
[46];Hicks, M. D, and Buratti, B. J. 2004. 'The spectral variability of Triton from 1997--2000', Icarus 171, 210-218.
[47];Thomas, P., Veverka, J., and Helfenstein, P. 1991b. 'Voyager Observations of Nereid', Journal of Geophysical Research 96(19), 253-19, 259.
[48];Karkoschka, E. 2003. 'Sizes, shapes, and albedos of the inner satellites of Neptune', Icarus 162, 400-407
[49];Sheppard, S. S., Jewitt, D., and Kleyna, J. 2006. 'A Survey for Normal Irregular Satellites around Neptune: Limits to Completeness', Astronomical Journal 132, 171-176.
[50];Jacobson, R. A. 2007. private communication of constants used in the PLU017 ephemeris
[51];Sicardy, B., et al. 2006. 'Charon's size and an upper limit on its atmosphere from a stellar occultation', Nature 439, 52-54.
[52];Reinsch, K., Burwitz, V., and Festou, M. C. 1994. 'Albedo Maps of Pluto and Improved Physical Parameters of the Pluto-Charon System', Icarus 108, 209-218.
[53];Tholen, D.~J., Buie, M.~W., Grundy, W.~M., Elliott, G.~T. 2008. 'Masses of Nix and Hydra', AJ 135, 777-784.
[54];Thomas, P. C. 2010. 'Sizes, shapes, and derived properties of the saturnian satellites after the Cassini nominal mission', Icarus 208, 395-401.
[55];Zebker, H. A. and Stiles, B. and Hensley, S. Lorenz, R. and Kirk, R. L. and Lunine, J. 2009. 'Size and Shape of Saturn's Moon Titan', Science 324, 921-923.
[56];Hedman, M. M., Cooper, N. J., Murray, C. D., Beurle, K., Evans, M. W., Tiscareno, M. S., and Burns, J. A. 2010. 'Aegaeon (Saturn LIII), a G-ring object', Icarus 207, 433-447.
[57];Cooper, N. J., Murray, C. D., Evans, M. W., Beurle, K., Jacobson, R. A., and Porco, C. C. 2008. 'Astrometry and dynamics of Anthe (S/2007 S4), a new satellite of Saturn', Icarus 195, 765-777.
[58];Weaver, H. A., et al. 2005. IAU Circular 8625
[59];Verbiscer, A., French, R., Showalter, M., and Helfenstein, P. 2007. 'Enceladus: Cosmic Graffiti Artist Caught in the Act', Science 315, 815.
[60];Alexandersen, M., Gladman, B., Veillet, C., Jacobson, R., Brozovic, M., and Rousselot, P. 2012. 'Discovery of two additional Jovian irregulars', Astronomical Journal 144, 21.
[61];Sheppard, S. S. 2012. 'New Satellites of Jupiter: S/2011 J 1 and S/2011 J 2', Central Bureau Electronic Telegrams 3002
[62];Showalter, M. R., de Pater, I., Lissauer, J. J., French, R. S. 2013. 'New Satellite of Neptune: S/2004 N 1', Central Bureau Electronic Telegrams 3586
[63];Weaver, H. A., Stern, S. A., Mutchler, M. J., Steffl, A. J., Buie, M. W., Merline, W. J., Spencer, J. R., Young, E. F., and Young, L. A. 2006. 'Discovery of two new satellites of Pluto', Nature 439, 943.
[64];Showalter, M. R., Hamilton, D. P., Stern, S. A., Weaver, H. A., Steffl, A. J., and Young, L. A. 2011. 'New Satellite of (134340) Pluto: S/2011 (134340) 1', IAU Circular 9221
[65];Showalter, M. R., Weaver, H. A., Stern, S. A., Steffl, A. J., Buie, M. W., Merline, W. J., Mutchler, M. J., Soummer, R., and Throop, H. B. 2012. 'New Satellite of (134340) Pluto: S/2012 (134340) 1', IAU Circular 9253
[66];Brozovic, M. and Jacobson, R. A. 2013. 'The Orbits, Masses of Pluto's Satellites', Presented at The Pluto System on the Eve of Exploration by New Horizons: Perspectives, Predictions held at APL, Laurel, MD
[67];Showalter, M. R. and Lissauer, J. J. 2006. 'The Second Ring-Moon System of Uranus: Discovery and Dynamics', Science 311, 973.
