Sat.;GM;GM (precision);GM (unit);GM (ref);Mean radius;Mean radius (precision);Mean radius (unit);Mean radius (ref);Mean density;Mean density (precision);Mean density (unit);Mean density (ref);Magnitude;Magnitude (precision);Magnitude (unit);Magnitude (ref);Geometric;Geometric (precision);Geometric (unit);Geometric (ref);NAIF_ID
Triton;1427.6;1.9;km3/s2;[43];1353.4;0.9;km;[44];2.059;0.005;g/cm3;;13.54;;V0;[46];0.719;;Albedo;[46];801
Nereid;2.06;;km3/s2;;170;25;km;[47];1.5;;g/cm3;;19.2;;R;[48];0.155;;Albedo;[47];802
Naiad;0.013;;km3/s2;;33;3;km;[48];1.3;;g/cm3;;23.91;;V0;[48];0.072;;Albedo;[48];803
Thalassa;0.025;;km3/s2;;41;3;km;[48];1.3;;g/cm3;;23.32;;V0;[48];0.091;;Albedo;[48];804
Despina;0.14;;km3/s2;;75;3;km;[48];1.3;;g/cm3;;22.00;;V0;[48];0.090;;Albedo;[48];805
Galatea;0.25;;km3/s2;;88;4;km;[48];1.3;;g/cm3;;21.85;;V0;[48];0.079;;Albedo;[48];806
Larissa;0.33;;km3/s2;;97;3;km;[48];1.3;;g/cm3;;21.49;;V0;[48];0.091;;Albedo;[48];807
Proteus;3.36;;km3/s2;;210;7;km;[48];1.3;;g/cm3;;19.75;;V0;[48];0.096;;Albedo;[48];808
Halimede;0.012;;km3/s2;;31.0;;km;[49];1.5;;g/cm3;;24.5;;R;[49];0.04;;Albedo;[49];809
Psamathe;0.0033;;km3/s2;;20.0;;km;[49];1.5;;g/cm3;;25.5;;R;[49];0.04;;Albedo;[49];810
Sao;0.0045;;km3/s2;;22.0;;km;[49];1.5;;g/cm3;;25.5;;R;[49];0.04;;Albedo;[49];811
Laomedeia;0.0039;;km3/s2;;21.0;;km;[49];1.5;;g/cm3;;25.5;;R;[49];0.04;;Albedo;[49];812
Neso;0.011;;km3/s2;;30.0;;km;[49];1.5;;g/cm3;;24.6;;R;[49];0.04;;Albedo;[49];813
S/2004 N1;0.0003;;km3/s2;;9.0;;km;[62];1.3;;g/cm3;;26.5;;V0;[62];0.10;;Albedo;[62];
