Sat.;GM;GM (precision);GM (unit);GM (ref);Mean radius;Mean radius (precision);Mean radius (unit);Mean radius (ref);Mean density;Mean density (precision);Mean density (unit);Mean density (ref);Magnitude;Magnitude (precision);Magnitude (unit);Magnitude (ref);Geometric;Geometric (precision);Geometric (unit);Geometric (ref);NAIF_ID
Charon;102.3;0.2;km3/s2;[66];603.6;1.4;km;[51];1.664;0.012;g/cm3;;17.26;0.01;R;[52];0.372;0.012;Albedo;[52];901
Nix;0.0013;0.0023;km3/s2;[66];23.0;2.0;km;[63];2.1;;g/cm3;;23.4;0.2;V0;[63];0.35;;Albedo;[63];902
Hydra;0.0065;0.0022;km3/s2;[66];30.5;4.0;km;[63];0.8;;g/cm3;;22.9;0.1;V0;[63];0.35;;Albedo;[63];903
Kerberos;0.0011;0.0005;km3/s2;[66];14.0;;km;[64];1.4;;g/cm3;;26.1;0.3;V0;[64];0.35;;Albedo;[64];904
Styx;0.0000;0.0008;km3/s2;[66];10.0;;km;[65];;;g/cm3;;27.0;0.3;V0;[65];0.35;;Albedo;[65];905
