<?xml version="1.0" encoding="UTF-8" standalone="no"?><svg xmlns="http://www.w3.org/2000/svg" xmlns:xlink="http://www.w3.org/1999/xlink" contentScriptType="application/ecmascript" contentStyleType="text/css" height="485px" preserveAspectRatio="none" style="width:297px;height:485px;background:#FFFFFF;" version="1.1" viewBox="0 0 297 485" width="297px" zoomAndPan="magnify"><defs><filter height="300%" id="fwwo6cdzavxg6" width="300%" x="-1" y="-1"><feGaussianBlur result="blurOut" stdDeviation="2.0"/><feColorMatrix in="blurOut" result="blurOut2" type="matrix" values="0 0 0 0 0 0 0 0 0 0 0 0 0 0 0 0 0 0 .4 0"/><feOffset dx="4.0" dy="4.0" in="blurOut2" result="blurOut3"/><feBlend in="SourceGraphic" in2="blurOut3" mode="normal"/></filter></defs><g><ellipse cx="145.5" cy="20" fill="#000000" filter="url(#fwwo6cdzavxg6)" rx="10" ry="10" style="stroke:none;stroke-width:1.0;"/><rect fill="#FEFECE" filter="url(#fwwo6cdzavxg6)" height="33.9688" rx="12.5" ry="12.5" style="stroke:#A80036;stroke-width:1.5;" width="183" x="54" y="50"/><text fill="#000000" font-family="sans-serif" font-size="12" lengthAdjust="spacing" textLength="163" x="64" y="71.1387">Main instantiates OutputList</text><rect fill="#FEFECE" filter="url(#fwwo6cdzavxg6)" height="33.9688" rx="12.5" ry="12.5" style="stroke:#A80036;stroke-width:1.5;" width="269" x="11" y="103.9688"/><text fill="#000000" font-family="sans-serif" font-size="12" lengthAdjust="spacing" textLength="249" x="21" y="125.1074">Main hands over OutputList to all sensors</text><rect fill="#FEFECE" filter="url(#fwwo6cdzavxg6)" height="33.9688" rx="12.5" ry="12.5" style="stroke:#A80036;stroke-width:1.5;" width="166" x="62.5" y="201.9375"/><text fill="#000000" font-family="sans-serif" font-size="12" lengthAdjust="spacing" textLength="146" x="72.5" y="223.0762">simulate one sensor run</text><rect fill="#FEFECE" filter="url(#fwwo6cdzavxg6)" height="47.9375" rx="12.5" ry="12.5" style="stroke:#A80036;stroke-width:1.5;" width="194" x="48.5" y="256.4219"/><text fill="#000000" font-family="sans-serif" font-size="12" lengthAdjust="spacing" textLength="170" x="58.5" y="277.5605">write sensor output into dict</text><text fill="#000000" font-family="sans-serif" font-size="12" lengthAdjust="spacing" textLength="133" x="62.5" y="291.5293">OutputList.safe_output</text><polygon fill="#FEFECE" filter="url(#fwwo6cdzavxg6)" points="145.5,157.9375,157.5,169.9375,145.5,181.9375,133.5,169.9375,145.5,157.9375" style="stroke:#A80036;stroke-width:1.5;"/><polygon fill="#FEFECE" filter="url(#fwwo6cdzavxg6)" points="67,324.3594,224,324.3594,236,336.3594,224,348.3594,67,348.3594,55,336.3594,67,324.3594" style="stroke:#A80036;stroke-width:1.5;"/><text fill="#000000" font-family="sans-serif" font-size="11" lengthAdjust="spacing" textLength="21" x="149.5" y="358.5698">yes</text><text fill="#000000" font-family="sans-serif" font-size="11" lengthAdjust="spacing" textLength="157" x="67" y="340.1675">Sensor simulation finished?</text><text fill="#000000" font-family="sans-serif" font-size="11" lengthAdjust="spacing" textLength="14" x="236" y="333.7651">no</text><rect fill="#FEFECE" filter="url(#fwwo6cdzavxg6)" height="47.9375" rx="12.5" ry="12.5" style="stroke:#A80036;stroke-width:1.5;" width="255" x="18" y="380.0698"/><text fill="#000000" font-family="sans-serif" font-size="12" lengthAdjust="spacing" textLength="180" x="28" y="401.2085">Main writes dict into database</text><text fill="#000000" font-family="sans-serif" font-size="12" lengthAdjust="spacing" textLength="231" x="32" y="415.1772">OutputList.write_into_sensor_database</text><ellipse cx="145.5" cy="458.0073" fill="#FFFFFF" filter="url(#fwwo6cdzavxg6)" rx="10" ry="10" style="stroke:#000000;stroke-width:1.5;"/><line style="stroke:#000000;stroke-width:2.5;" x1="139.3128" x2="151.6872" y1="451.8201" y2="464.1945"/><line style="stroke:#000000;stroke-width:2.5;" x1="151.6872" x2="139.3128" y1="451.8201" y2="464.1945"/><line style="stroke:#A80036;stroke-width:1.5;" x1="145.5" x2="145.5" y1="30" y2="50"/><polygon fill="#A80036" points="141.5,40,145.5,50,149.5,40,145.5,44" style="stroke:#A80036;stroke-width:1.0;"/><line style="stroke:#A80036;stroke-width:1.5;" x1="145.5" x2="145.5" y1="83.9688" y2="103.9688"/><polygon fill="#A80036" points="141.5,93.9688,145.5,103.9688,149.5,93.9688,145.5,97.9688" style="stroke:#A80036;stroke-width:1.0;"/><line style="stroke:#A80036;stroke-width:1.5;" x1="145.5" x2="145.5" y1="235.9063" y2="256.4219"/><polygon fill="#A80036" points="141.5,246.4219,145.5,256.4219,149.5,246.4219,145.5,250.4219" style="stroke:#A80036;stroke-width:1.0;"/><line style="stroke:#A80036;stroke-width:1.5;" x1="145.5" x2="145.5" y1="181.9375" y2="201.9375"/><polygon fill="#A80036" points="141.5,191.9375,145.5,201.9375,149.5,191.9375,145.5,195.9375" style="stroke:#A80036;stroke-width:1.0;"/><line style="stroke:#A80036;stroke-width:1.5;" x1="236" x2="254.5" y1="336.3594" y2="336.3594"/><polygon fill="#A80036" points="250.5,255.9063,254.5,245.9063,258.5,255.9063,254.5,251.9063" style="stroke:#A80036;stroke-width:1.5;"/><line style="stroke:#A80036;stroke-width:1.5;" x1="254.5" x2="254.5" y1="169.9375" y2="336.3594"/><line style="stroke:#A80036;stroke-width:1.5;" x1="254.5" x2="157.5" y1="169.9375" y2="169.9375"/><polygon fill="#A80036" points="167.5,165.9375,157.5,169.9375,167.5,173.9375,163.5,169.9375" style="stroke:#A80036;stroke-width:1.0;"/><line style="stroke:#A80036;stroke-width:1.5;" x1="145.5" x2="145.5" y1="304.3594" y2="324.3594"/><polygon fill="#A80036" points="141.5,314.3594,145.5,324.3594,149.5,314.3594,145.5,318.3594" style="stroke:#A80036;stroke-width:1.0;"/><line style="stroke:#A80036;stroke-width:1.5;" x1="145.5" x2="145.5" y1="137.9375" y2="157.9375"/><polygon fill="#A80036" points="141.5,147.9375,145.5,157.9375,149.5,147.9375,145.5,151.9375" style="stroke:#A80036;stroke-width:1.0;"/><line style="stroke:#A80036;stroke-width:1.5;" x1="145.5" x2="145.5" y1="348.3594" y2="380.0698"/><polygon fill="#A80036" points="141.5,370.0698,145.5,380.0698,149.5,370.0698,145.5,374.0698" style="stroke:#A80036;stroke-width:1.0;"/><line style="stroke:#A80036;stroke-width:1.5;" x1="145.5" x2="145.5" y1="428.0073" y2="448.0073"/><polygon fill="#A80036" points="141.5,438.0073,145.5,448.0073,149.5,438.0073,145.5,442.0073" style="stroke:#A80036;stroke-width:1.0;"/><!--MD5=[a675293e3d10c0be8e2b0d10220117df]
@startuml
start 
:Main instantiates OutputList;
:Main hands over OutputList to all sensors;
repeat 
    :simulate one sensor run;
    :write sensor output into dict \n OutputList.safe_output;

repeat while (Sensor simulation finished?) is (no) not (yes)
:Main writes dict into database \n OutputList.write_into_sensor_database;
end
@enduml

PlantUML version 1.2021.10beta2(Unknown compile time)
(GPL source distribution)
Java Runtime: Java(TM) SE Runtime Environment
JVM: Java HotSpot(TM) 64-Bit Server VM
Default Encoding: UTF-8
Language: en
Country: US
--></g></svg>