<?xml version="1.0" encoding="UTF-8" standalone="no"?><svg xmlns="http://www.w3.org/2000/svg" xmlns:xlink="http://www.w3.org/1999/xlink" contentScriptType="application/ecmascript" contentStyleType="text/css" height="541px" preserveAspectRatio="none" style="width:1425px;height:541px;background:#FFFFFF;" version="1.1" viewBox="0 0 1425 541" width="1425px" zoomAndPan="magnify"><defs><filter height="300%" id="f1hej3mimd95vd" width="300%" x="-1" y="-1"><feGaussianBlur result="blurOut" stdDeviation="2.0"/><feColorMatrix in="blurOut" result="blurOut2" type="matrix" values="0 0 0 0 0 0 0 0 0 0 0 0 0 0 0 0 0 0 .4 0"/><feOffset dx="4.0" dy="4.0" in="blurOut2" result="blurOut3"/><feBlend in="SourceGraphic" in2="blurOut3" mode="normal"/></filter></defs><g><!--MD5=[335f4d9be48430461c68bf6d6fdba145]
class App--><rect fill="#FEFECE" filter="url(#f1hej3mimd95vd)" height="48" id="App" style="stroke:#A80036;stroke-width:1.5;" width="56" x="271" y="7"/><ellipse cx="286" cy="23" fill="#ADD1B2" rx="11" ry="11" style="stroke:#A80036;stroke-width:1.0;"/><path d="M288.3438,18.6719 C287.4063,18.2344 286.8125,18.0938 285.9375,18.0938 C283.3125,18.0938 281.3125,20.1719 281.3125,22.8906 L281.3125,24.0156 C281.3125,26.5938 283.4219,28.4844 286.3125,28.4844 C287.5313,28.4844 288.6875,28.1875 289.4375,27.6406 C290.0156,27.2344 290.3438,26.7813 290.3438,26.3906 C290.3438,25.9375 289.9531,25.5469 289.4844,25.5469 C289.2656,25.5469 289.0625,25.625 288.875,25.8125 C288.4219,26.2969 288.4219,26.2969 288.2344,26.3906 C287.8125,26.6563 287.125,26.7813 286.3594,26.7813 C284.3125,26.7813 283.0156,25.6875 283.0156,23.9844 L283.0156,22.8906 C283.0156,21.1094 284.2656,19.7969 286,19.7969 C286.5781,19.7969 287.1875,19.9531 287.6563,20.2031 C288.1406,20.4844 288.3125,20.7031 288.4063,21.1094 C288.4688,21.5156 288.5,21.6406 288.6406,21.7656 C288.7813,21.9063 289.0156,22.0156 289.2344,22.0156 C289.5,22.0156 289.7656,21.875 289.9375,21.6563 C290.0469,21.5 290.0781,21.3125 290.0781,20.8906 L290.0781,19.4688 C290.0781,19.0313 290.0625,18.9063 289.9688,18.75 C289.8125,18.4844 289.5313,18.3438 289.2344,18.3438 C288.9375,18.3438 288.7344,18.4375 288.5156,18.75 L288.3438,18.6719 Z " fill="#000000"/><text fill="#000000" font-family="sans-serif" font-size="12" lengthAdjust="spacing" textLength="24" x="300" y="27.1543">App</text><line style="stroke:#A80036;stroke-width:1.5;" x1="272" x2="326" y1="39" y2="39"/><line style="stroke:#A80036;stroke-width:1.5;" x1="272" x2="326" y1="47" y2="47"/><!--MD5=[33439f2b7ee62ad9bc9a6f10fdc272a8]
class Tabs--><rect fill="#FEFECE" filter="url(#f1hej3mimd95vd)" height="48" id="Tabs" style="stroke:#A80036;stroke-width:1.5;" width="61" x="397.5" y="115"/><ellipse cx="412.5" cy="131" fill="#ADD1B2" rx="11" ry="11" style="stroke:#A80036;stroke-width:1.0;"/><path d="M414.8438,126.6719 C413.9063,126.2344 413.3125,126.0938 412.4375,126.0938 C409.8125,126.0938 407.8125,128.1719 407.8125,130.8906 L407.8125,132.0156 C407.8125,134.5938 409.9219,136.4844 412.8125,136.4844 C414.0313,136.4844 415.1875,136.1875 415.9375,135.6406 C416.5156,135.2344 416.8438,134.7813 416.8438,134.3906 C416.8438,133.9375 416.4531,133.5469 415.9844,133.5469 C415.7656,133.5469 415.5625,133.625 415.375,133.8125 C414.9219,134.2969 414.9219,134.2969 414.7344,134.3906 C414.3125,134.6563 413.625,134.7813 412.8594,134.7813 C410.8125,134.7813 409.5156,133.6875 409.5156,131.9844 L409.5156,130.8906 C409.5156,129.1094 410.7656,127.7969 412.5,127.7969 C413.0781,127.7969 413.6875,127.9531 414.1563,128.2031 C414.6406,128.4844 414.8125,128.7031 414.9063,129.1094 C414.9688,129.5156 415,129.6406 415.1406,129.7656 C415.2813,129.9063 415.5156,130.0156 415.7344,130.0156 C416,130.0156 416.2656,129.875 416.4375,129.6563 C416.5469,129.5 416.5781,129.3125 416.5781,128.8906 L416.5781,127.4688 C416.5781,127.0313 416.5625,126.9063 416.4688,126.75 C416.3125,126.4844 416.0313,126.3438 415.7344,126.3438 C415.4375,126.3438 415.2344,126.4375 415.0156,126.75 L414.8438,126.6719 Z " fill="#000000"/><text fill="#000000" font-family="sans-serif" font-size="12" lengthAdjust="spacing" textLength="29" x="426.5" y="135.1543">Tabs</text><line style="stroke:#A80036;stroke-width:1.5;" x1="398.5" x2="457.5" y1="147" y2="147"/><line style="stroke:#A80036;stroke-width:1.5;" x1="398.5" x2="457.5" y1="155" y2="155"/><!--MD5=[84718776d214be480e4c259efcb737fc]
class Main--><rect fill="#FEFECE" filter="url(#f1hej3mimd95vd)" height="48" id="Main" style="stroke:#A80036;stroke-width:1.5;" width="59" x="398.5" y="243"/><ellipse cx="413.5" cy="259" fill="#ADD1B2" rx="11" ry="11" style="stroke:#A80036;stroke-width:1.0;"/><path d="M415.8438,254.6719 C414.9063,254.2344 414.3125,254.0938 413.4375,254.0938 C410.8125,254.0938 408.8125,256.1719 408.8125,258.8906 L408.8125,260.0156 C408.8125,262.5938 410.9219,264.4844 413.8125,264.4844 C415.0313,264.4844 416.1875,264.1875 416.9375,263.6406 C417.5156,263.2344 417.8438,262.7813 417.8438,262.3906 C417.8438,261.9375 417.4531,261.5469 416.9844,261.5469 C416.7656,261.5469 416.5625,261.625 416.375,261.8125 C415.9219,262.2969 415.9219,262.2969 415.7344,262.3906 C415.3125,262.6563 414.625,262.7813 413.8594,262.7813 C411.8125,262.7813 410.5156,261.6875 410.5156,259.9844 L410.5156,258.8906 C410.5156,257.1094 411.7656,255.7969 413.5,255.7969 C414.0781,255.7969 414.6875,255.9531 415.1563,256.2031 C415.6406,256.4844 415.8125,256.7031 415.9063,257.1094 C415.9688,257.5156 416,257.6406 416.1406,257.7656 C416.2813,257.9063 416.5156,258.0156 416.7344,258.0156 C417,258.0156 417.2656,257.875 417.4375,257.6563 C417.5469,257.5 417.5781,257.3125 417.5781,256.8906 L417.5781,255.4688 C417.5781,255.0313 417.5625,254.9063 417.4688,254.75 C417.3125,254.4844 417.0313,254.3438 416.7344,254.3438 C416.4375,254.3438 416.2344,254.4375 416.0156,254.75 L415.8438,254.6719 Z " fill="#000000"/><text fill="#000000" font-family="sans-serif" font-size="12" lengthAdjust="spacing" textLength="27" x="427.5" y="263.1543">Main</text><line style="stroke:#A80036;stroke-width:1.5;" x1="399.5" x2="456.5" y1="275" y2="275"/><line style="stroke:#A80036;stroke-width:1.5;" x1="399.5" x2="456.5" y1="283" y2="283"/><!--MD5=[f93c64db2c03c2513478518370810cbf]
class PyQtGraph2dPlot--><rect fill="#FEFECE" filter="url(#f1hej3mimd95vd)" height="48" id="PyQtGraph2dPlot" style="stroke:#A80036;stroke-width:1.5;" width="132" x="362" y="7"/><ellipse cx="377" cy="23" fill="#ADD1B2" rx="11" ry="11" style="stroke:#A80036;stroke-width:1.0;"/><path d="M379.3438,18.6719 C378.4063,18.2344 377.8125,18.0938 376.9375,18.0938 C374.3125,18.0938 372.3125,20.1719 372.3125,22.8906 L372.3125,24.0156 C372.3125,26.5938 374.4219,28.4844 377.3125,28.4844 C378.5313,28.4844 379.6875,28.1875 380.4375,27.6406 C381.0156,27.2344 381.3438,26.7813 381.3438,26.3906 C381.3438,25.9375 380.9531,25.5469 380.4844,25.5469 C380.2656,25.5469 380.0625,25.625 379.875,25.8125 C379.4219,26.2969 379.4219,26.2969 379.2344,26.3906 C378.8125,26.6563 378.125,26.7813 377.3594,26.7813 C375.3125,26.7813 374.0156,25.6875 374.0156,23.9844 L374.0156,22.8906 C374.0156,21.1094 375.2656,19.7969 377,19.7969 C377.5781,19.7969 378.1875,19.9531 378.6563,20.2031 C379.1406,20.4844 379.3125,20.7031 379.4063,21.1094 C379.4688,21.5156 379.5,21.6406 379.6406,21.7656 C379.7813,21.9063 380.0156,22.0156 380.2344,22.0156 C380.5,22.0156 380.7656,21.875 380.9375,21.6563 C381.0469,21.5 381.0781,21.3125 381.0781,20.8906 L381.0781,19.4688 C381.0781,19.0313 381.0625,18.9063 380.9688,18.75 C380.8125,18.4844 380.5313,18.3438 380.2344,18.3438 C379.9375,18.3438 379.7344,18.4375 379.5156,18.75 L379.3438,18.6719 Z " fill="#000000"/><text fill="#000000" font-family="sans-serif" font-size="12" lengthAdjust="spacing" textLength="100" x="391" y="27.1543">PyQtGraph2dPlot</text><line style="stroke:#A80036;stroke-width:1.5;" x1="363" x2="493" y1="39" y2="39"/><line style="stroke:#A80036;stroke-width:1.5;" x1="363" x2="493" y1="47" y2="47"/><!--MD5=[6e93d543c1b993ff34dc546e12f90bf3]
class YamlEditorWindow--><rect fill="#FEFECE" filter="url(#f1hej3mimd95vd)" height="48" id="YamlEditorWindow" style="stroke:#A80036;stroke-width:1.5;" width="143" x="529.5" y="7"/><ellipse cx="544.5" cy="23" fill="#ADD1B2" rx="11" ry="11" style="stroke:#A80036;stroke-width:1.0;"/><path d="M546.8438,18.6719 C545.9063,18.2344 545.3125,18.0938 544.4375,18.0938 C541.8125,18.0938 539.8125,20.1719 539.8125,22.8906 L539.8125,24.0156 C539.8125,26.5938 541.9219,28.4844 544.8125,28.4844 C546.0313,28.4844 547.1875,28.1875 547.9375,27.6406 C548.5156,27.2344 548.8438,26.7813 548.8438,26.3906 C548.8438,25.9375 548.4531,25.5469 547.9844,25.5469 C547.7656,25.5469 547.5625,25.625 547.375,25.8125 C546.9219,26.2969 546.9219,26.2969 546.7344,26.3906 C546.3125,26.6563 545.625,26.7813 544.8594,26.7813 C542.8125,26.7813 541.5156,25.6875 541.5156,23.9844 L541.5156,22.8906 C541.5156,21.1094 542.7656,19.7969 544.5,19.7969 C545.0781,19.7969 545.6875,19.9531 546.1563,20.2031 C546.6406,20.4844 546.8125,20.7031 546.9063,21.1094 C546.9688,21.5156 547,21.6406 547.1406,21.7656 C547.2813,21.9063 547.5156,22.0156 547.7344,22.0156 C548,22.0156 548.2656,21.875 548.4375,21.6563 C548.5469,21.5 548.5781,21.3125 548.5781,20.8906 L548.5781,19.4688 C548.5781,19.0313 548.5625,18.9063 548.4688,18.75 C548.3125,18.4844 548.0313,18.3438 547.7344,18.3438 C547.4375,18.3438 547.2344,18.4375 547.0156,18.75 L546.8438,18.6719 Z " fill="#000000"/><text fill="#000000" font-family="sans-serif" font-size="12" lengthAdjust="spacing" textLength="111" x="558.5" y="27.1543">YamlEditorWindow</text><line style="stroke:#A80036;stroke-width:1.5;" x1="530.5" x2="671.5" y1="39" y2="39"/><line style="stroke:#A80036;stroke-width:1.5;" x1="530.5" x2="671.5" y1="47" y2="47"/><!--MD5=[8e0e47d14f33c6c8fe0604d21ca2204d]
class FluxgateMagnetometer--><rect fill="#FEFECE" filter="url(#f1hej3mimd95vd)" height="48" id="FluxgateMagnetometer" style="stroke:#A80036;stroke-width:1.5;" width="171" x="512.5" y="371"/><ellipse cx="527.5" cy="387" fill="#ADD1B2" rx="11" ry="11" style="stroke:#A80036;stroke-width:1.0;"/><path d="M529.8438,382.6719 C528.9063,382.2344 528.3125,382.0938 527.4375,382.0938 C524.8125,382.0938 522.8125,384.1719 522.8125,386.8906 L522.8125,388.0156 C522.8125,390.5938 524.9219,392.4844 527.8125,392.4844 C529.0313,392.4844 530.1875,392.1875 530.9375,391.6406 C531.5156,391.2344 531.8438,390.7813 531.8438,390.3906 C531.8438,389.9375 531.4531,389.5469 530.9844,389.5469 C530.7656,389.5469 530.5625,389.625 530.375,389.8125 C529.9219,390.2969 529.9219,390.2969 529.7344,390.3906 C529.3125,390.6563 528.625,390.7813 527.8594,390.7813 C525.8125,390.7813 524.5156,389.6875 524.5156,387.9844 L524.5156,386.8906 C524.5156,385.1094 525.7656,383.7969 527.5,383.7969 C528.0781,383.7969 528.6875,383.9531 529.1563,384.2031 C529.6406,384.4844 529.8125,384.7031 529.9063,385.1094 C529.9688,385.5156 530,385.6406 530.1406,385.7656 C530.2813,385.9063 530.5156,386.0156 530.7344,386.0156 C531,386.0156 531.2656,385.875 531.4375,385.6563 C531.5469,385.5 531.5781,385.3125 531.5781,384.8906 L531.5781,383.4688 C531.5781,383.0313 531.5625,382.9063 531.4688,382.75 C531.3125,382.4844 531.0313,382.3438 530.7344,382.3438 C530.4375,382.3438 530.2344,382.4375 530.0156,382.75 L529.8438,382.6719 Z " fill="#000000"/><text fill="#000000" font-family="sans-serif" font-size="12" lengthAdjust="spacing" textLength="139" x="541.5" y="391.1543">FluxgateMagnetometer</text><line style="stroke:#A80036;stroke-width:1.5;" x1="513.5" x2="682.5" y1="403" y2="403"/><line style="stroke:#A80036;stroke-width:1.5;" x1="513.5" x2="682.5" y1="411" y2="411"/><!--MD5=[fbc1d9eeb12a4a414f6d22ca0da6351f]
class MEMS3AxisGyroscope--><rect fill="#FEFECE" filter="url(#f1hej3mimd95vd)" height="48" id="MEMS3AxisGyroscope" style="stroke:#A80036;stroke-width:1.5;" width="167" x="718.5" y="371"/><ellipse cx="733.5" cy="387" fill="#ADD1B2" rx="11" ry="11" style="stroke:#A80036;stroke-width:1.0;"/><path d="M735.8438,382.6719 C734.9063,382.2344 734.3125,382.0938 733.4375,382.0938 C730.8125,382.0938 728.8125,384.1719 728.8125,386.8906 L728.8125,388.0156 C728.8125,390.5938 730.9219,392.4844 733.8125,392.4844 C735.0313,392.4844 736.1875,392.1875 736.9375,391.6406 C737.5156,391.2344 737.8438,390.7813 737.8438,390.3906 C737.8438,389.9375 737.4531,389.5469 736.9844,389.5469 C736.7656,389.5469 736.5625,389.625 736.375,389.8125 C735.9219,390.2969 735.9219,390.2969 735.7344,390.3906 C735.3125,390.6563 734.625,390.7813 733.8594,390.7813 C731.8125,390.7813 730.5156,389.6875 730.5156,387.9844 L730.5156,386.8906 C730.5156,385.1094 731.7656,383.7969 733.5,383.7969 C734.0781,383.7969 734.6875,383.9531 735.1563,384.2031 C735.6406,384.4844 735.8125,384.7031 735.9063,385.1094 C735.9688,385.5156 736,385.6406 736.1406,385.7656 C736.2813,385.9063 736.5156,386.0156 736.7344,386.0156 C737,386.0156 737.2656,385.875 737.4375,385.6563 C737.5469,385.5 737.5781,385.3125 737.5781,384.8906 L737.5781,383.4688 C737.5781,383.0313 737.5625,382.9063 737.4688,382.75 C737.3125,382.4844 737.0313,382.3438 736.7344,382.3438 C736.4375,382.3438 736.2344,382.4375 736.0156,382.75 L735.8438,382.6719 Z " fill="#000000"/><text fill="#000000" font-family="sans-serif" font-size="12" lengthAdjust="spacing" textLength="135" x="747.5" y="391.1543">MEMS3AxisGyroscope</text><line style="stroke:#A80036;stroke-width:1.5;" x1="719.5" x2="884.5" y1="403" y2="403"/><line style="stroke:#A80036;stroke-width:1.5;" x1="719.5" x2="884.5" y1="411" y2="411"/><!--MD5=[5a9c5ec3d3b1c7619eafb040e6cffdc6]
class MEMS3AxisAccelerationSensor--><rect fill="#FEFECE" filter="url(#f1hej3mimd95vd)" height="48" id="MEMS3AxisAccelerationSensor" style="stroke:#A80036;stroke-width:1.5;" width="218" x="921" y="371"/><ellipse cx="936" cy="387" fill="#ADD1B2" rx="11" ry="11" style="stroke:#A80036;stroke-width:1.0;"/><path d="M938.3438,382.6719 C937.4063,382.2344 936.8125,382.0938 935.9375,382.0938 C933.3125,382.0938 931.3125,384.1719 931.3125,386.8906 L931.3125,388.0156 C931.3125,390.5938 933.4219,392.4844 936.3125,392.4844 C937.5313,392.4844 938.6875,392.1875 939.4375,391.6406 C940.0156,391.2344 940.3438,390.7813 940.3438,390.3906 C940.3438,389.9375 939.9531,389.5469 939.4844,389.5469 C939.2656,389.5469 939.0625,389.625 938.875,389.8125 C938.4219,390.2969 938.4219,390.2969 938.2344,390.3906 C937.8125,390.6563 937.125,390.7813 936.3594,390.7813 C934.3125,390.7813 933.0156,389.6875 933.0156,387.9844 L933.0156,386.8906 C933.0156,385.1094 934.2656,383.7969 936,383.7969 C936.5781,383.7969 937.1875,383.9531 937.6563,384.2031 C938.1406,384.4844 938.3125,384.7031 938.4063,385.1094 C938.4688,385.5156 938.5,385.6406 938.6406,385.7656 C938.7813,385.9063 939.0156,386.0156 939.2344,386.0156 C939.5,386.0156 939.7656,385.875 939.9375,385.6563 C940.0469,385.5 940.0781,385.3125 940.0781,384.8906 L940.0781,383.4688 C940.0781,383.0313 940.0625,382.9063 939.9688,382.75 C939.8125,382.4844 939.5313,382.3438 939.2344,382.3438 C938.9375,382.3438 938.7344,382.4375 938.5156,382.75 L938.3438,382.6719 Z " fill="#000000"/><text fill="#000000" font-family="sans-serif" font-size="12" lengthAdjust="spacing" textLength="186" x="950" y="391.1543">MEMS3AxisAccelerationSensor</text><line style="stroke:#A80036;stroke-width:1.5;" x1="922" x2="1138" y1="403" y2="403"/><line style="stroke:#A80036;stroke-width:1.5;" x1="922" x2="1138" y1="411" y2="411"/><!--MD5=[146dd57a7e18ee37a0d89c3f8f8166d0]
class EarthSensor--><rect fill="#FEFECE" filter="url(#f1hej3mimd95vd)" height="48" id="EarthSensor" style="stroke:#A80036;stroke-width:1.5;" width="105" x="1174.5" y="371"/><ellipse cx="1189.5" cy="387" fill="#ADD1B2" rx="11" ry="11" style="stroke:#A80036;stroke-width:1.0;"/><path d="M1191.8438,382.6719 C1190.9063,382.2344 1190.3125,382.0938 1189.4375,382.0938 C1186.8125,382.0938 1184.8125,384.1719 1184.8125,386.8906 L1184.8125,388.0156 C1184.8125,390.5938 1186.9219,392.4844 1189.8125,392.4844 C1191.0313,392.4844 1192.1875,392.1875 1192.9375,391.6406 C1193.5156,391.2344 1193.8438,390.7813 1193.8438,390.3906 C1193.8438,389.9375 1193.4531,389.5469 1192.9844,389.5469 C1192.7656,389.5469 1192.5625,389.625 1192.375,389.8125 C1191.9219,390.2969 1191.9219,390.2969 1191.7344,390.3906 C1191.3125,390.6563 1190.625,390.7813 1189.8594,390.7813 C1187.8125,390.7813 1186.5156,389.6875 1186.5156,387.9844 L1186.5156,386.8906 C1186.5156,385.1094 1187.7656,383.7969 1189.5,383.7969 C1190.0781,383.7969 1190.6875,383.9531 1191.1563,384.2031 C1191.6406,384.4844 1191.8125,384.7031 1191.9063,385.1094 C1191.9688,385.5156 1192,385.6406 1192.1406,385.7656 C1192.2813,385.9063 1192.5156,386.0156 1192.7344,386.0156 C1193,386.0156 1193.2656,385.875 1193.4375,385.6563 C1193.5469,385.5 1193.5781,385.3125 1193.5781,384.8906 L1193.5781,383.4688 C1193.5781,383.0313 1193.5625,382.9063 1193.4688,382.75 C1193.3125,382.4844 1193.0313,382.3438 1192.7344,382.3438 C1192.4375,382.3438 1192.2344,382.4375 1192.0156,382.75 L1191.8438,382.6719 Z " fill="#000000"/><text fill="#000000" font-family="sans-serif" font-size="12" lengthAdjust="spacing" textLength="73" x="1203.5" y="391.1543">EarthSensor</text><line style="stroke:#A80036;stroke-width:1.5;" x1="1175.5" x2="1278.5" y1="403" y2="403"/><line style="stroke:#A80036;stroke-width:1.5;" x1="1175.5" x2="1278.5" y1="411" y2="411"/><!--MD5=[af7c48ab41a28ec79c8a9603cd5971ad]
class Photodiode--><rect fill="#FEFECE" filter="url(#f1hej3mimd95vd)" height="48" id="Photodiode" style="stroke:#A80036;stroke-width:1.5;" width="100" x="1105" y="479"/><ellipse cx="1120" cy="495" fill="#ADD1B2" rx="11" ry="11" style="stroke:#A80036;stroke-width:1.0;"/><path d="M1122.3438,490.6719 C1121.4063,490.2344 1120.8125,490.0938 1119.9375,490.0938 C1117.3125,490.0938 1115.3125,492.1719 1115.3125,494.8906 L1115.3125,496.0156 C1115.3125,498.5938 1117.4219,500.4844 1120.3125,500.4844 C1121.5313,500.4844 1122.6875,500.1875 1123.4375,499.6406 C1124.0156,499.2344 1124.3438,498.7813 1124.3438,498.3906 C1124.3438,497.9375 1123.9531,497.5469 1123.4844,497.5469 C1123.2656,497.5469 1123.0625,497.625 1122.875,497.8125 C1122.4219,498.2969 1122.4219,498.2969 1122.2344,498.3906 C1121.8125,498.6563 1121.125,498.7813 1120.3594,498.7813 C1118.3125,498.7813 1117.0156,497.6875 1117.0156,495.9844 L1117.0156,494.8906 C1117.0156,493.1094 1118.2656,491.7969 1120,491.7969 C1120.5781,491.7969 1121.1875,491.9531 1121.6563,492.2031 C1122.1406,492.4844 1122.3125,492.7031 1122.4063,493.1094 C1122.4688,493.5156 1122.5,493.6406 1122.6406,493.7656 C1122.7813,493.9063 1123.0156,494.0156 1123.2344,494.0156 C1123.5,494.0156 1123.7656,493.875 1123.9375,493.6563 C1124.0469,493.5 1124.0781,493.3125 1124.0781,492.8906 L1124.0781,491.4688 C1124.0781,491.0313 1124.0625,490.9063 1123.9688,490.75 C1123.8125,490.4844 1123.5313,490.3438 1123.2344,490.3438 C1122.9375,490.3438 1122.7344,490.4375 1122.5156,490.75 L1122.3438,490.6719 Z " fill="#000000"/><text fill="#000000" font-family="sans-serif" font-size="12" lengthAdjust="spacing" textLength="68" x="1134" y="499.1543">Photodiode</text><line style="stroke:#A80036;stroke-width:1.5;" x1="1106" x2="1204" y1="511" y2="511"/><line style="stroke:#A80036;stroke-width:1.5;" x1="1106" x2="1204" y1="519" y2="519"/><!--MD5=[aabd460bd365bb16bc87a506db243e70]
class FineSunSensor--><rect fill="#FEFECE" filter="url(#f1hej3mimd95vd)" height="48" id="FineSunSensor" style="stroke:#A80036;stroke-width:1.5;" width="122" x="741" y="479"/><ellipse cx="756" cy="495" fill="#ADD1B2" rx="11" ry="11" style="stroke:#A80036;stroke-width:1.0;"/><path d="M758.3438,490.6719 C757.4063,490.2344 756.8125,490.0938 755.9375,490.0938 C753.3125,490.0938 751.3125,492.1719 751.3125,494.8906 L751.3125,496.0156 C751.3125,498.5938 753.4219,500.4844 756.3125,500.4844 C757.5313,500.4844 758.6875,500.1875 759.4375,499.6406 C760.0156,499.2344 760.3438,498.7813 760.3438,498.3906 C760.3438,497.9375 759.9531,497.5469 759.4844,497.5469 C759.2656,497.5469 759.0625,497.625 758.875,497.8125 C758.4219,498.2969 758.4219,498.2969 758.2344,498.3906 C757.8125,498.6563 757.125,498.7813 756.3594,498.7813 C754.3125,498.7813 753.0156,497.6875 753.0156,495.9844 L753.0156,494.8906 C753.0156,493.1094 754.2656,491.7969 756,491.7969 C756.5781,491.7969 757.1875,491.9531 757.6563,492.2031 C758.1406,492.4844 758.3125,492.7031 758.4063,493.1094 C758.4688,493.5156 758.5,493.6406 758.6406,493.7656 C758.7813,493.9063 759.0156,494.0156 759.2344,494.0156 C759.5,494.0156 759.7656,493.875 759.9375,493.6563 C760.0469,493.5 760.0781,493.3125 760.0781,492.8906 L760.0781,491.4688 C760.0781,491.0313 760.0625,490.9063 759.9688,490.75 C759.8125,490.4844 759.5313,490.3438 759.2344,490.3438 C758.9375,490.3438 758.7344,490.4375 758.5156,490.75 L758.3438,490.6719 Z " fill="#000000"/><text fill="#000000" font-family="sans-serif" font-size="12" lengthAdjust="spacing" textLength="90" x="770" y="499.1543">FineSunSensor</text><line style="stroke:#A80036;stroke-width:1.5;" x1="742" x2="862" y1="511" y2="511"/><line style="stroke:#A80036;stroke-width:1.5;" x1="742" x2="862" y1="519" y2="519"/><!--MD5=[6bb63e837098852392c079bdf1941c7d]
class Dynamics--><rect fill="#FEFECE" filter="url(#f1hej3mimd95vd)" height="48" id="Dynamics" style="stroke:#A80036;stroke-width:1.5;" width="90" x="104" y="371"/><ellipse cx="119" cy="387" fill="#ADD1B2" rx="11" ry="11" style="stroke:#A80036;stroke-width:1.0;"/><path d="M121.3438,382.6719 C120.4063,382.2344 119.8125,382.0938 118.9375,382.0938 C116.3125,382.0938 114.3125,384.1719 114.3125,386.8906 L114.3125,388.0156 C114.3125,390.5938 116.4219,392.4844 119.3125,392.4844 C120.5313,392.4844 121.6875,392.1875 122.4375,391.6406 C123.0156,391.2344 123.3438,390.7813 123.3438,390.3906 C123.3438,389.9375 122.9531,389.5469 122.4844,389.5469 C122.2656,389.5469 122.0625,389.625 121.875,389.8125 C121.4219,390.2969 121.4219,390.2969 121.2344,390.3906 C120.8125,390.6563 120.125,390.7813 119.3594,390.7813 C117.3125,390.7813 116.0156,389.6875 116.0156,387.9844 L116.0156,386.8906 C116.0156,385.1094 117.2656,383.7969 119,383.7969 C119.5781,383.7969 120.1875,383.9531 120.6563,384.2031 C121.1406,384.4844 121.3125,384.7031 121.4063,385.1094 C121.4688,385.5156 121.5,385.6406 121.6406,385.7656 C121.7813,385.9063 122.0156,386.0156 122.2344,386.0156 C122.5,386.0156 122.7656,385.875 122.9375,385.6563 C123.0469,385.5 123.0781,385.3125 123.0781,384.8906 L123.0781,383.4688 C123.0781,383.0313 123.0625,382.9063 122.9688,382.75 C122.8125,382.4844 122.5313,382.3438 122.2344,382.3438 C121.9375,382.3438 121.7344,382.4375 121.5156,382.75 L121.3438,382.6719 Z " fill="#000000"/><text fill="#000000" font-family="sans-serif" font-size="12" lengthAdjust="spacing" textLength="58" x="133" y="391.1543">Dynamics</text><line style="stroke:#A80036;stroke-width:1.5;" x1="105" x2="193" y1="403" y2="403"/><line style="stroke:#A80036;stroke-width:1.5;" x1="105" x2="193" y1="411" y2="411"/><!--MD5=[5d0a77e8f66918aa15fe0099dd6d4ba9]
class Environment--><rect fill="#FEFECE" filter="url(#f1hej3mimd95vd)" height="48" id="Environment" style="stroke:#A80036;stroke-width:1.5;" width="106" x="229" y="371"/><ellipse cx="244" cy="387" fill="#ADD1B2" rx="11" ry="11" style="stroke:#A80036;stroke-width:1.0;"/><path d="M246.3438,382.6719 C245.4063,382.2344 244.8125,382.0938 243.9375,382.0938 C241.3125,382.0938 239.3125,384.1719 239.3125,386.8906 L239.3125,388.0156 C239.3125,390.5938 241.4219,392.4844 244.3125,392.4844 C245.5313,392.4844 246.6875,392.1875 247.4375,391.6406 C248.0156,391.2344 248.3438,390.7813 248.3438,390.3906 C248.3438,389.9375 247.9531,389.5469 247.4844,389.5469 C247.2656,389.5469 247.0625,389.625 246.875,389.8125 C246.4219,390.2969 246.4219,390.2969 246.2344,390.3906 C245.8125,390.6563 245.125,390.7813 244.3594,390.7813 C242.3125,390.7813 241.0156,389.6875 241.0156,387.9844 L241.0156,386.8906 C241.0156,385.1094 242.2656,383.7969 244,383.7969 C244.5781,383.7969 245.1875,383.9531 245.6563,384.2031 C246.1406,384.4844 246.3125,384.7031 246.4063,385.1094 C246.4688,385.5156 246.5,385.6406 246.6406,385.7656 C246.7813,385.9063 247.0156,386.0156 247.2344,386.0156 C247.5,386.0156 247.7656,385.875 247.9375,385.6563 C248.0469,385.5 248.0781,385.3125 248.0781,384.8906 L248.0781,383.4688 C248.0781,383.0313 248.0625,382.9063 247.9688,382.75 C247.8125,382.4844 247.5313,382.3438 247.2344,382.3438 C246.9375,382.3438 246.7344,382.4375 246.5156,382.75 L246.3438,382.6719 Z " fill="#000000"/><text fill="#000000" font-family="sans-serif" font-size="12" lengthAdjust="spacing" textLength="74" x="258" y="391.1543">Environment</text><line style="stroke:#A80036;stroke-width:1.5;" x1="230" x2="334" y1="403" y2="403"/><line style="stroke:#A80036;stroke-width:1.5;" x1="230" x2="334" y1="411" y2="411"/><!--MD5=[06591751b233bc908e0c5fbe0d837a76]
class Orbit--><rect fill="#FEFECE" filter="url(#f1hej3mimd95vd)" height="48" id="Orbit" style="stroke:#A80036;stroke-width:1.5;" width="62" x="7" y="371"/><ellipse cx="22" cy="387" fill="#ADD1B2" rx="11" ry="11" style="stroke:#A80036;stroke-width:1.0;"/><path d="M24.3438,382.6719 C23.4063,382.2344 22.8125,382.0938 21.9375,382.0938 C19.3125,382.0938 17.3125,384.1719 17.3125,386.8906 L17.3125,388.0156 C17.3125,390.5938 19.4219,392.4844 22.3125,392.4844 C23.5313,392.4844 24.6875,392.1875 25.4375,391.6406 C26.0156,391.2344 26.3438,390.7813 26.3438,390.3906 C26.3438,389.9375 25.9531,389.5469 25.4844,389.5469 C25.2656,389.5469 25.0625,389.625 24.875,389.8125 C24.4219,390.2969 24.4219,390.2969 24.2344,390.3906 C23.8125,390.6563 23.125,390.7813 22.3594,390.7813 C20.3125,390.7813 19.0156,389.6875 19.0156,387.9844 L19.0156,386.8906 C19.0156,385.1094 20.2656,383.7969 22,383.7969 C22.5781,383.7969 23.1875,383.9531 23.6563,384.2031 C24.1406,384.4844 24.3125,384.7031 24.4063,385.1094 C24.4688,385.5156 24.5,385.6406 24.6406,385.7656 C24.7813,385.9063 25.0156,386.0156 25.2344,386.0156 C25.5,386.0156 25.7656,385.875 25.9375,385.6563 C26.0469,385.5 26.0781,385.3125 26.0781,384.8906 L26.0781,383.4688 C26.0781,383.0313 26.0625,382.9063 25.9688,382.75 C25.8125,382.4844 25.5313,382.3438 25.2344,382.3438 C24.9375,382.3438 24.7344,382.4375 24.5156,382.75 L24.3438,382.6719 Z " fill="#000000"/><text fill="#000000" font-family="sans-serif" font-size="12" lengthAdjust="spacing" textLength="30" x="36" y="391.1543">Orbit</text><line style="stroke:#A80036;stroke-width:1.5;" x1="8" x2="68" y1="403" y2="403"/><line style="stroke:#A80036;stroke-width:1.5;" x1="8" x2="68" y1="411" y2="411"/><!--MD5=[3eb386fb12a2dcb40cf94360b8634136]
class OutputLists--><rect fill="#FEFECE" filter="url(#f1hej3mimd95vd)" height="48" id="OutputLists" style="stroke:#A80036;stroke-width:1.5;" width="99" x="232.5" y="115"/><ellipse cx="247.5" cy="131" fill="#ADD1B2" rx="11" ry="11" style="stroke:#A80036;stroke-width:1.0;"/><path d="M249.8438,126.6719 C248.9063,126.2344 248.3125,126.0938 247.4375,126.0938 C244.8125,126.0938 242.8125,128.1719 242.8125,130.8906 L242.8125,132.0156 C242.8125,134.5938 244.9219,136.4844 247.8125,136.4844 C249.0313,136.4844 250.1875,136.1875 250.9375,135.6406 C251.5156,135.2344 251.8438,134.7813 251.8438,134.3906 C251.8438,133.9375 251.4531,133.5469 250.9844,133.5469 C250.7656,133.5469 250.5625,133.625 250.375,133.8125 C249.9219,134.2969 249.9219,134.2969 249.7344,134.3906 C249.3125,134.6563 248.625,134.7813 247.8594,134.7813 C245.8125,134.7813 244.5156,133.6875 244.5156,131.9844 L244.5156,130.8906 C244.5156,129.1094 245.7656,127.7969 247.5,127.7969 C248.0781,127.7969 248.6875,127.9531 249.1563,128.2031 C249.6406,128.4844 249.8125,128.7031 249.9063,129.1094 C249.9688,129.5156 250,129.6406 250.1406,129.7656 C250.2813,129.9063 250.5156,130.0156 250.7344,130.0156 C251,130.0156 251.2656,129.875 251.4375,129.6563 C251.5469,129.5 251.5781,129.3125 251.5781,128.8906 L251.5781,127.4688 C251.5781,127.0313 251.5625,126.9063 251.4688,126.75 C251.3125,126.4844 251.0313,126.3438 250.7344,126.3438 C250.4375,126.3438 250.2344,126.4375 250.0156,126.75 L249.8438,126.6719 Z " fill="#000000"/><text fill="#000000" font-family="sans-serif" font-size="12" lengthAdjust="spacing" textLength="67" x="261.5" y="135.1543">OutputLists</text><line style="stroke:#A80036;stroke-width:1.5;" x1="233.5" x2="330.5" y1="147" y2="147"/><line style="stroke:#A80036;stroke-width:1.5;" x1="233.5" x2="330.5" y1="155" y2="155"/><!--MD5=[97d46ae094d28e0d28828e4b8046fed1]
class Sensor--><rect fill="#FEFECE" filter="url(#f1hej3mimd95vd)" height="48" id="Sensor" style="stroke:#A80036;stroke-width:1.5;" width="75" x="878.5" y="243"/><ellipse cx="893.5" cy="259" fill="#ADD1B2" rx="11" ry="11" style="stroke:#A80036;stroke-width:1.0;"/><path d="M895.8438,254.6719 C894.9063,254.2344 894.3125,254.0938 893.4375,254.0938 C890.8125,254.0938 888.8125,256.1719 888.8125,258.8906 L888.8125,260.0156 C888.8125,262.5938 890.9219,264.4844 893.8125,264.4844 C895.0313,264.4844 896.1875,264.1875 896.9375,263.6406 C897.5156,263.2344 897.8438,262.7813 897.8438,262.3906 C897.8438,261.9375 897.4531,261.5469 896.9844,261.5469 C896.7656,261.5469 896.5625,261.625 896.375,261.8125 C895.9219,262.2969 895.9219,262.2969 895.7344,262.3906 C895.3125,262.6563 894.625,262.7813 893.8594,262.7813 C891.8125,262.7813 890.5156,261.6875 890.5156,259.9844 L890.5156,258.8906 C890.5156,257.1094 891.7656,255.7969 893.5,255.7969 C894.0781,255.7969 894.6875,255.9531 895.1563,256.2031 C895.6406,256.4844 895.8125,256.7031 895.9063,257.1094 C895.9688,257.5156 896,257.6406 896.1406,257.7656 C896.2813,257.9063 896.5156,258.0156 896.7344,258.0156 C897,258.0156 897.2656,257.875 897.4375,257.6563 C897.5469,257.5 897.5781,257.3125 897.5781,256.8906 L897.5781,255.4688 C897.5781,255.0313 897.5625,254.9063 897.4688,254.75 C897.3125,254.4844 897.0313,254.3438 896.7344,254.3438 C896.4375,254.3438 896.2344,254.4375 896.0156,254.75 L895.8438,254.6719 Z " fill="#000000"/><text fill="#000000" font-family="sans-serif" font-size="12" lengthAdjust="spacing" textLength="43" x="907.5" y="263.1543">Sensor</text><line style="stroke:#A80036;stroke-width:1.5;" x1="879.5" x2="952.5" y1="275" y2="275"/><line style="stroke:#A80036;stroke-width:1.5;" x1="879.5" x2="952.5" y1="283" y2="283"/><polygon fill="none" points="925.0667,291,938.683,307.2356,925.5864,312.1832" style="stroke:#A80036;stroke-width:1.0;"/><line style="stroke:#A80036;stroke-width:1.0;" x1="932.1347" x2="933" y1="309.7094" y2="312"/><line style="stroke:#A80036;stroke-width:1.0;" x1="878.5" x2="845.384" y1="259.7651" y2="253.376"/><!--MD5=[14fbafd47941369f164719df779f2f5c]
class SunSensor--><rect fill="#FEFECE" filter="url(#f1hej3mimd95vd)" height="48" id="SunSensor" style="stroke:#A80036;stroke-width:1.5;" width="97" x="1314.5" y="371"/><ellipse cx="1329.5" cy="387" fill="#ADD1B2" rx="11" ry="11" style="stroke:#A80036;stroke-width:1.0;"/><path d="M1331.8438,382.6719 C1330.9063,382.2344 1330.3125,382.0938 1329.4375,382.0938 C1326.8125,382.0938 1324.8125,384.1719 1324.8125,386.8906 L1324.8125,388.0156 C1324.8125,390.5938 1326.9219,392.4844 1329.8125,392.4844 C1331.0313,392.4844 1332.1875,392.1875 1332.9375,391.6406 C1333.5156,391.2344 1333.8438,390.7813 1333.8438,390.3906 C1333.8438,389.9375 1333.4531,389.5469 1332.9844,389.5469 C1332.7656,389.5469 1332.5625,389.625 1332.375,389.8125 C1331.9219,390.2969 1331.9219,390.2969 1331.7344,390.3906 C1331.3125,390.6563 1330.625,390.7813 1329.8594,390.7813 C1327.8125,390.7813 1326.5156,389.6875 1326.5156,387.9844 L1326.5156,386.8906 C1326.5156,385.1094 1327.7656,383.7969 1329.5,383.7969 C1330.0781,383.7969 1330.6875,383.9531 1331.1563,384.2031 C1331.6406,384.4844 1331.8125,384.7031 1331.9063,385.1094 C1331.9688,385.5156 1332,385.6406 1332.1406,385.7656 C1332.2813,385.9063 1332.5156,386.0156 1332.7344,386.0156 C1333,386.0156 1333.2656,385.875 1333.4375,385.6563 C1333.5469,385.5 1333.5781,385.3125 1333.5781,384.8906 L1333.5781,383.4688 C1333.5781,383.0313 1333.5625,382.9063 1333.4688,382.75 C1333.3125,382.4844 1333.0313,382.3438 1332.7344,382.3438 C1332.4375,382.3438 1332.2344,382.4375 1332.0156,382.75 L1331.8438,382.6719 Z " fill="#000000"/><text fill="#000000" font-family="sans-serif" font-size="12" lengthAdjust="spacing" textLength="65" x="1343.5" y="391.1543">SunSensor</text><line style="stroke:#A80036;stroke-width:1.5;" x1="1315.5" x2="1410.5" y1="403" y2="403"/><line style="stroke:#A80036;stroke-width:1.5;" x1="1315.5" x2="1410.5" y1="411" y2="411"/><!--MD5=[26a68b5a49857c00ad93b1cec07f009f]
reverse link App to Tabs--><path codeLine="5" d="M337.041,63.259 C357.078,79.723 381.236,99.574 399.618,114.678 " fill="none" id="App-backto-Tabs" style="stroke:#A80036;stroke-width:1.0;"/><polygon fill="#A80036" points="326.991,55,329.0875,61.8996,336.2627,62.6181,334.1662,55.7185,326.991,55" style="stroke:#A80036;stroke-width:1.0;"/><text fill="#000000" font-family="sans-serif" font-size="13" lengthAdjust="spacing" textLength="8" x="325.1387" y="75.1558">1</text><text fill="#000000" font-family="sans-serif" font-size="13" lengthAdjust="spacing" textLength="8" x="383.7249" y="104.0045">1</text><!--MD5=[e78de124cd0f66bea9d4dbb11ea758b7]
reverse link Tabs to Main--><path codeLine="6" d="M428,176.281 C428,197.628 428,223.998 428,242.609 " fill="none" id="Tabs-backto-Main" style="stroke:#A80036;stroke-width:1.0;"/><polygon fill="#A80036" points="428,163.11,424,169.11,428,175.11,432,169.11,428,163.11" style="stroke:#A80036;stroke-width:1.0;"/><text fill="#000000" font-family="sans-serif" font-size="13" lengthAdjust="spacing" textLength="8" x="419.025" y="182.898">1</text><text fill="#000000" font-family="sans-serif" font-size="13" lengthAdjust="spacing" textLength="8" x="419.025" y="231.9186">1</text><!--MD5=[16982e886020c5e930310b28e5a4e23a]
link PyQtGraph2dPlot to Tabs--><path codeLine="7" d="M428,55 C428,68.52 428,85.922 428,101.298 " fill="none" id="PyQtGraph2dPlot-to-Tabs" style="stroke:#A80036;stroke-width:1.0;"/><polygon fill="#FFFFFF" points="428,114.678,432,108.678,428,102.678,424,108.678,428,114.678" style="stroke:#A80036;stroke-width:1.0;"/><text fill="#000000" font-family="sans-serif" font-size="13" lengthAdjust="spacing" textLength="24" x="400.925" y="75.1558">0..1</text><text fill="#000000" font-family="sans-serif" font-size="13" lengthAdjust="spacing" textLength="23" x="402.1969" y="104.0045">0..*</text><!--MD5=[4abee310fddc681185767cd9b8e078a7]
link YamlEditorWindow to Tabs--><path codeLine="8" d="M563.462,55 C535.861,71.912 498.345,94.899 469.792,112.394 " fill="none" id="YamlEditorWindow-to-Tabs" style="stroke:#A80036;stroke-width:1.0;"/><polygon fill="#FFFFFF" points="458.549,119.282,465.7548,119.5585,468.7815,113.0133,461.5757,112.7368,458.549,119.282" style="stroke:#A80036;stroke-width:1.0;"/><text fill="#000000" font-family="sans-serif" font-size="13" lengthAdjust="spacing" textLength="24" x="526.7679" y="75.1558">0..1</text><text fill="#000000" font-family="sans-serif" font-size="13" lengthAdjust="spacing" textLength="23" x="466.5646" y="111.1731">0..*</text><!--MD5=[694a07513b1c3fa2d6ec9f4f9ff4f26e]
reverse link Main to FluxgateMagnetometer--><path codeLine="9" d="M468.194,297.791 C498.328,320.126 538.983,350.258 566.714,370.812 " fill="none" id="Main-backto-FluxgateMagnetometer" style="stroke:#A80036;stroke-width:1.0;"/><polygon fill="#FFFFFF" points="457.612,289.948,460.0504,296.7343,467.2525,297.0937,464.8141,290.3073,457.612,289.948" style="stroke:#A80036;stroke-width:1.0;"/><text fill="#000000" font-family="sans-serif" font-size="13" lengthAdjust="spacing" textLength="24" x="465.5443" y="307.8317">0..1</text><text fill="#000000" font-family="sans-serif" font-size="13" lengthAdjust="spacing" textLength="23" x="532.7501" y="359.7759">0..*</text><!--MD5=[2f5b34b0afe838c54df016fffa55b7e0]
reverse link Main to MEMS3AxisGyroscope--><path codeLine="10" d="M470.021,282.157 C534.029,303.721 656.622,345.022 733.587,370.952 " fill="none" id="Main-backto-MEMS3AxisGyroscope" style="stroke:#A80036;stroke-width:1.0;"/><polygon fill="#FFFFFF" points="457.66,277.992,462.0692,283.6981,469.0321,281.8227,464.623,276.1166,457.66,277.992" style="stroke:#A80036;stroke-width:1.0;"/><text fill="#000000" font-family="sans-serif" font-size="13" lengthAdjust="spacing" textLength="24" x="465.6014" y="275.7372">0..1</text><text fill="#000000" font-family="sans-serif" font-size="13" lengthAdjust="spacing" textLength="23" x="690.1093" y="359.9517">0..*</text><!--MD5=[ea2ff9b7078c5dbdc460ecc1f5c8f60c]
reverse link Main to MEMS3AxisAccelerationSensor--><path codeLine="11" d="M470.853,276.969 C563.768,296.417 786.225,342.977 920.862,371.157 " fill="none" id="Main-backto-MEMS3AxisAccelerationSensor" style="stroke:#A80036;stroke-width:1.0;"/><polygon fill="#FFFFFF" points="457.853,274.248,462.9059,279.3927,469.5983,276.7073,464.5454,271.5626,457.853,274.248" style="stroke:#A80036;stroke-width:1.0;"/><text fill="#000000" font-family="sans-serif" font-size="13" lengthAdjust="spacing" textLength="24" x="465.5696" y="289.0463">0..1</text><text fill="#000000" font-family="sans-serif" font-size="13" lengthAdjust="spacing" textLength="23" x="890.1336" y="366.2202">0..*</text><!--MD5=[0cfb521910bbeb85b6c61e8de3a33923]
reverse link Main to EarthSensor--><path codeLine="12" d="M470.572,271.361 C583.584,280.851 900.073,311.138 1157,371 C1162.61,372.306 1168.4,373.864 1174.15,375.544 " fill="none" id="Main-backto-EarthSensor" style="stroke:#A80036;stroke-width:1.0;"/><polygon fill="#FFFFFF" points="457.512,270.281,463.1619,274.7619,469.4712,271.27,463.8213,266.7891,457.512,270.281" style="stroke:#A80036;stroke-width:1.0;"/><text fill="#000000" font-family="sans-serif" font-size="13" lengthAdjust="spacing" textLength="24" x="465.4252" y="266.5563">0..1</text><text fill="#000000" font-family="sans-serif" font-size="13" lengthAdjust="spacing" textLength="23" x="1143.3073" y="369.3337">0..*</text><!--MD5=[0a6da10acd920dff64d006963d9d902d]
reverse link Main to Photodiode--><path codeLine="13" d="M433.629,304.077 C441.157,339.336 458.117,391.588 495,419 C519.534,437.2339 955.037,482.09 1104.86,497.0521 " fill="none" id="Main-backto-Photodiode" style="stroke:#A80036;stroke-width:1.0;"/><polygon fill="#FFFFFF" points="431.105,291.032,428.3178,297.6827,433.3848,302.8134,436.1721,296.1628,431.105,291.032" style="stroke:#A80036;stroke-width:1.0;"/><text fill="#000000" font-family="sans-serif" font-size="13" lengthAdjust="spacing" textLength="24" x="434.9757" y="311.196">0..1</text><text fill="#000000" font-family="sans-serif" font-size="13" lengthAdjust="spacing" textLength="23" x="1073.9624" y="492.4045">0..*</text><!--MD5=[6e46ddce82ba8b50b4145e6c1e495995]
reverse link Main to FineSunSensor--><path codeLine="14" d="M417.87,304.121 C410.807,337.742 406.764,387.298 433,419 C471.62,465.6666 646.236,488.1789 740.763,497.1139 " fill="none" id="Main-backto-FineSunSensor" style="stroke:#A80036;stroke-width:1.0;"/><polygon fill="#FFFFFF" points="420.89,291.22,415.6277,296.1504,418.1549,302.9041,423.4172,297.9738,420.89,291.22" style="stroke:#A80036;stroke-width:1.0;"/><text fill="#000000" font-family="sans-serif" font-size="13" lengthAdjust="spacing" textLength="24" x="392.2319" y="311.0348">0..1</text><text fill="#000000" font-family="sans-serif" font-size="13" lengthAdjust="spacing" textLength="23" x="709.8074" y="492.724">0..*</text><!--MD5=[f0f1faafd6f59f5dff81702fca626284]
reverse link Main to Dynamics--><path codeLine="15" d="M386.442,286.768 C334.954,310.021 247.536,349.5 194.352,373.518 " fill="none" id="Main-backto-Dynamics" style="stroke:#A80036;stroke-width:1.0;"/><polygon fill="#FFFFFF" points="398.406,281.365,391.2915,280.1889,387.4694,286.3038,394.584,287.4799,398.406,281.365" style="stroke:#A80036;stroke-width:1.0;"/><text fill="#000000" font-family="sans-serif" font-size="13" lengthAdjust="spacing" textLength="24" x="366.4771" y="279.7532">0..1</text><text fill="#000000" font-family="sans-serif" font-size="13" lengthAdjust="spacing" textLength="23" x="198.0308" y="364.803">0..*</text><!--MD5=[c3440c3fffd46196f69b21d509e905c4]
reverse link Main to Environment--><path codeLine="16" d="M391.166,299.788 C365.636,321.821 332.209,350.669 309.103,370.609 " fill="none" id="Main-backto-Environment" style="stroke:#A80036;stroke-width:1.0;"/><polygon fill="#FFFFFF" points="401.221,291.11,394.0652,292.0012,392.1356,298.9493,399.2914,298.0581,401.221,291.11" style="stroke:#A80036;stroke-width:1.0;"/><text fill="#000000" font-family="sans-serif" font-size="13" lengthAdjust="spacing" textLength="24" x="367.7686" y="310.898">0..1</text><text fill="#000000" font-family="sans-serif" font-size="13" lengthAdjust="spacing" textLength="23" x="289.9062" y="359.9186">0..*</text><!--MD5=[6f9d10c46f846804141687799cda5eb5]
reverse link Main to Orbit--><path codeLine="17" d="M385.225,278.608 C319.767,295.346 191.262,330.211 86,371 C80.4856,373.137 74.7283,375.643 69.1944,378.2 " fill="none" id="Main-backto-Orbit" style="stroke:#A80036;stroke-width:1.0;"/><polygon fill="#FFFFFF" points="398.205,275.315,391.4058,272.9126,386.5732,278.2648,393.3724,280.6672,398.205,275.315" style="stroke:#A80036;stroke-width:1.0;"/><text fill="#000000" font-family="sans-serif" font-size="13" lengthAdjust="spacing" textLength="24" x="366.499" y="290.31">0..1</text><text fill="#000000" font-family="sans-serif" font-size="13" lengthAdjust="spacing" textLength="23" x="77.0662" y="370.7988">0..*</text><!--MD5=[e7a018c49dc6a910d69300f1d558a4f1]
link OutputLists to Main--><path codeLine="18" d="M308.779,163.11 C331.787,182.967 365.202,211.805 390.806,233.901 " fill="none" id="OutputLists-to-Main" style="stroke:#A80036;stroke-width:1.0;"/><polygon fill="#A80036" points="400.897,242.609,398.968,235.6607,391.8122,234.7689,393.7413,241.7172,400.897,242.609" style="stroke:#A80036;stroke-width:1.0;"/><text fill="#000000" font-family="sans-serif" font-size="13" lengthAdjust="spacing" textLength="8" x="306.3314" y="182.898">2</text><text fill="#000000" font-family="sans-serif" font-size="13" lengthAdjust="spacing" textLength="8" x="385.3156" y="231.9186">1</text><!--MD5=[7639d1f7bb5e316a294024bb2c98cecf]
link OutputLists to Sensor--><path codeLine="19" d="M331.516,152.034 C347.011,155.689 364.19,159.627 380,163 C546.243,198.466 742.691,234.803 845.384,253.376 " fill="none" id="OutputLists-to-Sensor" style="stroke:#A80036;stroke-width:1.0;"/><polygon fill="#A80036" points="858.337,255.714,853.1427,250.712,846.5277,253.5829,851.722,258.5849,858.337,255.714" style="stroke:#A80036;stroke-width:1.0;"/><text fill="#000000" font-family="sans-serif" font-size="13" lengthAdjust="spacing" textLength="8" x="339.3762" y="149.9235">1</text><text fill="#000000" font-family="sans-serif" font-size="13" lengthAdjust="spacing" textLength="8" x="842.4364" y="250.3824">1</text><!--MD5=[400ced559978e30325213128a3e4a36b]
link OutputLists to Dynamics--><path codeLine="20" d="M269.726,163.44 C246.21,208.351 194.701,306.722 167.181,359.278 " fill="none" id="OutputLists-to-Dynamics" style="stroke:#A80036;stroke-width:1.0;"/><polygon fill="#A80036" points="161.052,370.983,167.3789,367.5232,166.6186,360.3522,160.2917,363.8121,161.052,370.983" style="stroke:#A80036;stroke-width:1.0;"/><text fill="#000000" font-family="sans-serif" font-size="13" lengthAdjust="spacing" textLength="8" x="257.9626" y="182.9084">1</text><text fill="#000000" font-family="sans-serif" font-size="13" lengthAdjust="spacing" textLength="8" x="155.1153" y="359.9907">1</text><!--MD5=[08c2277cf4d74d76e1c918ddd08aca5e]
link OutputLists to Environment--><path codeLine="21" d="M282,163.44 C282,207.972 282,305.065 282,357.937 " fill="none" id="OutputLists-to-Environment" style="stroke:#A80036;stroke-width:1.0;"/><polygon fill="#A80036" points="282,370.983,286,364.983,282,358.983,278,364.983,282,370.983" style="stroke:#A80036;stroke-width:1.0;"/><text fill="#000000" font-family="sans-serif" font-size="13" lengthAdjust="spacing" textLength="8" x="273.075" y="182.9084">1</text><text fill="#000000" font-family="sans-serif" font-size="13" lengthAdjust="spacing" textLength="8" x="272.975" y="359.9907">1</text><!--MD5=[fa45990bcc3d73b822a467c5e7c0bd28]
link OutputLists to Orbit--><path codeLine="22" d="M254.015,163.084 C234.868,179.265 209.209,201.721 188,223 C142.649,268.499 94.3667,325.221 65.1898,360.531 " fill="none" id="OutputLists-to-Orbit" style="stroke:#A80036;stroke-width:1.0;"/><polygon fill="#A80036" points="56.7728,370.766,63.6733,368.6725,64.3949,361.4975,57.4943,363.5911,56.7728,370.766" style="stroke:#A80036;stroke-width:1.0;"/><text fill="#000000" font-family="sans-serif" font-size="13" lengthAdjust="spacing" textLength="8" x="237.8188" y="183.2613">1</text><text fill="#000000" font-family="sans-serif" font-size="13" lengthAdjust="spacing" textLength="8" x="52.3737" y="360.1139">1</text><!--MD5=[df50305195d1d1ecc6f59241f4e4ecea]
reverse link Sensor to FluxgateMagnetometer--><path codeLine="25" d="M933,312 C933,312 783.092,348.694 683.836,372.989 " fill="none" id="Sensor-backto-FluxgateMagnetometer" style="stroke:#A80036;stroke-width:1.0;"/><!--MD5=[8557c8d025656c8741d9432ebe28b0c6]
reverse link Sensor to MEMS3AxisGyroscope--><path codeLine="26" d="M933,312 C933,312 877.586,346.687 838.839,370.94 " fill="none" id="Sensor-backto-MEMS3AxisGyroscope" style="stroke:#A80036;stroke-width:1.0;"/><!--MD5=[0d979bfc649b50a4c72efbaeec837d52]
reverse link Sensor to MEMS3AxisAccelerationSensor--><path codeLine="27" d="M933,312 C933,312 974.032,346.687 1002.722,370.94 " fill="none" id="Sensor-backto-MEMS3AxisAccelerationSensor" style="stroke:#A80036;stroke-width:1.0;"/><!--MD5=[157322db341af1732bcb4b4515f04f71]
reverse link Sensor to EarthSensor--><path codeLine="28" d="M933,312 C933,312 1058.27,341.808 1157,371 C1162.64,372.669 1168.52,374.48 1174.36,376.329 " fill="none" id="Sensor-backto-EarthSensor" style="stroke:#A80036;stroke-width:1.0;"/><!--MD5=[dc86ab18d4808be79d84b1d9343b4d95]
reverse link SunSensor to Photodiode--><path codeLine="29" d="M1299.81,428.2013 C1267.75,444.5433 1229.52,464.021 1200.4,478.8617 " fill="none" id="SunSensor-backto-Photodiode" style="stroke:#A80036;stroke-width:1.0;"/><polygon fill="none" points="1296.87,421.845,1317.87,419,1303.23,434.3184,1296.87,421.845" style="stroke:#A80036;stroke-width:1.0;"/><!--MD5=[00d958b5b88ffa4668b137ffcdb402a7]
reverse link SunSensor to FineSunSensor--><path codeLine="30" d="M1294.66,419.004 C1129.15,460.3135 953.896,484.2004 863.272,495.1138 " fill="none" id="SunSensor-backto-FineSunSensor" style="stroke:#A80036;stroke-width:1.0;"/><polygon fill="none" points="1293.16,412.163,1314.27,414.015,1296.61,425.731,1293.16,412.163" style="stroke:#A80036;stroke-width:1.0;"/><!--MD5=[1f1e6dbf4ed8e698279bec2efa4a0f4f]
reverse link Sensor to SunSensor--><path codeLine="31" d="M933,312 C933,312 1138.13,330.77 1297,371 C1302.65,372.43 1308.5,374.132 1314.27,375.954 " fill="none" id="Sensor-backto-SunSensor" style="stroke:#A80036;stroke-width:1.0;"/><!--MD5=[dceba5b7cac21ae759d8bae484c83d77]
@startuml
skinparam classAttributeIconSize 0
skinparam groupInheritance 3
set namespaceSeparator none

App "1" *- - "1" Tabs
Tabs "1" *- - "1" Main
PyQtGraph2dPlot "0..1" - -o "0..*" Tabs
YamlEditorWindow "0..1" - -o "0..*" Tabs
Main "0..1" o- - "0..*" FluxgateMagnetometer
Main "0..1" o- - "0..*" MEMS3AxisGyroscope
Main "0..1" o- - "0..*" MEMS3AxisAccelerationSensor
Main "0..1" o- - "0..*" EarthSensor
Main "0..1" o- - "0..*" Photodiode
Main "0..1" o- - "0..*" FineSunSensor
Main "0..1" o- - "0..*" Dynamics
Main "0..1" o- - "0..*" Environment
Main "0..1" o- - "0..*" Orbit
OutputLists "2" - -* "1" Main
OutputLists "1" - -* "1" Sensor
OutputLists "1" - -* "1" Dynamics
OutputLists "1" - -* "1" Environment
OutputLists "1" - -* "1" Orbit


Sensor <|- - FluxgateMagnetometer
Sensor <|- -MEMS3AxisGyroscope
Sensor <|- - MEMS3AxisAccelerationSensor
Sensor <|- - EarthSensor
SunSensor <|- - Photodiode
SunSensor <|- - FineSunSensor
Sensor <|- - SunSensor
@enduml

PlantUML version 1.2021.10beta2(Unknown compile time)
(GPL source distribution)
Java Runtime: Java(TM) SE Runtime Environment
JVM: Java HotSpot(TM) 64-Bit Server VM
Default Encoding: UTF-8
Language: en
Country: US
--></g></svg>