"Ref","Qnty","Value","Cmp name","Footprint","Description","Vendor"
"C1, C2, C3, C6, C7, C8, C9, C12, C13, C14, C16, C17, C18, C19, C20, C25, C28, ","17","100n","C_Small","Capacitor_SMD:C_0603_1608Metric_Pad1.05x0.95mm_HandSolder","Unpolarized capacitor, small symbol",""
"C4, C5, C15, ","3","10u","C_Small","Capacitor_SMD:C_0603_1608Metric_Pad1.05x0.95mm_HandSolder","Unpolarized capacitor, small symbol",""
"C10, C11, ","2","1u","C_Small","Capacitor_SMD:C_0603_1608Metric_Pad1.05x0.95mm_HandSolder","Unpolarized capacitor, small symbol",""
"C21, C24, ","2","10n","C_Small","Capacitor_SMD:C_0603_1608Metric_Pad1.05x0.95mm_HandSolder","Unpolarized capacitor, small symbol",""
"C22, C23, ","2","20pF","C_Small","Capacitor_SMD:C_0603_1608Metric_Pad1.05x0.95mm_HandSolder","Unpolarized capacitor, small symbol",""
"C27, ","1","4u7","CP_Small","Capacitor_SMD:C_0603_1608Metric_Pad1.05x0.95mm_HandSolder","Polarized capacitor, small symbol",""
"CAN1, CAN2, ","2","SN65HVD230","SN65HVD233","Package_SO:SOIC-8_3.9x4.9mm_P1.27mm","CAN Bus Transceiver, 3.3V, 1Mbps, Loopback feature, SOIC-8",""
"CAN_1, ","1","CAN5","Conn_01x06_Male","Connector_PinHeader_2.54mm:PinHeader_1x06_P2.54mm_Horizontal","Generic connector, single row, 01x06, script generated (kicad-library-utils/schlib/autogen/connector/)",""
"D1, D3, D6, ","3","2mA, re","LED","LED_SMD:LED_0805_2012Metric","Light emitting diode",""
"D2, ","1","2mA, w","LED","Diode_SMD:D_0603_1608Metric","Light emitting diode",""
"D4, ","1","2mA, b","LED","Diode_SMD:D_0603_1608Metric","Light emitting diode",""
"D5, ","1","2mA, g","LED","Diode_SMD:D_0603_1608Metric","Light emitting diode",""
"FB1, FB2, FB3, FB4, FB5, FB6, FB7, FB8, FB9, FB10, FB11, FB12, FB13, FB14, FB15, FB16, FB17, FB18, FB19, FB20, ","20","1k/600mA","Ferrite_Bead_Small","Inductor_SMD:L_0603_1608Metric_Pad1.05x0.95mm_HandSolder","Ferrite bead, small symbol",""
"H_LL1, H_LR1, H_UL1, H_UR1, ","4","MountingHole_Pad","MountingHole_Pad","MountingHole:MountingHole_3mm_Pad_Via","Mounting Hole with connection",""
"Header_H1_PC104_inner1, Header_H2_PC104_outer1, ","2","Conn_02x26_Counter_Clockwise","Conn_02x26_Odd_Even","Connector_PinSocket_2.54mm:PinSocket_2x26_P2.54mm_Vertical","Generic connector, double row, 02x26, odd/even pin numbering scheme (row 1 odd numbers, row 2 even numbers), script generated (kicad-library-utils/schlib/autogen/connector/)",""
"J1, ","1","1x16_Female_AIn","Conn_01x16_Female","Connector_PinSocket_2.54mm:PinSocket_1x16_P2.54mm_Vertical_SMD_Pin1Left","Generic connector, single row, 01x16, script generated (kicad-library-utils/schlib/autogen/connector/)",""
"J2, ","1","i2C2","Conn_02x02_Odd_Even","Connector_PinHeader_2.54mm:PinHeader_2x02_P2.54mm_Vertical_SMD","Generic connector, double row, 02x02, odd/even pin numbering scheme (row 1 odd numbers, row 2 even numbers), script generated (kicad-library-utils/schlib/autogen/connector/)",""
"J3, ","1","SPI3","Conn_01x05_Male","Connector_PinHeader_2.54mm:PinHeader_1x05_P2.54mm_Vertical","Generic connector, single row, 01x05, script generated (kicad-library-utils/schlib/autogen/connector/)",""
"J4, ","1","SPI1","Conn_01x05_Male","Connector_PinHeader_2.54mm:PinHeader_1x05_P2.54mm_Vertical","Generic connector, single row, 01x05, script generated (kicad-library-utils/schlib/autogen/connector/)",""
"J5, ","1","Conn_01x02_Male","Conn_01x02_Male","Connector_PinHeader_2.54mm:PinHeader_1x02_P2.54mm_Vertical","Generic connector, single row, 01x02, script generated (kicad-library-utils/schlib/autogen/connector/)",""
"J6, ","1","Conn_ARM_JTAG_SWD_10","Conn_ARM_JTAG_SWD_10","Connector_PinHeader_2.54mm:PinHeader_2x05_P2.54mm_Vertical","Cortex Debug Connector, standard ARM Cortex-M SWD and JTAG interface",""
"J7, ","1","DX4R005JJ2R1800","USB_B_Micro","Connector_USB:USB_Micro-B_Molex-105017-0001","USB Micro Type B connector",""
"PermMem0, PermMem1, PermMem2, PermMem3, PermMem4, PermMem5, PermMem6, PermMem7, PermMem8, ","9","M95M04-DRMN6TP ","M95256-WMN6P","Package_SO:SOIC-8_3.9x4.9mm_P1.27mm","SPI EEPROM, 256Kb (32K x 8), No Identification Page, 2.5 to 5.5V, SO8",""
"R1, R2, ","2","120R","R","Resistor_SMD:R_0603_1608Metric_Pad1.05x0.95mm_HandSolder","Resistor",""
"R3, ","1","1k","R","Resistor_SMD:R_0603_1608Metric_Pad1.05x0.95mm_HandSolder","Resistor",""
"R4, R5, R21, ","3","4k7","R","Resistor_SMD:R_0603_1608Metric_Pad1.05x0.95mm_HandSolder","Resistor",""
"R6, R10, R11, R12, R13, R18, ","6","680R","R","Resistor_SMD:R_0603_1608Metric_Pad1.05x0.95mm_HandSolder","Resistor",""
"R7, R8, R14, R19, R20, R22, R23, R24, R25, R27, R28, R29, R30, ","13","0R","R_Small","Resistor_SMD:R_0603_1608Metric_Pad1.05x0.95mm_HandSolder","Resistor, small symbol",""
"R9, R26, ","2","10k","R","Resistor_SMD:R_0603_1608Metric_Pad1.05x0.95mm_HandSolder","Resistor",""
"R15, R16, ","2","100R","R","Resistor_SMD:R_0603_1608Metric_Pad1.05x0.95mm_HandSolder","Resistor",""
"R17, ","1","n.b.","R","Resistor_SMD:R_0603_1608Metric_Pad1.05x0.95mm_HandSolder","Resistor",""
"SW1, ","1","SW_Push","SW_Push","Button_Switch_SMD:SW_SPST_TL3342","Push button switch, generic, two pins",""
"TH1, ","1","10k","Thermistor_NTC","Resistor_THT:R_Axial_DIN0204_L3.6mm_D1.6mm_P2.54mm_Vertical","Temperature dependent resistor, negative temperature coefficient",""
"TP0, TP1, TP2, TP3, TP4, TP5, TP6, TP7, TP8, ","9","TestPoint","TestPoint","TestPoint:TestPoint_Pad_D1.0mm","test point",""
"U1, ","1","CD74HC4067M","CD74HC4067M","Package_SO:SOIC-24W_7.5x15.4mm_P1.27mm","High-Speed CMOS Logic 16-Channel Analog Multiplexer/Demultiplexer, SOIC-24",""
"U2, ","1","STM32L496VGT3","STM32L496VGTx","Package_QFP:LQFP-100_14x14mm_P0.5mm","ARM Cortex-M4 MCU, 1024KB flash, 320KB RAM, 80MHz, 1.71-3.6V, 83 GPIO, LQFP-100",""
"U3, ","1","ICM-20648","ICM-20948","Package_DFN_QFN:QFN-24-1EP_3x3mm_P0.4mm_EP1.75x1.6mm","InvenSense 9-Axis Motion Sensor, Accelerometer, Gyroscope, Compass, I2C/SPI, QFN-24",""
"U4, ","1","LD1117S33TR_SOT223","LD1117S33TR_SOT223","Package_TO_SOT_SMD:SOT-223-3_TabPin2","800mA Fixed Low Drop Positive Voltage Regulator, Fixed Output 3.3V, SOT-223",""
"U5, ","1","FT232RL","FT232RL","Package_SO:SSOP-28_5.3x10.2mm_P0.65mm","USB to Serial Interface, SSOP-28",""
"Y1, ","1","24MHz","Crystal","Crystal:Crystal_SMD_SeikoEpson_TSX3225-4Pin_3.2x2.5mm","Two pin crystal",""
