EESchema Schematic File Version 4
EELAYER 30 0
EELAYER END
$Descr A3 16535 11693
encoding utf-8
Sheet 1 10
Title "OBC Hardware "
Date ""
Rev ""
Comp "TU Darmstadt Space Technology"
Comment1 ""
Comment2 ""
Comment3 ""
Comment4 ""
$EndDescr
$Sheet
S 7600 4900 1000 350 
U 6026719A
F0 "Microcontroller" 50
F1 "Microcontroller.sch" 50
$EndSheet
$Sheet
S 9200 4900 1000 350 
U 60269E92
F0 "PC104" 50
F1 "PC104.sch" 50
$EndSheet
$Sheet
S 9250 5700 900  350 
U 6026ADC2
F0 "CAN" 50
F1 "CAN.sch" 50
$EndSheet
$Sheet
S 7650 5700 900  350 
U 6026BD34
F0 "Physical_Sensors" 50
F1 "Physical_Sensors.sch" 50
$EndSheet
$Sheet
S 6000 4900 900  350 
U 6026CC97
F0 "Utility" 50
F1 "Utility.sch" 50
$EndSheet
$Sheet
S 9150 4100 1000 350 
U 6026EB4B
F0 "Memory" 50
F1 "Memory.sch" 50
$EndSheet
$Sheet
S 7600 4100 1000 350 
U 60271867
F0 "Internal_Connections" 50
F1 "Internal_Connections.sch" 50
$EndSheet
$Sheet
S 5950 4100 1000 350 
U 60272770
F0 "Peripheral_Connectors" 50
F1 "Peripheral_Connectors.sch" 50
$EndSheet
$Sheet
S 5950 5700 1000 350 
U 60553BDA
F0 "Power" 50
F1 "Power.sch" 50
$EndSheet
$Bitmap
Pos 11050 10750
Scale 1.000000
Data
89 50 4E 47 0D 0A 1A 0A 00 00 00 0D 49 48 44 52 00 00 01 F4 00 00 01 F4 08 02 00 00 00 44 B4 48 
DD 00 00 00 03 73 42 49 54 08 08 08 DB E1 4F E0 00 00 00 09 70 48 59 73 00 00 0D AC 00 00 0D AC 
01 EF 06 C6 47 00 00 20 00 49 44 41 54 78 9C ED DD 7B 40 CC F9 E2 3F FE F7 D4 24 A9 A4 E8 8A 22 
B9 74 D7 4A 45 29 51 D6 A5 5C 57 D6 22 EC 52 2C 2B AC D4 9E 8F 73 B4 C7 EE 2A 76 51 CB 52 CB 71 
69 D7 2D 8B ED 26 B7 50 8A 4A 6E E5 D6 4D 8A 4A B9 95 94 6E 33 BF 3F E6 7C E7 CC 6F 4A A6 9A 99 
D7 CC 6B 9E 8F BF E6 FD 9A DB 33 BB 9E A6 D7 BC DF AF 17 8B CB E5 32 00 00 40 17 25 D2 01 00 00 
40 FC 50 EE 00 00 14 42 B9 03 00 50 08 E5 0E 00 40 21 94 3B 00 00 85 50 EE 00 00 14 42 B9 03 00 
50 08 E5 0E 00 40 21 94 3B 00 00 85 50 EE 00 00 14 42 B9 03 00 50 08 E5 0E 00 40 21 94 3B 00 00 
85 50 EE 00 00 14 42 B9 03 00 50 08 E5 0E 00 40 21 94 3B 00 00 85 50 EE 00 00 14 42 B9 03 00 50 
08 E5 0E 00 40 21 94 3B 00 00 85 50 EE 00 00 14 42 B9 03 00 50 08 E5 0E 00 40 21 94 3B 00 00 85 
50 EE 00 00 14 42 B9 03 00 50 08 E5 0E 00 40 21 94 3B 00 00 85 50 EE 00 00 14 42 B9 03 00 50 08 
E5 0E 00 40 21 94 3B 00 00 85 50 EE 00 00 14 42 B9 03 00 50 08 E5 0E 00 40 21 94 3B 00 00 85 50 
EE 00 00 14 42 B9 03 00 50 08 E5 0E 00 40 21 94 3B 00 00 85 50 EE 00 00 14 42 B9 03 00 50 08 E5 
0E 00 40 21 94 3B 00 00 85 50 EE 00 00 14 42 B9 03 00 50 08 E5 0E 00 40 21 94 3B 00 00 85 50 EE 
00 00 14 42 B9 03 00 50 08 E5 0E 00 40 21 94 3B 00 00 85 50 EE 00 00 14 42 B9 03 00 50 08 E5 0E 
00 40 21 94 3B 00 00 85 50 EE 00 00 14 42 B9 03 00 50 08 E5 0E 00 40 21 94 3B 00 00 85 50 EE 00 
00 14 42 B9 03 00 50 08 E5 0E 00 40 21 94 3B 00 00 85 50 EE 00 00 14 42 B9 03 00 50 08 E5 0E 00 
40 21 94 3B 00 00 85 50 EE 00 00 14 42 B9 03 00 50 08 E5 0E 00 40 21 94 3B 00 00 85 50 EE 00 00 
14 42 B9 03 00 50 88 4D E4 5D 59 2C 96 9F 9F 9F B5 B5 35 91 77 07 00 20 88 CB E5 46 47 47 67 66 
66 4A F4 5D C8 94 3B C3 30 D3 A6 4D 9B 3C 79 32 A9 77 07 00 20 85 C3 E1 9C 38 71 42 D2 EF 82 69 
19 00 00 0A 11 FB E4 0E D2 F4 F0 E1 C3 FC FC FC F7 EF DF 4B F3 4D 59 2C 96 9E 9E 9E A1 A1 E1 E0 
C1 83 A5 F9 BE 00 C0 A0 DC A9 77 E7 CE 9D 2F BE F8 E2 FE FD FB 04 33 38 3A 3A 26 24 24 F4 EE DD 
9B 60 06 00 45 83 69 19 9A 71 38 9C D9 B3 67 93 6D 76 86 61 32 32 32 F6 EE DD 4B 36 03 80 A2 41 
B9 D3 2C 2B 2B 2B 3F 3F 9F 74 0A 86 61 98 82 82 02 D2 11 00 14 0B CA 9D 66 8F 1F 3F 26 1D E1 BF 
9A 9B 9B 49 47 00 50 2C 28 77 9A 29 29 E1 BF 2F 80 82 C2 5F 7E 9A 71 38 1C D2 11 00 80 0C 94 3B 
CD B8 5C 2E E9 08 00 40 06 CA 9D 66 B2 53 EE B2 93 04 40 41 E0 3C F7 2E A9 AF AF 7F FA F4 69 79 
79 F9 8B 17 2F EA EB EB DF BD 7B 57 53 53 C3 BB 51 5D 5D CD 9F 15 A9 A9 A9 69 69 69 61 18 46 4B 
4B 4B 49 49 49 5D 5D BD 5B B7 6E DD BB 77 57 57 57 D7 D6 D6 D6 D1 D1 D1 D6 D6 D6 D6 D6 EE DD BB 
B7 81 81 81 8A 8A 8A B8 E2 A1 52 01 14 16 CA 5D 24 B5 B5 B5 8F 1E 3D E2 5D E7 59 5A 5A 5A 5E 5E 
5E 5A 5A 5A 56 56 F6 EA D5 2B F1 BE 91 92 92 92 BE BE BE B1 B1 71 DF BE 7D FB F7 EF 6F 66 66 66 
6E 6E 6E 6E 6E 6E 64 64 D4 89 57 43 B9 03 28 2C 94 7B DB 5E BF 7E 9D 99 99 99 9D 9D 7D E3 C6 8D 
5B B7 6E 15 17 17 4B E7 7D 39 1C 4E 79 79 79 79 79 B9 D0 B8 96 96 D6 B0 61 C3 6C 6C 6C 1C 1D 1D 
9D 9C 9C CC CD CD 45 39 13 06 E5 0E A0 B0 50 EE FF F3 E6 CD 9B E4 E4 E4 2B 57 AE 5C BE 7C 39 37 
37 F7 A3 A7 9A B0 58 2C 5D 5D 5D 3D 3D 3D 75 75 75 4D 4D 4D DE 64 8B B6 B6 B6 D0 C3 5E BF 7E 5D 
57 57 57 57 57 57 53 53 53 53 53 53 57 57 F7 EE DD BB 37 6F DE 74 28 5B 75 75 75 46 46 46 46 46 
C6 EF BF FF CE 30 8C 96 96 96 83 83 C3 A8 51 A3 26 4C 98 E0 E4 E4 A4 AC AC DC E6 B3 50 EE 00 0A 
0B E5 CE 14 16 16 FE FD F7 DF F1 F1 F1 A9 A9 A9 1F BA D6 C6 C0 C0 60 D8 B0 61 43 87 0E 1D 32 64 
C8 D0 A1 43 FB F5 EB A7 A7 A7 A7 AB AB CB 66 77 FE 0F F0 DD BB 77 EF DE BD 7B F1 E2 C5 8B 17 2F 
AA AA AA 9E 3F 7F 2E 78 BB AA AA 8A 77 9B 37 59 2F A4 BA BA FA FC F9 F3 E7 CF 9F FF F7 BF FF AD 
AD AD ED E1 E1 31 71 E2 C4 89 13 27 0A CD DE C8 4E B9 CB 4E 12 00 05 A1 B8 E5 FE EA D5 AB 13 27 
4E 1C 3A 74 28 3D 3D BD 75 F5 A8 AB AB 0F 1F 3E 7C C4 88 11 2E 2E 2E 63 C7 8E D5 D5 D5 15 7B 00 
75 75 75 75 75 75 3D 3D BD F6 1F 56 5F 5F 5F 5E 5E 5E 56 56 F6 FA F5 EB D6 37 9E 3D 7B F6 FA F5 
EB 98 98 98 98 98 18 86 61 46 8C 18 B1 60 C1 82 2F BE F8 82 17 18 E7 B9 03 28 2C 85 2B 77 2E 97 
9B 9C 9C BC 73 E7 CE B8 B8 B8 D6 1F 8A CD CD CD A7 4D 9B 36 6D DA 34 7B 7B FB AE 7C 2A 17 23 35 
35 35 53 53 53 53 53 D3 0F 3D A0 B6 B6 B6 BC BC BC B2 B2 B2 AA AA 8A 77 23 34 34 D4 CE CE CE D3 
D3 13 9F 97 01 14 96 4C F4 97 74 34 36 36 1E 3C 78 70 C7 8E 1D AD 57 49 B4 B5 B5 FD E2 8B 2F A6 
4F 9F 3E 64 C8 10 22 D9 BA 42 43 43 63 F0 E0 C1 6D AE 99 8E 72 07 50 58 0A 51 EE 4D 4D 4D 47 8E 
1C D9 B4 69 93 D0 DA 84 AA AA AA 53 A7 4E F5 F3 F3 F3 F0 F0 20 95 4D A2 64 A7 DC 65 27 09 80 82 
A0 BF DC 4F 9F 3E BD 76 ED 5A A1 F5 11 FB F6 ED BB 6E DD BA 85 0B 17 B6 3E B9 85 26 A8 54 00 85 
45 73 B9 E7 E7 E7 AF 5E BD 3A 31 31 51 70 B0 4F 9F 3E EB D6 AD 5B B5 6A 95 9A 9A 1A A9 60 52 83 
72 07 50 58 74 96 3B 87 C3 D9 B6 6D DB 86 0D 1B 1A 1A 1A F8 83 BD 7A F5 0A 0C 0C 5C B5 6A 95 86 
86 06 C1 6C D2 84 72 07 50 58 14 96 7B 49 49 C9 A2 45 8B 2E 5D BA 24 38 38 65 CA 94 3D 7B F6 F4 
EB D7 8F 54 2A 22 50 EE 00 0A 8B B6 72 3F 77 EE DC 9C 39 73 04 AF FF D4 D3 D3 FB F5 D7 5F 7D 7C 
7C 08 A6 22 45 76 CA 5D 76 92 00 28 08 AA 96 FC 0D 0F 0F 9F 32 65 8A 60 B3 F3 B6 87 56 CC 66 67 
70 11 13 80 02 A3 A4 DC B9 5C EE 8A 15 2B 56 AF 5E CD 5F 3F 40 49 49 E9 87 1F 7E 38 76 EC 58 EF 
DE BD C9 66 23 08 9F 97 01 14 16 0D D3 32 5C 2E 77 E5 CA 95 BF FD F6 1B 7F 44 43 43 E3 D0 A1 43 
33 66 CC 20 98 4A 16 A0 DC 01 14 96 DC 97 3B 87 C3 59 BC 78 F1 A1 43 87 F8 23 C6 C6 C6 F1 F1 F1 
D6 D6 D6 04 53 C9 08 94 3B 80 C2 92 FB 72 0F 0C 0C 14 6C 76 13 13 93 E4 E4 E4 76 56 62 51 28 B2 
53 EE B2 93 04 40 41 C8 F7 9C 7B 54 54 D4 B6 6D DB F8 87 C6 C6 C6 A9 A9 A9 68 76 3E 99 AD D4 FA 
FA FA 9A 9A 1A D2 29 00 68 26 C7 E5 9E 9C 9C BC 72 E5 4A FE A1 8E 8E CE 99 33 67 FA F7 EF 4F 30 
92 AC 91 D9 72 3F 74 E8 90 91 91 D1 A2 45 8B 52 53 53 65 36 24 80 5C 93 D7 72 AF AC AC 9C 37 6F 
5E 53 53 13 EF 90 CD 66 FF F5 D7 5F 16 16 16 64 53 C9 1A 99 ED CD BE 7D FB BE 7B F7 EE E0 C1 83 
AE AE AE C3 86 0D 0B 0B 0B 6B BD B3 20 00 74 85 5C 96 3B 97 CB 5D BC 78 71 45 45 05 7F 64 F3 E6 
CD 63 C7 8E 25 97 48 46 C9 CE 79 EE 42 FF CC 78 79 79 2D 5D BA 94 77 3B 2F 2F 2F 38 38 D8 D8 D8 
78 EA D4 A9 7F FF FD 37 FF 1F 6C 00 E8 0A B9 2C F7 E8 E8 68 C1 E5 C0 26 4F 9E FC ED B7 DF 12 CC 
23 B3 64 F6 93 3B C3 30 91 91 91 5B B6 6C E1 AF F3 D3 DC DC 1C 17 17 37 7D FA 74 63 63 E3 F5 EB 
D7 3F 7C F8 90 6C 3C 00 79 27 7F E5 FE EA D5 AB C0 C0 40 FE A1 96 96 56 64 64 24 8B C5 22 18 49 
66 C9 72 B9 B3 58 AC C0 C0 C0 BC BC BC A0 A0 20 1D 1D 1D FE 78 45 45 C5 D6 AD 5B CD CD CD 5D 5D 
5D 8F 1E 3D DA D8 D8 48 30 24 80 FC 92 BF 72 0F 09 09 A9 AC AC E4 1F 86 86 86 2A DA 72 60 A2 93 
E5 72 E7 31 34 34 0C 0D 0D 2D 2B 2B 3B 78 F0 A0 95 95 95 E0 5D A9 A9 A9 73 E7 CE 35 36 36 0E 0E 
0E 2E 2E 2E 26 14 10 40 5E C9 59 B9 17 17 17 47 45 45 F1 0F 2D 2C 2C 96 2C 59 42 30 8F 8C 93 FD 
72 E7 51 55 55 F5 F5 F5 CD C9 C9 49 4D 4D 9D 3D 7B B6 B2 B2 32 FF AE E7 CF 9F 87 85 85 0D 1A 34 
C8 D3 D3 33 2E 2E 4E 5E 7E 22 00 E2 E4 AC DC BF FF FE 7B C1 25 DA B7 6F DF 2E 23 DB 58 CB 26 D9 
A9 42 11 93 B8 B8 B8 1C 3F 7E FC E1 C3 87 42 CB EE 73 38 9C 0B 17 2E 4C 9D 3A 75 C8 90 21 61 61 
61 2F 5F BE 94 58 52 00 4A C8 53 B9 3F 7B F6 EC F0 E1 C3 FC 43 17 17 97 09 13 26 10 CC 23 FB 64 
A7 DC 3B C4 CC CC 2C 3C 3C BC B4 B4 74 EB D6 AD 26 26 26 82 77 15 14 14 F0 4E AD 59 B2 64 C9 CD 
9B 37 49 25 04 90 7D F2 54 EE 3B 77 EE 14 FC 7A 6D ED DA B5 04 C3 C8 05 39 2D 77 9E 5E BD 7A AD 
5B B7 AE A8 A8 28 36 36 76 D4 A8 51 82 77 D5 D5 D5 ED DB B7 6F C4 88 11 2E 2E 2E 31 31 31 2D 2D 
2D A4 42 02 C8 2C B9 29 F7 A6 A6 A6 7D FB F6 F1 0F 4D 4D 4D A7 4E 9D 4A 30 8F 5C 90 EB 72 E7 51 
52 52 F2 F6 F6 4E 4F 4F 6F 3D 1D CF 30 4C 5A 5A 9A 8F 8F 0F 6F AE A6 BA BA 9A 54 48 00 19 24 37 
E5 1E 17 17 57 55 55 C5 3F 5C BA 74 A9 D0 DF 73 68 4D 76 CA BD EB 49 78 D3 F1 8F 1E 3D 5A B5 6A 
55 8F 1E 3D 04 EF 2A 2A 2A E2 CD D5 04 04 04 94 94 94 74 F1 8D 00 E8 20 37 E5 FE C7 1F 7F F0 6F 
B3 58 AC 39 73 E6 10 0C 23 2F 64 E7 DF 3F 15 15 15 B1 BC CE A0 41 83 C2 C3 C3 8B 8B 8B 43 43 43 
0D 0D 0D 05 EF AA A9 A9 89 88 88 30 35 35 F5 F6 F6 BE 76 ED 9A 58 DE 0E 40 7E C9 47 B9 D7 D7 D7 
9F 3D 7B 96 7F E8 E4 E4 34 70 E0 40 82 79 E4 85 BE BE 3E E9 08 FF 65 60 60 20 C6 57 D3 D5 D5 0D 
0A 0A 2A 2C 2C DC BD 7B B7 99 99 99 E0 5D 2D 2D 2D F1 F1 F1 A3 47 8F 76 75 75 3D 7D FA B4 EC 2C 
C0 00 20 65 F2 51 EE E7 CE 9D AB AB AB E3 1F 7A 79 79 11 0C 23 47 5C 5D 5D 65 E4 DA DD 31 63 C6 
88 FD 35 D5 D4 D4 96 2D 5B F6 E8 D1 A3 D8 D8 58 07 07 07 A1 7B 53 53 53 67 CC 98 31 64 C8 90 A8 
A8 28 AC 57 03 0A 48 3E CA 3D 39 39 59 F0 70 DC B8 71 A4 92 C8 97 C1 83 07 07 05 05 91 4E C1 58 
5B 5B 7F FA E9 A7 12 7A 71 DE 37 AE 19 19 19 A9 A9 A9 AD FF D5 2F 2C 2C F4 F7 F7 1F 3C 78 70 78 
78 B8 E0 E7 03 00 EA B1 88 7C E7 C6 62 B1 12 12 12 26 4F 9E 2C E2 E3 1D 1C 1C B2 B2 B2 78 B7 35 
34 34 5E BD 7A 25 AE 39 5C 45 90 97 97 97 9C 9C 4C EA 64 12 2D 2D AD 39 73 E6 68 6B 6B 4B E7 ED 
6E DD BA B5 7D FB F6 C3 87 0F B7 3E 3F 52 57 57 F7 EB AF BF 0E 08 08 90 5A 18 80 36 71 38 1C 77 
77 F7 2B 57 AE 48 F4 5D E4 A0 DC DF BF 7F AF A5 A5 C5 3F C3 DD DD DD 5D E8 83 3C 80 90 C2 C2 C2 
88 88 88 A8 A8 A8 F7 EF DF 0B DD A5 A9 A9 B9 78 F1 E2 A0 A0 20 23 23 23 22 D9 00 A4 53 EE 72 30 
2D 93 9D 9D 2D 78 ED 12 76 BE 86 8F E2 9D 54 93 97 97 17 10 10 20 74 DE E4 DB B7 6F 23 22 22 CC 
CC CC 56 AD 5A 85 F3 26 81 62 72 50 EE 42 A7 B5 09 AD 1D 08 F0 21 FD FB F7 DF B1 63 47 71 71 F1 
C6 8D 1B B5 B4 B4 04 EF AA AF AF FF F5 D7 5F CD CC CC 7C 7D 7D 0B 0B 0B 49 25 04 90 1C 39 28 F7 
DC DC 5C C1 C3 A1 43 87 92 4A 02 F2 48 57 57 37 24 24 A4 B0 B0 70 E3 C6 8D BD 7A F5 12 BC AB A9 
A9 29 3A 3A DA DC DC DC D7 D7 B7 A8 A8 88 54 42 00 49 90 83 72 7F F2 E4 89 E0 21 56 6F 87 4E E8 
DD BB 77 48 48 48 49 49 49 68 68 A8 E0 DE 20 8C 40 C5 FB FB FB 3F 7B F6 8C 54 42 00 F1 92 83 72 
2F 2D 2D 15 3C 14 EF E5 30 A0 50 34 35 35 83 82 82 9E 3C 79 B2 63 C7 0E A1 0B 5C 1B 1B 1B A3 A2 
A2 4C 4D 4D 51 F1 40 07 59 2F 77 2E 97 FB F4 E9 53 FE A1 A6 A6 A6 D0 F7 63 00 1D A5 A1 A1 11 10 
10 90 9F 9F FF CB 2F BF E8 E9 E9 09 DE C5 AB F8 C1 83 07 AF 59 B3 46 70 07 76 00 B9 23 EB E5 5E 
51 51 21 B8 3B 87 BA BA 3A C1 30 40 13 75 75 F5 B5 6B D7 16 15 15 85 85 85 F5 E9 D3 47 F0 AE FA 
FA FA 1D 3B 76 0C 1A 34 28 30 30 F0 D5 AB 57 A4 12 02 74 85 1C 94 BB E0 61 F7 EE DD 49 25 01 2A 
A9 AB AB AF 5F BF 9E B7 12 99 D0 5C 7C 5D 5D DD CF 3F FF 6C 62 62 12 1C 1C FC F6 ED 5B 52 09 01 
3A 47 D6 CB 5D F0 63 3B C3 30 AA AA AA A4 92 00 C5 D4 D5 D5 79 73 F1 A1 A1 A1 42 67 D4 D4 D6 D6 
F2 36 71 0D 0B 0B 13 BC DE 02 40 C6 C9 7A B9 0B 2D F9 84 3D 77 40 72 34 34 34 82 82 82 78 67 D4 
08 9D 17 5F 55 55 15 1C 1C 6C 6D 6D 1D 13 13 23 3B AB E4 03 B4 43 CE CA BD F5 D5 E4 00 E2 C5 3B 
A3 A6 A0 A0 20 30 30 50 E8 DB FB BC BC 3C 1F 1F 1F 47 47 47 2C 80 01 B2 0F E5 0E D0 86 3E 7D FA 
6C D9 B2 A5 B8 B8 38 28 28 A8 5B B7 6E 82 77 65 65 65 8D 1F 3F DE D3 D3 33 3B 3B 9B 54 3C 80 8F 
92 F5 72 6F 6E 6E 16 3C AC A9 A9 C1 2F C5 20 35 BA BA BA A1 A1 A1 B9 B9 B9 3E 3E 3E 42 2B E3 5F 
B8 70 61 E4 C8 91 BE BE BE 38 29 1E 64 93 AC 97 BB D0 EF C5 8D 8D 8D 6F DE BC 21 15 06 14 D3 E0 
C1 83 8F 1D 3B 76 F7 EE DD D9 B3 67 0B 8E 73 B9 DC E8 E8 E8 21 43 86 E0 74 1A 90 41 B2 5E EE 42 
67 A7 31 0C 53 59 59 49 24 09 28 38 2B 2B AB E3 C7 8F 5F BD 7A D5 C5 C5 45 70 BC AE AE 2E 2C 2C 
CC DC DC 3C 2A 2A 0A BB FA 81 EC 90 BF 72 2F 2F 2F 27 92 04 80 61 18 67 67 E7 D4 D4 D4 F3 E7 CF 
0B 2D 3D FD EC D9 33 7F 7F 7F 07 07 87 D4 D4 54 52 D9 00 04 C9 5F B9 63 81 56 20 CE C3 C3 E3 E6 
CD 9B BB 77 EF 16 5A BD 20 3B 3B DB CD CD ED F3 CF 3F 17 5A ED 0E 40 FA 64 BD DC D5 D5 D5 85 2E 
5C 42 B9 83 2C 60 B3 D9 CB 96 2D 2B 2A 2A DA B8 71 A3 9A 9A 1A 7F 9C CB E5 1E 3B 76 6C C8 90 21 
01 01 01 35 35 35 04 13 82 82 93 F5 72 67 18 46 68 F5 BE BC BC 3C 52 49 00 84 A8 AB AB 87 84 84 
E4 E5 E5 F9 F9 F9 29 29 FD EF 6F 53 63 63 63 44 44 C4 B0 61 C3 0E 1D 3A 84 F3 BB 80 08 39 28 F7 
21 43 86 08 1E E6 E4 E4 90 4A 02 D0 A6 7E FD FA 45 46 46 66 64 64 B8 B9 B9 09 8E 97 97 97 2F 5C 
B8 70 EC D8 B1 42 1B CE 00 48 81 1C 94 FB B0 61 C3 04 0F 0B 0A 0A 6A 6B 6B 49 85 01 F8 10 7B 7B 
FB CB 97 2F C7 C6 C6 9A 99 99 09 8E A7 A4 A4 D8 D9 D9 61 96 06 A4 4C FE CA 9D C3 E1 DC BD 7B 97 
54 18 80 F6 79 7B 7B DF BB 77 6F FB F6 ED DA DA DA FC C1 E6 E6 E6 88 88 08 73 73 F3 A3 47 8F 12 
CC 06 0A 45 0E CA BD F5 A6 A9 D7 AF 5F 27 92 04 40 14 DD BA 75 5B BD 7A 75 41 41 C1 AA 55 AB 94 
95 95 F9 E3 65 65 65 73 E7 CE C5 2C 0D 48 87 1C 94 BB 85 85 85 D0 48 5A 5A 1A 91 24 00 A2 D3 D1 
D1 09 0F 0F CF CA CA 12 BA E8 E9 CA 95 2B 98 A5 01 29 90 83 72 37 30 30 18 30 60 80 E0 48 6A 6A 
2A CE 40 00 B9 60 67 67 97 92 92 12 1D 1D 6D 64 64 C4 1F E4 CD D2 58 58 58 9C 3A 75 8A 60 36 A0 
9B 1C 94 3B C3 30 CE CE CE 82 87 55 55 55 F7 EE DD 23 15 06 A0 43 58 2C D6 FC F9 F3 F3 F2 F2 36 
6E DC 28 78 D1 C6 B3 67 CF 66 CE 9C E9 ED ED 2D B4 05 3C 80 58 C8 65 B9 33 0C 93 90 90 40 24 09 
40 E7 F0 CE 88 CF CD CD F5 F2 F2 12 1C 8F 8F 8F B7 B6 B6 0E 0F 0F C7 BA 34 20 5E 28 77 00 E9 31 
33 33 8B 8B 8B 8B 8B 8B 33 35 35 E5 0F 56 57 57 AF 5E BD DA D5 D5 F5 FE FD FB 04 B3 01 65 E4 A3 
DC AD AC AC 84 B6 3D 4B 4F 4F C7 B6 F4 20 A7 BC BC BC 72 73 73 85 66 69 D2 D2 D2 86 0F 1F 1E 1C 
1C 2C B4 6F 30 40 E7 C8 47 B9 2B 29 29 4D 98 30 41 70 A4 A5 A5 E5 CC 99 33 A4 F2 00 74 91 9A 9A 
5A 48 48 48 4E 4E 8E 87 87 07 7F B0 A9 A9 29 2C 2C CC CA CA EA E2 C5 8B 04 B3 01 1D E4 A3 DC 19 
86 11 9A A9 64 30 33 03 F2 6F F0 E0 C1 E7 CE 9D DB BF 7F 7F 9F 3E 7D F8 83 05 05 05 9E 9E 9E FE 
FE FE D5 D5 D5 04 B3 81 BC 93 9B 72 9F 34 69 92 E0 F5 20 0C C3 24 25 25 35 36 36 92 CA 03 20 16 
2C 16 6B D1 A2 45 79 79 79 AB 56 AD E2 2F 3D C6 E5 72 A3 A2 A2 CC CD CD 63 63 63 C9 C6 03 F9 25 
37 E5 AE AB AB EB E8 E8 28 38 F2 FA F5 EB C4 C4 44 52 79 00 C4 48 5B 5B 3B 3C 3C 3C 25 25 C5 CA 
CA 8A 3F 58 5E 5E 3E 6D DA 34 1F 1F 9F D7 AF 5F 13 CC 06 72 4A 6E CA 9D 61 18 6F 6F 6F A1 91 83 
07 0F 12 49 02 20 09 CE CE CE 37 6F DE DC BC 79 B3 E0 02 F1 31 31 31 C3 87 0F 3F 7F FE 3C C1 60 
20 8F E4 A9 DC 67 CF 9E 2D B4 03 7D 42 42 42 55 55 15 A9 3C 00 62 A7 A2 A2 12 1C 1C 9C 9B 9B EB 
EE EE CE 1F 2C 29 29 99 30 61 82 AF AF 2F B6 E1 06 D1 C9 53 B9 0F 1A 34 48 68 66 A6 A9 A9 E9 C8 
91 23 A4 F2 00 48 88 A9 A9 E9 C5 8B 17 23 23 23 35 35 35 F9 83 D1 D1 D1 D6 D6 D6 17 2E 5C 20 18 
0C E4 88 3C 95 3B C3 30 F3 E6 CD 13 1A C1 CC 0C 50 89 C5 62 F9 F9 F9 3D 7C F8 70 EA D4 A9 FC C1 
27 4F 9E 4C 98 30 C1 DF DF 1F 1F E1 E1 A3 E4 AC DC E7 CC 99 A3 A2 A2 22 38 72 F3 E6 4D 2C EF 0E 
B4 32 32 32 FA FB EF BF F7 EF DF CF 5F 1D 9E 77 22 8D AD AD 6D 6A 6A 2A D9 6C 20 E3 E4 AC DC 75 
75 75 85 AE 66 62 18 66 D7 AE 5D 44 C2 00 48 C7 A2 45 8B 1E 3C 78 30 6B D6 2C FE C8 E3 C7 8F DD 
DC DC 02 02 02 70 36 30 7C 88 9C 95 3B C3 30 5F 7D F5 95 D0 C8 C1 83 07 9F 3F 7F 4E 24 0C 80 74 
E8 EB EB 9F 38 71 E2 D8 B1 63 7A 7A 7A BC 11 2E 97 1B 11 11 E1 EC EC FC E8 D1 23 B2 D9 40 36 C9 
5F B9 7B 7B 7B F7 EB D7 4F 70 A4 A1 A1 21 32 32 92 54 1E 00 A9 F1 F1 F1 C9 CD CD 9D 31 63 06 7F 
E4 C6 8D 1B 76 76 76 E1 E1 E1 D8 E1 00 84 C8 5F B9 B3 D9 EC 25 4B 96 08 0D EE DA B5 EB FD FB F7 
44 F2 00 48 93 AE AE EE C9 93 27 8F 1F 3F CE 9F 85 AF AF AF 5F BD 7A F5 A4 49 93 CA CB CB C9 66 
03 99 22 7F E5 CE 30 8C 9F 9F 9F D0 D7 AA 95 95 95 87 0F 1F 26 95 07 40 CA 66 CF 9E 7D EB D6 2D 
C1 73 E1 CF 9E 3D 3B 7C F8 F0 F8 F8 78 82 A9 40 A6 C8 65 B9 1B 1A 1A 0A 9E 1F C6 B3 7D FB 76 FC 
66 0A 8A C3 C4 C4 84 77 2E 7C 8F 1E 3D 78 23 95 95 95 53 A7 4E F5 F7 F7 7F F7 EE 1D D9 6C 20 0B 
E4 B2 DC 19 86 09 08 08 10 1A C9 CD CD C5 25 DA A0 50 78 E7 C2 67 64 64 D8 D9 D9 F1 46 78 27 4A 
3A 38 38 E4 E4 E4 90 CD 06 C4 C9 6B B9 8F 19 33 C6 C9 C9 49 68 70 DB B6 6D 44 C2 00 10 64 65 65 
95 99 99 B9 71 E3 46 FE B2 A9 F7 EF DF 77 70 70 08 0F 0F 27 1B 0C C8 92 D7 72 67 18 66 CD 9A 35 
42 23 E7 CE 9D C3 05 4D A0 80 D8 6C 76 48 48 48 4A 4A CA 80 01 03 78 23 EF DF BF 5F BD 7A F5 DC 
B9 73 6B 6A 6A 88 46 03 62 E4 B8 DC 67 CD 9A 25 B8 11 25 C3 30 5C 2E F7 5F FF FA 17 A9 3C 00 64 
8D 1E 3D FA CE 9D 3B 73 E7 CE E5 8F 1C 3D 7A D4 D6 D6 36 23 23 83 60 2A 20 45 8E CB 5D 59 59 79 
D5 AA 55 42 83 7F FF FD F7 F5 EB D7 89 E4 01 20 AE 67 CF 9E 87 0F 1F 3E 78 F0 A0 BA BA 3A 6F A4 
B8 B8 D8 CD CD 0D 27 C2 2B 20 39 2E 77 86 61 96 2C 59 A2 AB AB 2B 34 18 14 14 44 24 0C 80 8C F0 
F5 F5 CD CA CA B2 B1 B1 E1 1D 36 34 34 AC 5E BD 7A C6 8C 19 D8 F4 43 A1 C8 77 B9 AB AB AB B7 3E 
6D 26 25 25 05 FB 0B 83 82 33 37 37 CF C8 C8 10 FC D5 F6 EF BF FF 1E 3E 7C 78 7A 7A 3A C1 54 20 
4D F2 5D EE 0C C3 7C F3 CD 37 BD 7A F5 12 1A FC EE BB EF F0 4B 28 28 B8 EE DD BB 87 87 87 C7 C4 
C4 F0 FF 82 94 94 94 B8 BB BB E3 8A 10 05 21 F7 E5 DE B3 67 CF 15 2B 56 08 0D 66 65 65 61 67 61 
00 86 61 3E FB EC B3 3B 77 EE B8 B8 B8 F0 0E 1B 1B 1B D7 AE 5D 3B 7D FA F4 EA EA 6A B2 C1 40 D2 
E4 BE DC 19 86 59 BD 7A B5 86 86 86 D0 E0 86 0D 1B 38 1C 0E 91 3C 00 32 C5 D8 D8 F8 D2 A5 4B 6B 
D6 AC E1 EF 52 19 1B 1B 3B 7A F4 68 2C 27 49 37 1A CA BD 4F 9F 3E DF 7C F3 8D D0 60 6E 6E 2E 56 
9B 01 E0 61 B3 D9 DB B6 6D 3B 75 EA 94 96 96 16 6F E4 FE FD FB 23 47 8E 8C 89 89 21 1B 0C 24 87 
86 72 67 18 66 FD FA F5 6D CE BC 63 91 0D 00 BE 69 D3 A6 65 66 66 5A 59 59 F1 0E DF BE 7D 3B 67 
CE 9C 80 80 80 A6 A6 26 B2 C1 40 12 28 29 F7 5E BD 7A B5 3E E7 FD E9 D3 A7 5B B7 6E 25 92 07 40 
36 0D 19 32 E4 DA B5 6B 73 E6 CC E1 1D F2 76 FC F0 F4 F4 C4 76 37 F4 A1 A4 DC 19 86 59 BB 76 AD 
8E 8E 8E D0 E0 96 2D 5B 8A 8B 8B 49 C4 01 90 51 1A 1A 1A 47 8F 1E 8D 8C 8C EC D6 AD 1B 6F E4 CA 
95 2B F6 F6 F6 B8 FA 8F 32 F4 94 BB 96 96 D6 DA B5 6B 85 06 EB EB EB 03 03 03 89 E4 01 90 65 7E 
7E 7E C9 C9 C9 46 46 46 BC C3 A7 4F 9F 8E 1D 3B 16 6B 8D D1 84 9E 72 67 18 26 20 20 80 BF C3 24 
DF 89 13 27 B0 83 01 40 6B CE CE CE D9 D9 D9 6E 6E 6E BC 43 DE 85 AC 7E 7E 7E D8 74 9B 0E 54 95 
BB 86 86 C6 BA 75 EB 5A 8F AF 5C B9 12 DF AC 02 B4 66 60 60 70 E1 C2 05 C1 2B 45 7E FF FD 77 4F 
4F CF AA AA 2A 82 A9 40 2C A8 2A 77 86 61 56 AE 5C C9 FF 4D 93 EF C9 93 27 9B 36 6D 22 92 07 40 
C6 B1 D9 EC 9D 3B 77 46 46 46 F2 B7 AE 4C 49 49 F9 E4 93 4F 6E DE BC 49 36 18 74 11 6D E5 AE A6 
A6 D6 E6 24 FB 2F BF FC 72 EB D6 2D E9 E7 01 90 0B BC 29 78 FE AC E6 D3 A7 4F DD DC DC 4E 9D 3A 
45 36 15 74 05 6D E5 CE 30 CC B2 65 CB FA F7 EF 2F 34 D8 DC DC BC 64 C9 12 4C 26 02 7C 88 8B 8B 
CB B5 6B D7 2C 2D 2D 79 87 B5 B5 B5 B3 66 CD 0A 0E 0E C6 42 34 72 8A C2 72 EF DE BD FB C6 8D 1B 
5B 8F DF BC 79 F3 FB EF BF 97 7E 1E 00 79 61 6A 6A 7A ED DA 35 FE EE F3 5C 2E 37 2C 2C EC F3 CF 
3F AF AB AB 23 1B 0C 3A 81 C2 72 67 18 66 E1 C2 85 B6 B6 B6 AD C7 C3 C2 C2 D2 D2 D2 A4 9F 07 40 
5E 68 6A 6A 9E 3E 7D 5A F0 E3 D1 F1 E3 C7 9D 9D 9D 4B 4A 4A 08 A6 82 4E A0 B3 DC D9 6C F6 AE 5D 
BB F8 CB 24 F1 B5 B4 B4 F8 FA FA D6 D6 D6 12 49 05 20 17 58 2C 56 48 48 C8 FE FD FB 55 55 55 79 
23 B7 6F DF 76 72 72 C2 76 7D F2 85 CE 72 67 18 C6 D9 D9 B9 CD 2D 99 8A 8A 8A 5A EF AC 0D 00 42 
16 2D 5A 74 E1 C2 85 DE BD 7B F3 0E CB CB CB DD DD DD 4F 9C 38 41 36 15 88 8E DA 72 67 18 66 D3 
A6 4D 1E 1E 1E AD C7 F7 EE DD 8B D5 DE 01 3E CA C5 C5 25 23 23 63 F0 E0 C1 BC C3 FA FA 7A 1F 1F 
9F 90 90 10 A2 A1 40 54 34 97 3B 9B CD 8E 8F 8F 9F 3E 7D 7A EB BB 96 2C 59 52 51 51 21 FD 48 00 
F2 65 D0 A0 41 A9 A9 A9 F6 F6 F6 BC 43 2E 97 FB FD F7 DF 2F 5D BA 14 0B 49 CA 3E 9A CB 9D 61 18 
55 55 D5 98 98 98 1D 3B 76 68 6B 6B 0B 8E 57 55 55 B5 79 2D 2B 00 08 D1 D7 D7 BF 7C F9 B2 97 97 
17 7F 64 EF DE BD 5E 5E 5E 35 35 35 04 53 C1 47 B1 88 9C C4 CA 62 B1 12 12 12 26 4F 9E 2C B5 77 
7C FD FA 75 52 52 D2 C5 8B 17 9F 3C 79 A2 A9 A9 39 7A F4 E8 C5 8B 17 F3 E7 13 01 A0 7D 2D 2D 2D 
2B 57 AE DC B3 67 0F 7F C4 DA DA 3A 21 21 A1 F5 35 25 F0 51 1C 0E C7 DD DD FD CA 95 2B 12 7D 17 
45 29 77 00 E8 BA B0 B0 30 C1 DD E7 8D 8C 8C E2 E3 E3 ED EC EC C8 A6 92 3B D2 29 77 CA A7 65 00 
40 8C 82 82 82 F6 EF DF CF 5F 85 A6 AC AC CC D5 D5 35 31 31 91 6C 2A 68 13 CA 1D 00 3A 60 E1 C2 
85 71 71 71 FC 2D E9 6B 6B 6B A7 4F 9F BE 6F DF 3E B2 A9 A0 35 94 3B 00 74 CC A7 9F 7E 7A E9 D2 
25 FE 57 56 4D 4D 4D 4B 96 2C 09 0E 0E 26 9B 0A 84 A0 DC 01 A0 C3 EC ED ED 53 52 52 04 97 D7 0E 
0B 0B 5B B9 72 25 87 C3 21 98 0A 04 A1 DC 01 A0 33 2C 2C 2C AE 5E BD 6A 6A 6A CA 1F D9 B5 6B D7 
67 9F 7D F6 FE FD 7B 82 A9 80 0F E5 0E 00 9D 34 70 E0 C0 4B 97 2E F1 2F 61 65 18 E6 D4 A9 53 93 
27 4F C6 29 F0 B2 00 E5 0E 00 9D 67 6C 6C 9C 9A 9A 2A B8 08 EB A5 4B 97 C6 8D 1B 57 59 59 49 30 
15 30 0C C3 70 49 60 18 26 21 21 81 7F 98 95 95 45 FA 8F A1 AB FC FD FD 85 7E C6 FC FC FC 36 1F 
F9 E0 C1 03 E9 FE 61 8B 64 E1 C2 85 AD A3 CE 99 33 A7 FD 67 39 3A 3A 4A F8 CF B5 AB 54 55 55 8D 
8D 8D DD DC DC 42 43 43 0B 0A 0A BA F8 A7 C4 E1 70 92 92 92 BE FE FA 6B 1B 1B 1B 5D 5D DD D6 CB 
8E 4A 99 92 92 92 AE AE AE 8D 8D CD 8A 15 2B CE 9E 3D CB E1 70 BA F8 03 76 DA AB 57 AF 46 8D 1A 
25 98 CD D4 D4 34 3F 3F 5F 8C 6F 41 53 4B B4 B4 B4 B8 BA BA 8A F1 0F A7 4D F8 E4 0E 34 6B 68 68 
28 29 29 B9 72 E5 4A 70 70 F0 B0 61 C3 96 2D 5B F6 E2 C5 8B CE BD D4 E5 CB 97 ED ED ED 27 4E 9C 
F8 DB 6F BF DD BD 7B B7 AA AA 8A 4B 7A 8B 22 0E 87 53 55 55 75 F7 EE DD 5D BB 76 7D FA E9 A7 0E 
0E 0E A9 A9 A9 44 92 68 6B 6B 9F 3F 7F 5E 70 9D BE A2 A2 A2 31 63 C6 DC BE 7D 9B 48 1E 60 30 2D 
03 8A A3 B9 B9 39 32 32 D2 DE DE 3E 27 27 A7 A3 CF FD F9 E7 9F C7 8F 1F 2F E3 7B 46 DF B8 71 C3 
DD DD 7D C7 8E 1D 44 DE 5D 5D 5D 3D 36 36 56 70 09 9A 8A 8A 0A 77 77 77 52 FF DE 00 CA 1D 14 CB 
93 27 4F 9C 9D 9D 3B D4 EF 1B 36 6C 08 0C 0C 94 8B 93 FC 5A 5A 5A D6 AC 59 43 6A 3B 49 35 35 B5 
53 A7 4E 7D F5 D5 57 FC 91 37 6F DE 9C 39 73 86 48 18 40 B9 83 C2 79 FB F6 ED D4 A9 53 45 9C 9F 
39 7A F4 E8 8F 3F FE 28 E9 48 E2 F5 FD F7 DF C7 C4 C4 10 79 6B 36 9B BD 77 EF DE E4 E4 64 2F 2F 
2F 1B 1B 9B C0 C0 C0 36 37 34 06 29 60 93 0E 00 40 40 71 71 F1 86 0D 1B 04 D7 38 6C 53 75 75 F5 
CA 95 2B A5 13 49 8C B8 5C EE 8A 15 2B 26 4E 9C A8 A9 A9 49 24 80 BB BB BB BB BB 3B 91 B7 06 3E 
7C 72 07 05 B5 6F DF BE C2 C2 C2 F6 1F B3 6D DB B6 97 2F 5F 4A 27 8F 78 55 55 55 6D DB B6 8D 74 
0A 20 49 26 3E B9 0F 1D 3A F4 FC F9 F3 62 7F D9 F8 F8 F8 F0 F0 70 A1 C1 3E 7D FA 1C 39 72 44 EC 
EF D5 AF 5F 3F B1 BF A6 5C 9B 3F 7F FE F4 E9 D3 B5 B4 B4 C8 C6 68 68 68 48 49 49 F9 F5 D7 5F EB 
EB EB 85 EE 6A 6E 6E 8E 89 89 69 7F 45 94 C3 87 0F B7 39 6E 69 69 F9 CD 37 DF 98 9A 9A 92 3D 1B 
92 C3 E1 14 15 15 45 44 44 3C 78 F0 A0 F5 BD 47 8E 1C A1 69 4A 04 2D D1 51 32 51 EE 9A 9A 9A 6D 
6E 76 DA 45 05 05 05 AD 07 55 55 55 25 F1 5E 20 68 F7 EE DD CB 96 2D 23 9D E2 BF A6 4C 99 32 73 
E6 4C 77 77 F7 D6 FD 7E E6 CC 99 76 CA BD A0 A0 A0 CD FF 85 C6 8E 1D 9B 98 98 A8 A6 A6 26 E6 A0 
9D E5 EB EB FB E9 A7 9F 5E BD 7A 55 68 FC D1 A3 47 8F 1F 3F 1E 38 70 20 91 54 62 87 96 E8 28 4C 
CB 80 98 39 39 39 C9 4E B3 F3 38 3A 3A 7E F3 CD 37 AD C7 DB 9F 96 69 F3 AF 3D C3 30 91 91 91 B2 
D3 EC 0C C3 F4 E8 D1 63 D7 AE 5D 6D DE F5 D1 79 27 A0 18 CA 1D C4 CC C5 C5 85 74 84 36 B8 BA BA 
B6 1E AC AC AC 6C E7 42 A4 E7 CF 9F B7 1E D4 D7 D7 1F 32 64 88 38 93 89 83 8D 8D 4D 9B 33 60 6D 
FE 08 A0 20 50 EE 20 66 AA AA AA A4 23 B4 A1 CD 54 4D 4D 4D 2D 2D 2D 1F 7A 4A EB 69 1C 86 61 BA 
77 EF 2E CE 58 E2 D3 66 B0 36 7F 04 50 10 28 77 00 00 0A C9 C4 17 AA 00 D0 45 E1 E1 E1 AD 3F A7 
3B 3B 3B 7F E8 F1 A7 4F 9F 9E 31 63 86 84 43 B5 A7 67 CF 9E FA FA FA 56 56 56 BC 6F BC B5 B5 B5 
09 86 A1 12 CA 1D 80 06 73 E6 CC 21 1D A1 63 6A 6A 6A 6A 6A 6A F2 F3 F3 4F 9D 3A B5 6E DD BA E0 
E0 E0 B5 6B D7 F2 B7 DE 86 AE C3 B4 0C 00 10 F6 E6 CD 9B E0 E0 60 0F 0F 8F 4E AF D9 09 AD A1 DC 
01 40 26 A4 A4 A4 8C 1E 3D FA D5 AB 57 A4 83 50 02 E5 0E 00 B2 22 3F 3F FF B3 CF 3E 6B 6E 6E 26 
1D 84 06 28 77 00 90 21 97 2E 5D 8A 8C 8C 24 9D 82 06 28 77 00 90 2D FF FE F7 BF EB EA EA 48 A7 
90 7B 38 5B 06 40 11 D9 DB DB 47 47 47 13 0C F0 F2 E5 CB 98 98 98 B4 B4 B4 D6 77 55 56 56 9E 3B 
77 6E FA F4 E9 D2 4F 45 13 94 3B 80 22 EA D7 AF DF FC F9 F3 C9 66 58 B5 6A D5 B7 DF 7E BB 7D FB 
F6 D6 77 25 26 26 A2 DC BB 08 D3 32 00 40 06 8B C5 DA BA 75 EB A0 41 83 5A DF 95 9F 9F 2F FD 3C 
94 41 B9 03 00 31 CA CA CA 63 C6 8C 69 3D 5E 51 51 21 FD 30 94 41 B9 03 00 49 6D AE E9 86 25 CF 
BA 0E E5 0E D0 36 36 BB 8D 6F A4 38 1C 8E F4 93 00 74 02 CA 1D A0 6D 7D FA F4 69 3D F8 FC F9 F3 
DA DA 5A E9 87 01 E8 28 94 3B 40 DB 8C 8C 8C 5A 0F 36 36 36 6E D9 B2 45 FA 61 00 3A 0A E5 0E D0 
36 3B 3B BB 9E 3D 7B B6 1E DF B4 69 D3 92 25 4B EE DF BF DF CE 46 1F 00 C4 A1 DC 01 DA A6 A2 A2 
32 69 D2 A4 36 EF DA B7 6F 9F A5 A5 25 9B CD 66 11 A5 AC AC AC A7 A7 67 6B 6B BB 72 E5 CA B3 67 
CF B6 B3 65 20 28 20 94 3B C0 07 7D F7 DD 77 2C 16 8B 74 8A 0F E2 70 38 55 55 55 77 EF DE DD B5 
6B D7 C4 89 13 47 8E 1C 79 E5 CA 15 D2 A1 40 56 A0 DC 01 3E C8 D6 D6 76 F1 E2 C5 A4 53 88 2A 3B 
3B 7B DC B8 71 BF FC F2 0B E9 20 20 13 50 EE 00 ED D9 B9 73 A7 BD BD 3D E9 14 A2 E2 70 38 EB D6 
AD FB E7 3F FF 49 3A 08 90 87 72 07 68 8F 9A 9A 5A 5C 5C 9C 1C F5 3B C3 30 3F FC F0 C3 91 23 47 
48 A7 00 C2 50 EE 00 1F 61 60 60 90 92 92 F2 D5 57 5F 29 29 C9 CD DF 97 6F BE F9 A6 BA BA 9A 74 
0A 20 49 6E FE 67 05 20 48 4D 4D 6D EF DE BD B7 6E DD 9A 37 6F 9E B6 B6 36 E9 38 1F F7 F2 E5 CB 
9F 7F FE B9 9D 07 9C 3E 7D 9A EC A9 3E 7C D8 9A 43 42 B0 E4 2F 80 A8 6C 6C 6C FE F8 E3 8F E6 E6 
E6 7B F7 EE 55 54 54 BC 7C F9 92 EC 6A 04 CD CD CD 8F 1E 3D DA BF 7F FF F3 E7 CF 5B DF 7B EC D8 
B1 4D 9B 36 49 3F 15 C8 08 94 3B 40 C7 B0 D9 6C 5B 5B 5B 5B 5B 5B D2 41 FE 2B 30 30 D0 CB CB EB 
DA B5 6B 42 E3 F9 F9 F9 85 85 85 6D 2E A8 0B 8A 00 D3 32 00 F2 4D 47 47 27 2A 2A AA CD BB 8A 8A 
8A A4 1C 06 64 07 CA 1D 40 EE 59 59 59 33 50 EB 2B 00 00 1B CF 49 44 41 54 F5 EA D5 AB F5 78 9B 
D3 35 A0 20 50 EE 00 34 68 73 55 F4 F7 EF DF 4B 3F 09 C8 08 94 3B 00 00 85 F0 85 2A 00 FC CF BE 
7D FB 7A F4 E8 21 E5 77 BC 70 E1 82 34 DF 51 41 A0 DC 01 E0 7F 66 CE 9C D9 E6 F4 BD E4 5C BE 7C 
19 E5 2E 09 98 96 01 00 A0 10 CA 1D 00 80 42 28 77 00 00 0A A1 DC 01 00 28 84 72 07 00 A0 10 CA 
1D 00 80 42 28 77 00 00 0A E1 3C 77 80 B6 95 96 96 DE BB 77 4F 68 50 4D 4D CD CD CD 8D 48 1E 80 
0E 41 B9 03 B4 2D 21 21 61 F9 F2 E5 42 83 26 26 26 C5 C5 C5 24 E2 00 74 0C A6 65 00 00 28 84 72 
97 14 35 35 B5 36 C7 1B 1A 1A A4 9C 44 14 6D A6 FA D0 8F D0 89 97 22 AE CD 54 2A 2A 2A 6C F6 07 
7F 79 ED DE BD BB 88 AF 23 0B DA 0C D6 E6 8F C0 A3 AE AE DE E6 78 5D 5D 9D D8 32 01 51 28 77 49 
D1 D5 D5 6D 73 FC EA D5 AB 52 4E F2 51 CD CD CD E9 E9 E9 AD C7 F5 F5 F5 3B F1 6A 32 F8 03 32 0C 
93 92 92 D2 7A 50 4F 4F AF 9D A7 B4 79 6F 45 45 85 0C EE 80 71 FF FE FD 37 6F DE B4 1E 6F E7 BF 
E0 87 EE C2 32 2F D4 40 B9 4B 4A B7 6E DD FA F7 EF DF 7A 7C D3 A6 4D B2 36 69 BB 71 E3 C6 92 92 
92 D6 E3 9D DB A1 ED FA F5 EB BF FF FE 7B 97 43 89 D3 8D 1B 37 76 EE DC D9 7A BC FD 1F 70 E0 C0 
81 6D 8E 2F 5F BE 5C A6 3E BF D7 D7 D7 7F FD F5 D7 6D DE 65 6A 6A FA A1 67 99 9A 9A AA A8 A8 B4 
1E 0F 0E 0E 7E FC F8 B1 D8 C2 01 39 F8 42 55 82 26 4E 9C D8 BA E6 9E 3F 7F 6E 6F 6F BF 66 CD 9A 
11 23 46 B4 33 27 20 1D 2F 5E BC F8 F3 CF 3F E3 E3 E3 DB BC 77 E2 C4 89 9D 7B 59 7F 7F FF D4 D4 
D4 E9 D3 A7 F7 EC D9 B3 0B E9 C4 A0 A1 A1 E1 EA D5 AB 11 11 11 6D CE 36 4C 9A 34 A9 9D E7 9A 9B 
9B 1B 1B 1B B7 FE 67 EF DC B9 73 0E 0E 0E 2B 57 AE 1C 30 60 00 8B C5 12 67 DC 0E E2 72 B9 8F 1F 
3F 8E 88 88 68 7D 56 0F C3 30 66 66 66 ED FC EB A5 A1 A1 E1 EA EA 7A F1 E2 45 A1 F1 F2 F2 F2 4F 
3E F9 64 D9 B2 65 56 56 56 CA CA CA 62 4E DC 96 C2 C2 42 29 BC 8B 22 E2 92 C0 30 4C 42 42 82 A4 
DF 65 F7 EE DD AD 7F DE BE 7D FB 4A FA 7D F9 92 93 93 A5 FE DF 53 6C 5C 5C 5C 3E FA 03 3A 3A 3A 
92 8E D9 79 6C 36 BB A0 A0 A0 FD 1F 30 30 30 90 74 CC CE DB B0 61 43 FB 3F DD A1 43 87 48 67 FC 
20 13 13 13 D1 FF A2 75 05 91 96 68 69 69 71 75 75 95 E8 5B 70 B9 5C 4C CB 48 90 BB BB FB F8 F1 
E3 49 A7 E8 A4 9F 7E FA 89 74 04 C9 FA F2 CB 2F 3F 3A EF B4 7E FD 7A E2 BF 7C 74 8E 8E 8E CE BA 
75 EB DA 7F CC BC 79 F3 AC AC AC A4 93 07 A4 0F E5 2E 59 BF FE FA AB A6 A6 26 E9 14 1D B6 74 E9 
D2 31 63 C6 90 4E 21 41 C6 C6 C6 3F FC F0 C3 47 1F D6 A7 4F 9F 5F 7E F9 45 0A 79 C4 2E 22 22 42 
4B 4B AB FD C7 28 29 29 ED DB B7 AF 9D 33 6A 40 AE A1 DC 25 CB DC DC FC C8 91 23 D2 99 BB 14 17 
57 57 D7 5D BB 76 91 4E 21 41 1A 1A 1A B1 B1 B1 1F 3A 9D 49 C8 92 25 4B 02 02 02 24 1D 49 BC 82 
83 83 E7 CD 9B 27 CA 23 1D 1C 1C F6 EE DD 4B F6 9B 03 90 10 94 BB C4 4D 99 32 25 31 31 F1 A3 1F 
A3 64 C4 AC 59 B3 CE 9C 39 D3 E6 79 14 74 E8 DF BF 7F 6A 6A AA AD AD AD E8 4F D9 BE 7D 7B 48 48 
88 5C 34 A0 92 92 D2 E6 CD 9B 37 6F DE 2C FA 53 E6 CD 9B F7 D7 5F 7F 7D E8 B4 77 90 5F 28 77 69 
98 30 61 42 76 76 F6 8C 19 33 48 07 69 8F BE BE FE EE DD BB 63 62 62 A4 BC 3F B2 D4 28 2B 2B 7F 
F5 D5 57 37 6E DC 18 3E 7C 78 87 9E C8 62 B1 36 6E DC 98 94 94 64 63 63 23 A1 6C 62 61 67 67 77 
FE FC F9 E0 E0 E0 8E 3E 71 C6 8C 19 59 59 59 ED 9F 3B 04 72 07 A7 42 4A C9 A0 41 83 4E 9E 3C 79 
E7 CE 9D 13 27 4E 9C 3F 7F BE B4 B4 B4 B2 B2 B2 B9 B9 99 6C AA 9E 3D 7B EA EB EB DB D9 D9 4D 99 
32 65 D6 AC 59 F4 7D 7C 53 55 55 D5 D3 D3 1B 38 70 E0 C4 89 13 67 CF 9E 6D 66 66 D6 E9 97 9A 30 
61 82 87 87 47 52 52 52 6C 6C 6C 5A 5A 5A 45 45 C5 CB 97 2F B9 5C AE 18 D3 76 14 8B C5 EA DD BB 
B7 A1 A1 A1 8B 8B CB D4 A9 53 3F FD F4 D3 4E FF 7A 61 6E 6E 9E 98 98 98 99 99 79 F2 E4 C9 8B 17 
2F 3E 7D FA B4 AA AA AA A5 A5 45 BC 81 41 9A 58 44 FE EF 64 B1 58 09 09 09 93 27 4F 96 FE 5B 03 
00 90 C5 E1 70 DC DD DD AF 5C B9 22 D1 77 C1 B4 0C 00 00 85 50 EE 00 00 14 42 B9 03 00 50 08 E5 
0E 00 40 21 94 3B 00 50 AB AE AE 2E 2D 2D 8D 74 0A 32 70 2A 24 0D DE BF 7F 1F 1E 1E 9E 95 95 F5 
F8 F1 E3 8A 8A 8A FA FA 7A 36 9B AD AF AF DF AF 5F 3F 0B 0B 0B 3B 3B 3B 77 77 F7 BE 7D FB 92 8E 
09 20 6D 0B 17 2E 3C 7F FE 7C 49 49 89 9C AE 11 D4 15 28 77 1A 74 EF DE DD DE DE 7E FB F6 ED CF 
9F 3F E7 0F 56 55 55 E5 E6 E6 26 25 25 F1 0E AD AD AD E7 CF 9F BF 60 C1 02 43 43 43 42 31 01 A4 
AA B9 B9 F9 F4 E9 D3 CD CD CD 51 51 51 1F 5D 46 8D 3E 98 96 A1 C4 F8 F1 E3 6F DD BA E5 E6 E6 F6 
A1 07 E4 E4 E4 04 05 05 19 1B 1B 7B 7B 7B C7 C5 C5 91 BD FA 06 40 0A 94 94 94 94 94 94 18 86 D9 
B1 63 47 63 63 23 E9 38 D2 86 72 A7 87 A1 A1 E1 85 0B 17 BE FB EE BB 76 2E 53 6C 6E 6E 8E 8F 8F 
9F 3A 75 EA 88 11 23 62 63 63 51 F1 40 31 25 25 25 13 13 13 86 61 9E 3D 7B F6 E7 9F 7F 92 8E 23 
6D 28 77 AA B0 D9 EC 9F 7E FA 29 3E 3E BE 77 EF DE ED 3F F2 D6 AD 5B D3 A6 4D 1B 39 72 24 F6 CC 
04 8A 4D 9D 3A 95 77 63 EB D6 AD 1C 0E 87 6C 18 29 43 B9 53 68 F2 E4 C9 37 6F DE 74 72 72 FA E8 
23 B3 B3 B3 3D 3D 3D 7D 7C 7C 9E 3E 7D 2A 85 60 00 52 B6 68 D1 22 DE 2F B2 0F 1E 3C F8 D0 76 92 
B4 42 B9 D3 C9 D8 D8 38 25 25 65 F5 EA D5 A2 AC 24 15 13 13 63 6E 6E BE 75 EB 56 E2 0B 99 01 88 
97 95 95 95 87 87 07 EF 76 58 58 18 D9 30 52 86 72 A7 96 8A 8A CA F6 ED DB 4F 9F 3E AD AD AD FD 
D1 07 D7 D6 D6 AE 5F BF 7E C4 88 11 B7 6F DF 96 42 36 00 A9 F9 F6 DB 6F 79 37 D2 D3 D3 AF 5E BD 
4A 36 8C 34 A1 DC 29 37 75 EA D4 1B 37 6E 38 38 38 88 F2 E0 BB 77 EF 8E 1A 35 6A CB 96 2D 58 EB 
15 A8 31 61 C2 04 FE 56 B1 DB B7 6F 27 1B 46 9A 50 EE F4 33 35 35 BD 7A F5 6A 50 50 10 EF B4 B0 
F6 BD 7F FF 3E 28 28 C8 CD CD AD B8 B8 58 F2 D1 00 24 8E C5 62 AD 59 B3 86 77 3B 36 36 B6 B4 B4 
94 6C 1E A9 41 B9 2B 04 15 15 95 D0 D0 D0 0B 17 2E 88 78 9D 6A 5A 5A 9A AD AD ED 1F 7F FC 21 E9 
60 00 52 30 6F DE 3C 03 03 03 86 61 9A 9B 9B F7 EC D9 43 3A 8E 94 A0 DC 15 88 BB BB FB AD 5B B7 
A6 4C 99 22 CA 83 6B 6A 6A 16 2C 58 B0 68 D1 A2 9A 9A 1A 49 07 03 90 28 55 55 D5 AF BF FE 9A 77 
FB F7 DF 7F 6F 68 68 20 9B 47 3A 50 EE 8A 45 57 57 37 2E 2E 6E C7 8E 1D AA AA AA A2 3C FE E0 C1 
83 C3 87 0F 57 A8 AF A1 80 4A CB 97 2F 57 53 53 63 18 A6 AA AA 2A 26 26 86 74 1C 69 40 B9 2B 1C 
16 8B 15 10 10 90 9D 9D 6D 6D 6D 2D CA E3 1F 3F 7E EC E6 E6 16 10 10 A0 80 17 70 03 35 FA F4 E9 
E3 E3 E3 C3 BB FD 9F FF FC 87 6C 18 E9 40 B9 2B 28 4B 4B CB 8C 8C 8C 55 AB 56 89 F2 60 0E 87 13 
11 11 61 6F 6F 9F 93 93 23 E9 60 00 12 B2 64 C9 12 DE 8D CB 97 2F 17 16 16 92 0D 23 05 28 77 C5 
A5 A6 A6 16 1E 1E 7E EC D8 31 51 4E 84 67 18 26 27 27 C7 C9 C9 E9 B7 DF 7E C3 8A 34 20 8F 5C 5C 
5C CC CD CD 19 86 E1 72 B9 07 0E 1C 20 1D 47 E2 50 EE 8A CE C7 C7 E7 EE DD BB 9E 9E 9E A2 3C B8 
AE AE 6E C5 8A 15 5E 5E 5E 15 15 15 92 0E 06 20 76 FC 0F EF 07 0E 1C A0 7E A9 19 94 3B 30 FD FA 
F5 3B 7B F6 6C 64 64 A4 BA BA BA 28 8F 4F 4C 4C B4 B1 B1 39 7D FA B4 A4 83 01 88 D7 17 5F 7C A1 
AC AC CC 30 CC D3 A7 4F 53 53 53 49 C7 91 2C 94 3B 30 0C C3 B0 58 2C 3F 3F BF 1B 37 6E D8 DB DB 
8B F2 F8 AA AA AA 19 33 66 F8 FA FA D6 D6 D6 4A 3A 1B 80 B8 18 18 18 B8 BB BB F3 6E 1F 3B 76 8C 
6C 18 49 43 B9 C3 FF 0C 1B 36 2C 3D 3D 7D C3 86 0D 6C B6 48 5B 74 45 47 47 DB D9 D9 5D BF 7E 5D 
D2 C1 00 C4 65 EE DC B9 BC 1B 7F FD F5 17 DD 2B E5 A1 DC E1 FF 47 45 45 65 D3 A6 4D A9 A9 A9 66 
66 66 A2 3C BE A0 A0 C0 C5 C5 25 30 30 B0 BE BE 5E D2 D9 00 BA 6E E6 CC 99 BC 8B 3C 2A 2B 2B 2F 
5F BE 4C 3A 8E 04 A1 DC A1 0D 4E 4E 4E B7 6F DF F6 F7 F7 17 65 C5 E0 96 96 96 9F 7F FE D9 D6 D6 
36 25 25 45 0A D9 00 BA A2 57 AF 5E FC DD 28 4F 9E 3C 49 36 8C 44 A1 DC A1 6D EA EA EA 7B F6 EC 
89 8B 8B 13 71 43 ED FC FC FC B1 63 C7 AE 58 B1 E2 ED DB B7 92 CE 06 D0 15 5E 5E 5E BC 1B 89 89 
89 64 93 48 14 CA 1D DA 33 65 CA 94 07 0F 1E F8 F9 F9 89 F2 11 9E CB E5 FE F6 DB 6F C3 86 0D 8B 
8D 8D 95 42 36 80 CE E1 EF BD F7 E4 C9 93 FB F7 EF 93 0D 23 39 28 77 F8 08 2D 2D AD C8 C8 C8 F8 
F8 F8 7E FD FA 89 F2 F8 B2 B2 B2 69 D3 A6 2D 5E BC F8 F5 EB D7 92 CE 06 D0 09 26 26 26 96 96 96 
BC DB 09 09 09 64 C3 48 0E CA 1D 44 32 79 F2 E4 DC DC DC 2F BF FC 52 94 8F F0 0C C3 1C 38 70 C0 
D2 D2 F2 D4 A9 53 92 0E 06 D0 09 FC 13 22 93 92 92 C8 26 91 1C 94 3B 88 4A 4B 4B 6B DF BE 7D 49 
49 49 C6 C6 C6 A2 3C BE BC BC 7C E6 CC 99 DE DE DE 65 65 65 92 CE 06 D0 21 AE AE AE BC 1B D7 AE 
5D A3 75 45 3C 94 3B 74 CC 84 09 13 72 72 72 44 9C 85 67 18 26 3E 3E DE C6 C6 E6 CF 3F FF 94 74 
30 00 D1 B9 BA BA F2 FE 07 AE AF AF BF 75 EB 16 E9 38 12 81 72 87 0E EB D9 B3 67 64 64 E4 F9 F3 
E7 07 0C 18 20 CA E3 5F BE 7C 39 7F FE 7C 4F 4F CF BC BC 3C 09 47 03 10 89 BE BE FE 90 21 43 78 
B7 D3 D3 D3 C9 86 91 10 94 3B 74 D2 F8 F1 E3 73 72 72 56 AE 5C 29 CA D6 AC 0C C3 5C B8 70 C1 C6 
C6 66 C3 86 0D 75 75 75 92 CE 06 F0 51 9F 7C F2 09 EF 46 5A 5A 1A D9 24 12 82 72 87 CE D3 D0 D0 
F8 F5 D7 5F D3 D3 D3 6D 6D 6D 45 79 7C 43 43 C3 8F 3F FE 68 69 69 89 73 25 81 38 FE FF B4 59 59 
59 64 93 48 08 CA 1D BA CA D1 D1 F1 C6 8D 1B 3B 76 EC D0 D0 D0 10 E5 F1 C5 C5 C5 D3 A6 4D F3 F6 
F6 7E FC F8 B1 A4 B3 01 7C 08 BF DC 4B 4B 4B AB AB AB C9 86 91 04 94 3B 88 01 9B CD 0E 08 08 B8 
7B F7 EE C4 89 13 45 7C 4A 7C 7C BC A5 A5 E5 0F 3F FC A0 20 BB 15 83 AC B1 B1 B1 E1 DD E0 72 B9 
0F 1E 3C 20 1B 46 12 50 EE 20 36 03 07 0E 3C 73 E6 4C 6C 6C 6C DF BE 7D 45 79 7C 7D 7D FD 3F FF 
F9 4F 2B 2B 2B 8A CF 35 06 99 65 68 68 C8 DB 32 9B 61 18 2A AF 53 45 B9 83 98 79 7B 7B E7 E4 E4 
2C 5D BA 54 C4 73 25 0B 0A 0A 26 4D 9A 34 67 CE 9C 67 CF 9E 49 3A 1B 00 1F 8B C5 EA DF BF 3F EF 
F6 BD 7B F7 C8 86 91 04 94 3B 88 9F B6 B6 76 54 54 54 4A 4A 8A 85 85 85 88 4F 39 7E FC B8 B9 B9 
F9 D6 AD 5B 31 4B 03 52 63 62 62 C2 BB F1 F4 E9 53 B2 49 24 01 E5 0E 92 E2 E2 E2 72 EB D6 AD D0 
D0 50 11 BF 68 7D FB F6 ED FA F5 EB 2D 2C 2C 4E 9C 38 81 3D B8 41 0A F8 D7 5A 53 B9 27 30 CA 1D 
24 A8 5B B7 6E 41 41 41 8F 1E 3D 5A B0 60 81 88 B3 34 45 45 45 B3 67 CF 76 72 72 A2 F5 EC 63 90 
1D BD 7A F5 E2 DD 40 B9 03 74 86 91 91 D1 A1 43 87 2E 5D BA 64 6D 6D 2D E2 53 32 33 33 C7 8C 19 
E3 E3 E3 83 D3 25 41 72 F8 3B C2 3F 7F FE 9C 6C 12 49 40 B9 83 94 B8 B9 B9 DD BC 79 73 FB F6 ED 
5A 5A 5A A2 3C 9E CB E5 C6 C4 C4 58 5A 5A FE DF FF FD 1F 36 00 01 49 E0 97 7B 75 75 75 53 53 13 
D9 30 62 87 72 07 E9 61 B3 D9 AB 57 AF 7E F4 E8 D1 C2 85 0B 45 9C A5 A9 AF AF FF E9 A7 9F 86 0C 
19 F2 FB EF BF B7 B4 B4 48 3A 21 28 14 7E B9 33 0C 83 72 07 E8 2A 7D 7D FD 03 07 0E 64 66 66 3A 
3A 3A 8A F8 94 8A 8A 0A 3F 3F 3F 6B 6B 6B 8A B7 56 00 E9 E3 70 38 FC DB CD CD CD 04 93 48 02 CA 
1D C8 B0 B7 B7 4F 4B 4B DB BD 7B B7 AE AE AE 88 4F 79 F0 E0 81 97 97 D7 94 29 53 72 73 73 25 9A 
0D 14 84 E0 79 B7 28 77 00 B1 51 56 56 5E B6 6C 59 51 51 D1 C6 8D 1B BB 77 EF 2E E2 B3 12 13 13 
6D 6D 6D 7D 7C 7C B0 80 30 74 91 E0 02 A5 F4 4D FA A1 DC 81 30 0D 0D 8D 90 90 90 07 0F 1E 7C FE 
F9 E7 22 4E C4 73 38 1C DE 77 AD 4B 97 2E 2D 2D 2D 95 74 42 A0 95 E0 27 77 15 15 15 82 49 24 01 
E5 0E 32 61 C0 80 01 47 8E 1C C9 C8 C8 18 33 66 8C 88 4F 69 6E 6E DE BB 77 AF 99 99 99 BF BF 7F 
79 79 B9 44 E3 01 95 5E BC 78 C1 BB A1 AC AC DC B3 67 4F B2 61 C4 0E E5 0E 32 64 E4 C8 91 29 29 
29 B1 B1 B1 83 06 0D 12 F1 29 8D 8D 8D 51 51 51 66 66 66 01 01 01 95 95 95 12 8D 07 94 29 29 29 
E1 DD E8 D5 AB 97 88 7B CE C8 11 DA 7E 1E A0 80 B7 B7 F7 83 07 0F 22 23 23 FB F4 E9 23 E2 53 EA 
EA EA 22 22 22 06 0D 1A 14 1C 1C 4C E5 DA DC 20 09 FC 72 D7 D1 D1 21 9B 44 12 50 EE 20 8B 54 54 
54 FC FC FC 1E 3E 7C B8 6A D5 AA 6E DD BA 89 F8 AC DA DA DA B0 B0 30 33 33 B3 5F 7E F9 A5 BE BE 
5E A2 09 81 02 FC 2F 6C B4 B5 B5 C9 26 91 04 94 3B C8 AE DE BD 7B 87 87 87 E7 E5 E5 2D 5A B4 48 
59 59 59 C4 67 BD 78 F1 62 DD BA 75 66 66 66 11 11 11 D8 AF 15 3E A4 AC AC 8C 7F E5 B3 A9 A9 29 
D9 30 92 80 72 07 59 67 62 62 B2 7F FF FE DC DC DC 05 0B 16 88 3E 31 5A 56 56 16 10 10 60 62 62 
12 12 12 F2 FA F5 6B 89 26 04 79 24 B8 75 EA B0 61 C3 08 26 91 10 94 3B C8 87 61 C3 86 1D 3A 74 
E8 CE 9D 3B B3 67 CF 16 FD 59 2F 5E BC F8 FE FB EF 4D 4C 4C 02 02 02 70 46 0D 08 CA CE CE E6 DF 
46 B9 03 10 66 65 65 75 FC F8 F1 F4 F4 F4 B1 63 C7 8A FE AC B7 6F DF 46 44 44 0C 1C 38 D0 DF DF 
1F E7 C5 03 0F 3E B9 03 C8 9C 51 A3 46 5D BA 74 29 3E 3E 7E F8 F0 E1 A2 3F AB A1 A1 81 77 D2 E4 
D2 A5 4B 0B 0B 0B 25 17 0F 64 5F 53 53 D3 F5 EB D7 79 B7 55 55 55 87 0E 1D 4A 36 8F 24 A0 DC 41 
5E 4D 99 32 E5 E6 CD 9B C7 8E 1D 13 7D 99 78 86 61 1A 1B 1B F7 EE DD 3B 74 E8 D0 79 F3 E6 E5 E4 
E4 48 2E 1E C8 B2 D4 D4 D4 37 6F DE F0 6E 3B 39 39 89 BE FA 85 1C 41 B9 83 1C 63 B1 58 3E 3E 3E 
77 EE DC 39 79 F2 E4 27 9F 7C 22 FA 13 5B 5A 5A 0E 1F 3E 6C 6B 6B 3B 6D DA B4 F4 F4 74 C9 25 04 
D9 14 1B 1B CB BF ED EE EE 4E 30 89 E4 A0 DC 41 EE B1 58 AC 19 33 66 64 67 67 9F 3F 7F DE C9 C9 
49 F4 27 72 B9 DC D8 D8 58 67 67 E7 11 23 46 1C 3A 74 88 BE 15 BD E1 43 04 CB 7D DC B8 71 04 93 
48 0E CA 1D E8 E1 E1 E1 71 ED DA B5 73 E7 CE 89 BE 40 0D CF CD 9B 37 17 2E 5C 38 70 E0 C0 CD 9B 
37 BF 7C F9 52 42 F1 40 46 5C BB 76 8D BF 7D A3 BA BA BA E8 FB 0A C8 17 94 3B D0 C6 D3 D3 33 25 
25 25 35 35 D5 CB CB AB 43 4F 7C F6 EC D9 3F FE F1 8F BE 7D FB FA FA FA 62 C9 78 8A ED DA B5 8B 
7F 7B DA B4 69 A2 5F 02 2D 5F 50 EE 40 27 17 17 97 B8 B8 B8 B4 B4 B4 49 93 26 89 B8 92 30 4F 43 
43 43 74 74 B4 8D 8D CD C4 89 13 93 92 92 B8 5C AE E4 42 82 F4 55 55 55 9D 38 71 82 7F B8 60 C1 
02 82 61 24 0A E5 0E 34 1B 3D 7A 74 62 62 E2 9D 3B 77 16 2E 5C D8 A1 0F 68 5C 2E F7 EC D9 B3 93 
26 4D B2 B0 B0 D8 B3 67 CF BB 77 EF 24 17 12 A4 69 DF BE 7D FC 65 DC 8D 8C 8C 3C 3D 3D C9 E6 91 
1C 94 3B D0 CF DA DA FA C0 81 03 8F 1F 3F 0E 0A 0A EA D5 AB 57 87 9E FB F0 E1 C3 E5 CB 97 1B 1B 
1B 07 05 05 E1 EC 78 79 F7 F6 ED DB ED DB B7 F3 0F E7 CD 9B 27 FA 9A 45 72 07 E5 0E 8A C2 C8 C8 
28 34 34 B4 B4 B4 74 C7 8E 1D 03 06 0C E8 D0 73 5F BD 7A B5 65 CB 96 C1 83 07 7B 7A 7A C6 C4 C4 
34 36 36 4A 26 23 48 D6 96 2D 5B F8 8B FE B3 D9 6C 3F 3F 3F B2 79 24 0A E5 0E 8A 45 43 43 23 20 
20 A0 B0 B0 30 36 36 76 D4 A8 51 1D 7A 2E 97 CB BD 70 E1 82 8F 8F 8F 81 81 81 BF BF FF BD 7B F7 
24 14 12 24 A1 AC AC 4C F0 63 FB FC F9 F3 CD CC CC 08 E6 91 34 94 3B 28 22 25 25 25 6F 6F EF F4 
F4 F4 CB 97 2F 7B 7B 7B 77 74 17 9E D7 AF 5F 47 45 45 59 5B 5B 7B 78 78 1C 3F 7E 1C 1F E4 E5 42 
70 70 30 FF BB 13 36 9B BD 61 C3 06 B2 79 24 0D E5 0E 0A CD CD CD 2D 36 36 36 2F 2F 2F 28 28 48 
F4 8D 9F 78 B8 5C EE C5 8B 17 E7 CC 99 83 0F F2 B2 EF F4 E9 D3 D1 D1 D1 FC 43 5F 5F 5F D1 B7 72 
94 53 28 77 00 66 D0 A0 41 A1 A1 A1 25 25 25 FF F9 CF 7F EC ED ED 3B FA 74 FE 07 F9 F1 E3 C7 1F 
3D 7A 94 7F 32 06 C8 88 F2 F2 F2 A5 4B 97 F2 0F D5 D5 D5 FF F5 AF 7F 11 CC 23 1D 28 77 80 FF 52 
53 53 5B BC 78 71 56 56 56 46 46 C6 C2 85 0B 3B BA 98 14 97 CB 4D 4E 4E 9E 3B 77 AE 91 91 D1 F2 
E5 CB D3 D3 D3 71 8E BC 2C E0 72 B9 5F 7E F9 E5 8B 17 2F F8 23 9B 37 6F 36 31 31 21 18 49 3A 50 
EE 00 C2 1C 1C 1C 0E 1C 38 50 51 51 11 19 19 69 6E 6E DE D1 A7 BF 7A F5 6A CF 9E 3D CE CE CE 03 
06 0C 08 0E 0E CE CF CF 97 44 48 10 D1 FA F5 EB 93 92 92 F8 87 A3 47 8F 5E B1 62 05 C1 3C 52 83 
72 07 68 9B 96 96 96 9F 9F 5F 6E 6E 6E 62 62 A2 B7 B7 77 27 4E 88 2E 29 29 09 0B 0B 1B 3A 74 A8 
8B 8B 4B 64 64 24 76 FB 93 BE 9D 3B 77 FE FC F3 CF FC C3 1E 3D 7A 1C 3C 78 B0 A3 DF 9F CB 29 85 
F8 21 01 3A 4D 49 49 69 D2 A4 49 B1 B1 B1 A5 A5 A5 61 61 61 9D F8 20 CF E5 72 D3 D2 D2 96 2D 5B 
66 68 68 F8 D9 67 9F 9D 3C 79 B2 BE BE 5E 12 51 41 C8 B1 63 C7 56 AF 5E 2D 38 12 11 11 41 F7 E9 
8F 82 50 EE 00 22 31 34 34 5C BF 7E FD FD FB F7 6F DC B8 B1 6A D5 AA DE BD 7B 77 F4 15 1A 1A 1A 
FE FA EB AF 59 B3 66 F5 EE DD DB DB DB FB D0 A1 43 B5 B5 B5 92 88 0A 0C C3 FC F1 C7 1F F3 E7 CF 
6F 69 69 E1 8F AC 5F BF FE AB AF BE 22 18 49 CA 50 EE 00 1D 33 62 C4 88 F0 F0 F0 D2 D2 D2 3F FF 
FC D3 D3 D3 B3 13 BF E3 D7 D7 D7 C7 C7 C7 2F 5C B8 D0 D0 D0 70 EE DC B9 F8 2C 2F 76 3B 76 EC F0 
F5 F5 6D 6E 6E E6 8F CC 98 31 63 F3 E6 CD 04 23 49 1F CA 1D A0 33 D4 D4 D4 BE F8 E2 8B 73 E7 CE 
15 17 17 6F DA B4 A9 73 BF EC D7 D6 D6 1E 3D 7A 74 D6 AC 59 7A 7A 7A BC 96 AF AB AB 13 7B 54 85 
D2 D0 D0 B0 74 E9 D2 35 6B D6 08 9E AA E4 EC EC 1C 1D 1D AD 20 53 ED 7C 2C 22 67 6B B1 58 AC 84 
84 84 C9 93 27 4B FF AD 01 24 81 CB E5 A6 A7 A7 1F 3F 7E 3C 26 26 A6 BC BC BC D3 AF A3 A6 A6 36 
6E DC 38 2F 2F AF 29 53 A6 F4 EF DF 5F 8C 09 15 41 69 69 E9 67 9F 7D 96 99 99 29 38 38 6E DC B8 
D8 D8 58 75 75 75 52 A9 5A E3 70 38 EE EE EE 57 AE 5C 91 E8 BB A0 DC 01 C4 89 C3 E1 A4 A7 A7 C7 
C4 C4 1C 3F 7E BC A2 A2 A2 2B 2F 65 61 61 E1 ED ED ED E1 E1 31 76 EC 58 36 9B 2D AE 84 B4 8A 89 
89 59 BE 7C B9 D0 46 5A 93 26 4D FA EB AF BF D4 D4 D4 48 A5 6A 13 CA 1D 40 8E B5 B4 B4 5C BA 74 
E9 D8 B1 63 A7 4E 9D EA E2 D6 7D 7A 7A 7A 93 27 4F 9E 32 65 CA 84 09 13 7A F6 EC 29 AE 84 D4 78 
FA F4 E9 B2 65 CB 12 12 12 84 C6 17 2D 5A 14 19 19 29 83 1B 2D A1 DC 01 68 D0 D2 D2 72 ED DA B5 
98 98 98 23 47 8E 54 55 55 75 E5 A5 94 95 95 87 0F 1F EE E1 E1 E1 EC EC 3C 76 EC 58 4D 4D 4D 71 
85 94 53 EF DE BD DB B9 73 E7 8F 3F FE F8 F6 ED 5B C1 71 36 9B FD C3 0F 3F 04 05 05 91 0A D6 3E 
94 3B 00 55 1A 1A 1A 2E 5D BA 14 1B 1B 9B 90 90 50 52 52 D2 C5 57 53 55 55 1D 35 6A 94 BB BB FB 
B8 71 E3 1C 1D 1D 55 54 54 C4 12 52 5E BC 7B F7 6E EF DE BD 9B 37 6F 7E FE FC B9 D0 5D 46 46 46 
31 31 31 A3 47 8F 26 12 4C 14 28 77 00 6A DD BE 7D 3B 3E 3E 3E 2E 2E EE C6 8D 1B 1C 0E A7 8B AF 
A6 AE AE 3E 66 CC 18 77 77 77 27 27 A7 11 23 46 C8 D4 97 87 62 F7 E2 C5 8B 5D BB 76 ED DC B9 53 
70 B9 18 BE 79 F3 E6 85 87 87 77 E2 2A 04 69 42 B9 03 D0 EF C5 8B 17 89 89 89 F1 F1 F1 49 49 49 
42 73 0B 9D A3 AC AC 3C 74 E8 D0 11 FF 8F 83 83 83 0C 4E 3A 77 02 EF 9B EA E8 E8 E8 3F FE F8 A3 
CD 13 46 0D 0C 0C 7E FB ED B7 19 33 66 48 3F 5B 47 A1 DC 01 14 48 7D 7D 3D 6F D2 E6 EC D9 B3 C5 
C5 C5 E2 7A 59 0D 0D 0D 7B 7B 7B 07 07 07 47 47 C7 E1 C3 87 0F 18 30 40 BE 4E F7 E6 70 38 19 19 
19 27 4F 9E 8C 89 89 79 F2 E4 49 9B 8F E9 D6 AD DB D7 5F 7F BD 71 E3 C6 8E 6E 90 4B 0A CA 1D 40 
41 15 15 15 5D BC 78 F1 E2 C5 8B 97 2E 5D E2 EF F9 29 16 3D 7A F4 30 37 37 B7 F8 7F 2C 2D 2D 07 
0E 1C 28 83 75 5F 51 51 91 9C 9C 9C 9C 9C 9C 94 94 F4 EC D9 B3 0F 3D 8C C5 62 F9 F8 F8 FC F4 D3 
4F A6 A6 A6 D2 8C D7 45 28 77 00 45 C7 E5 72 73 72 72 92 93 93 2F 5E BC 78 E5 CA 15 B1 CC DB 08 
51 53 53 E3 D5 FD B0 61 C3 8C 8D 8D 8D 8D 8D FB F7 EF DF AF 5F 3F 29 4F E6 BC 7F FF 3E 27 27 27 
33 33 33 2B 2B 2B 33 33 F3 C1 83 07 ED 3F 9E B7 51 E2 3F FE F1 0F 07 07 07 E9 24 14 23 94 3B 00 
FC 4F 73 73 73 66 66 26 AF E8 AF 5F BF FE FE FD 7B C9 BD 17 8B C5 32 30 30 E0 B5 7C FF FE FD 4D 
4C 4C FA F7 EF AF AF AF AF A3 A3 D3 BB 77 6F 1D 1D 9D 4E 57 7F 63 63 E3 9B 37 6F CA CB CB 4B 4A 
4A 8A 8B 8B 9F 3C 79 F2 E0 C1 83 87 0F 1F 16 17 17 8B F8 C5 72 B7 6E DD E6 CF 9F BF 6E DD BA 4E 
AC D0 29 23 50 EE 00 D0 B6 C6 C6 C6 5B B7 6E 5D BF 7E FD FA F5 EB E9 E9 E9 5D 3F B1 B2 A3 34 35 
35 75 74 74 7A F4 E8 D1 A3 47 8F 5E BD 7A A9 A9 A9 7D E8 2A D0 77 EF DE BD 11 D0 95 C5 73 06 0F 
1E BC 78 F1 E2 45 8B 16 19 1A 1A 76 FA 45 64 81 74 CA 1D D7 34 03 C8 9F 6E DD BA 39 3A 3A 3A 3A 
3A 06 04 04 30 0C 53 56 56 C6 6B F9 EB D7 AF 67 67 67 4B F4 43 3D CF DB B7 6F 25 31 47 D4 26 6D 
6D ED 69 D3 A6 7D F9 E5 97 2E 2E 2E 2C 16 4B 3A 6F 4A 01 94 3B 80 DC 33 32 32 9A 39 73 E6 CC 99 
33 19 86 69 6A 6A BA 79 F3 E6 F5 EB D7 33 33 33 6F DF BE 9D 97 97 27 B8 F2 AD 1C 31 30 30 98 3E 
7D FA CC 99 33 C7 8E 1D AB 68 97 68 89 05 CA 1D 80 2A 2A 2A 2A BC 0F F5 BC C3 A6 A6 A6 BC BC BC 
EC EC EC EC EC EC FB F7 EF DF BE 7D BB CD 6B 7F 64 44 8F 1E 3D 46 8F 1E ED E1 E1 E1 E1 E1 61 67 
67 27 83 A7 F1 C8 11 94 3B 00 CD 54 54 54 2C 2D 2D 2D 2D 2D 7D 7D 7D 79 23 4F 9E 3C C9 CB CB CB 
CB CB 7B F4 E8 D1 A3 47 8F F2 F2 F2 4A 4A 4A BA 7E 95 6C A7 E3 0D 1D 3A 74 E4 C8 91 BC 7F 90 AC 
AC AC B0 FE A5 B8 E0 CF 11 40 B1 98 98 98 98 98 98 78 7A 7A F2 47 1A 1A 1A F2 F2 F2 8A 8A 8A 4A 
4B 4B CB CA CA 9E 3E 7D FA EC D9 B3 B2 B2 B2 92 92 12 F1 6E 1E 62 64 64 34 70 E0 C0 81 03 07 9A 
9A 9A 5A 5A 5A 5A 58 58 0C 1D 3A 14 53 2E 12 82 72 07 50 74 AA AA AA D6 D6 D6 D6 D6 D6 AD EF AA 
AE AE 2E 2F 2F AF A9 A9 A9 AE AE 7E F3 E6 4D 75 75 75 4D 4D 0D EF F0 43 BD AF AC AC AC 23 40 5B 
5B 9B 7F 5B 55 55 55 C2 3F 0A FC 0F CA 1D 00 3E 48 4B 4B 4B 4B 4B 8B 74 0A E8 0C 7C 5F 01 00 40 
21 94 3B 00 00 85 88 4D CB A4 A4 A4 34 35 35 91 7A 77 00 00 52 B8 5C 6E 63 63 A3 A4 DF 85 D8 F2 
03 D2 7F 53 00 00 D9 21 E9 EE 25 53 EE 00 00 20 51 98 73 07 00 A0 10 CA 1D 00 80 42 28 77 00 00 
0A A1 DC 01 00 28 84 72 07 00 A0 10 CA 1D 00 80 42 28 77 00 00 0A A1 DC 01 00 28 84 72 07 00 A0 
10 CA 1D 00 80 42 28 77 00 00 0A A1 DC 01 00 28 84 72 07 00 A0 10 CA 1D 00 80 42 28 77 00 00 0A 
A1 DC 01 00 28 84 72 07 00 A0 10 CA 1D 00 80 42 28 77 00 00 0A A1 DC 01 00 28 84 72 07 00 A0 10 
CA 1D 00 80 42 28 77 00 00 0A A1 DC 01 00 28 84 72 07 00 A0 10 CA 1D 00 80 42 28 77 00 00 0A A1 
DC 01 00 28 84 72 07 00 A0 10 CA 1D 00 80 42 28 77 00 00 0A A1 DC 01 00 28 84 72 07 00 A0 10 CA 
1D 00 80 42 28 77 00 00 0A A1 DC 01 00 28 84 72 07 00 A0 10 CA 1D 00 80 42 28 77 00 00 0A A1 DC 
01 00 28 84 72 07 00 A0 10 CA 1D 00 80 42 28 77 00 00 0A A1 DC 01 00 28 84 72 07 00 A0 10 CA 1D 
00 80 42 28 77 00 00 0A A1 DC 01 00 28 84 72 07 00 A0 10 CA 1D 00 80 42 28 77 00 00 0A A1 DC 01 
00 28 84 72 07 00 A0 10 CA 1D 00 80 42 28 77 00 00 0A A1 DC 01 00 28 84 72 07 00 A0 10 CA 1D 00 
80 42 28 77 00 00 0A A1 DC 01 00 28 84 72 07 00 A0 10 CA 1D 00 80 42 28 77 00 00 0A A1 DC 01 00 
28 84 72 07 00 A0 10 CA 1D 00 80 42 28 77 00 00 0A A1 DC 01 00 28 84 72 07 00 A0 10 CA 1D 00 80 
42 28 77 00 00 0A A1 DC 01 00 28 84 72 07 00 A0 10 CA 1D 00 80 42 28 77 00 00 0A A1 DC 01 00 28 
84 72 07 00 A0 10 CA 1D 00 80 42 28 77 00 00 0A A1 DC 01 00 28 84 72 07 00 A0 10 CA 1D 00 80 42 
28 77 00 00 0A A1 DC 01 00 28 84 72 07 00 A0 10 CA 1D 00 80 42 28 77 00 00 0A A1 DC 01 00 28 84 
72 07 00 A0 10 CA 1D 00 80 42 28 77 00 00 0A A1 DC 01 00 28 84 72 07 00 A0 10 CA 1D 00 80 42 28 
77 00 00 0A A1 DC 01 00 28 84 72 07 00 A0 10 CA 1D 00 80 42 28 77 00 00 0A A1 DC 01 00 28 84 72 
07 00 A0 10 CA 1D 00 80 42 28 77 00 00 0A A1 DC 01 00 28 84 72 07 00 A0 10 CA 1D 00 80 42 28 77 
00 00 0A A1 DC 01 00 28 84 72 07 00 A0 10 CA 1D 00 80 42 28 77 00 00 0A A1 DC 01 00 28 84 72 07 
00 A0 10 CA 1D 00 80 42 28 77 00 00 0A A1 DC 01 00 28 84 72 07 00 A0 10 CA 1D 00 80 42 28 77 00 
00 0A A1 DC 01 00 28 84 72 07 00 A0 10 CA 1D 00 80 42 28 77 00 00 0A A1 DC 01 00 28 84 72 07 00 
A0 D0 FF 07 6A 73 42 E0 CC 6A 57 A0 00 00 00 00 49 45 4E 44 AE 42 60 82 
EndData
$EndBitmap
$EndSCHEMATC
