EESchema Schematic File Version 4
EELAYER 30 0
EELAYER END
$Descr A4 11693 8268
encoding utf-8
Sheet 3 6
Title "PQ9ISH COMMS V/U"
Date "2019-11-26"
Rev "0.9.5"
Comp "Libre Space Foundation"
Comment1 ""
Comment2 ""
Comment3 ""
Comment4 ""
$EndDescr
$Comp
L power:GND #PWR013
U 1 1 5A7D1DFC
P 5750 5650
F 0 "#PWR013" H 5750 5400 50  0001 C CNN
F 1 "GND" H 5750 5500 50  0000 C CNN
F 2 "" H 5750 5650 50  0001 C CNN
F 3 "" H 5750 5650 50  0001 C CNN
	1    5750 5650
	1    0    0    -1  
$EndComp
$Comp
L power:GND #PWR014
U 1 1 5A7D1E02
P 7150 4900
F 0 "#PWR014" H 7150 4650 50  0001 C CNN
F 1 "GND" H 7150 4750 50  0000 C CNN
F 2 "" H 7150 4900 50  0001 C CNN
F 3 "" H 7150 4900 50  0001 C CNN
	1    7150 4900
	1    0    0    -1  
$EndComp
$Comp
L power:GND #PWR015
U 1 1 5A7D1E08
P 7600 4750
F 0 "#PWR015" H 7600 4500 50  0001 C CNN
F 1 "GND" H 7600 4600 50  0000 C CNN
F 2 "" H 7600 4750 50  0001 C CNN
F 3 "" H 7600 4750 50  0001 C CNN
	1    7600 4750
	1    0    0    -1  
$EndComp
$Comp
L power:GND #PWR017
U 1 1 5A7D1E14
P 7300 4050
F 0 "#PWR017" H 7300 3800 50  0001 C CNN
F 1 "GND" H 7300 3900 50  0000 C CNN
F 2 "" H 7300 4050 50  0001 C CNN
F 3 "" H 7300 4050 50  0001 C CNN
	1    7300 4050
	1    0    0    -1  
$EndComp
$Comp
L power:GND #PWR018
U 1 1 5A7D1E1A
P 7700 4050
F 0 "#PWR018" H 7700 3800 50  0001 C CNN
F 1 "GND" H 7700 3900 50  0000 C CNN
F 2 "" H 7700 4050 50  0001 C CNN
F 3 "" H 7700 4050 50  0001 C CNN
	1    7700 4050
	1    0    0    -1  
$EndComp
$Comp
L power:GND #PWR019
U 1 1 5A7D1E20
P 5350 3600
F 0 "#PWR019" H 5350 3350 50  0001 C CNN
F 1 "GND" H 5350 3450 50  0000 C CNN
F 2 "" H 5350 3600 50  0001 C CNN
F 3 "" H 5350 3600 50  0001 C CNN
	1    5350 3600
	1    0    0    -1  
$EndComp
$Comp
L power:GND #PWR020
U 1 1 5A7D1E26
P 3000 4200
F 0 "#PWR020" H 3000 3950 50  0001 C CNN
F 1 "GND" H 3000 4050 50  0000 C CNN
F 2 "" H 3000 4200 50  0001 C CNN
F 3 "" H 3000 4200 50  0001 C CNN
	1    3000 4200
	1    0    0    -1  
$EndComp
$Comp
L power:GND #PWR024
U 1 1 5A7D1E5A
P 3450 5000
F 0 "#PWR024" H 3450 4750 50  0001 C CNN
F 1 "GND" H 3450 4850 50  0000 C CNN
F 2 "" H 3450 5000 50  0001 C CNN
F 3 "" H 3450 5000 50  0001 C CNN
	1    3450 5000
	1    0    0    -1  
$EndComp
Wire Wire Line
	5750 5050 5750 5350
Wire Wire Line
	7150 3750 7300 3750
Wire Wire Line
	7150 4450 7000 4450
Wire Wire Line
	6700 4450 6250 4450
Wire Wire Line
	7150 4600 7150 4450
Wire Wire Line
	5650 3200 5650 3850
Wire Wire Line
	6850 3750 6550 3750
Wire Wire Line
	6550 3750 6550 4350
Wire Wire Line
	6550 4350 6250 4350
Wire Wire Line
	3950 4250 3450 4250
Connection ~ 3450 4250
Wire Wire Line
	3950 4400 3450 4400
Connection ~ 3450 4400
Connection ~ 3450 4650
Wire Wire Line
	4250 4250 5050 4250
Wire Wire Line
	4750 4400 4250 4400
Wire Wire Line
	3000 3900 3450 3900
Text HLabel 3000 5500 0    60   Input ~ 0
PA_RF_IN
Text HLabel 8600 4450 2    60   Input ~ 0
PA_RF_OUT
Text HLabel 5750 5200 0    60   Input ~ 0
PDET
$Comp
L power:GND #PWR025
U 1 1 5A7D8882
P 4900 3600
F 0 "#PWR025" H 4900 3350 50  0001 C CNN
F 1 "GND" H 4900 3450 50  0000 C CNN
F 2 "" H 4900 3600 50  0001 C CNN
F 3 "" H 4900 3600 50  0001 C CNN
	1    4900 3600
	1    0    0    -1  
$EndComp
Wire Wire Line
	3450 4250 3450 4400
Wire Wire Line
	3450 4400 3450 4650
Wire Wire Line
	3450 4650 3450 4700
Wire Wire Line
	3450 3900 3450 4250
Wire Wire Line
	5050 5500 5050 4750
Wire Wire Line
	6250 4450 6250 4550
Text Label 4250 4400 0    50   ~ 0
VBA1
Text Label 4250 4250 0    50   ~ 0
VBA2
Text Label 5650 3650 0    50   ~ 0
PA_VCC1
Text Label 6550 4200 0    50   ~ 0
PA_VCC2
Text Label 6300 4450 0    50   ~ 0
PA_OUT
Connection ~ 7150 4450
Text Label 5050 5250 0    50   ~ 0
PA_In
Wire Wire Line
	5950 5050 5950 5250
$Comp
L power:GND #PWR058
U 1 1 5A969121
P 5950 5250
F 0 "#PWR058" H 5950 5000 50  0001 C CNN
F 1 "GND" H 5955 5077 50  0000 C CNN
F 2 "" H 5950 5250 50  0001 C CNN
F 3 "" H 5950 5250 50  0001 C CNN
	1    5950 5250
	1    0    0    -1  
$EndComp
Connection ~ 7300 3750
Wire Wire Line
	7300 3750 7700 3750
Wire Wire Line
	7450 4450 7600 4450
$Comp
L power:GND #PWR0301
U 1 1 5AD6D78D
P 8000 4750
F 0 "#PWR0301" H 8000 4500 50  0001 C CNN
F 1 "GND" H 8000 4600 50  0000 C CNN
F 2 "" H 8000 4750 50  0001 C CNN
F 3 "" H 8000 4750 50  0001 C CNN
	1    8000 4750
	1    0    0    -1  
$EndComp
Wire Wire Line
	7300 3750 7300 3450
Wire Wire Line
	7300 3450 7350 3450
Text Label 4900 2900 0    50   ~ 0
PA_VCC
Text Label 7350 3450 0    50   ~ 0
PA_VCC
Wire Wire Line
	5300 3200 5350 3200
Wire Wire Line
	4900 3250 4900 3200
Connection ~ 4900 3200
Wire Wire Line
	4900 3200 5000 3200
Wire Wire Line
	5350 3200 5350 3250
Connection ~ 5350 3200
Wire Wire Line
	5350 3200 5650 3200
Wire Wire Line
	5350 3550 5350 3600
Wire Wire Line
	4900 3600 4900 3550
Connection ~ 6250 4450
Connection ~ 3450 3900
Wire Wire Line
	5050 4350 4750 4350
Wire Wire Line
	4750 4350 4750 4400
Wire Wire Line
	3450 4650 5050 4650
$Comp
L power:+5V #PWR0111
U 1 1 5CE930BA
P 4400 1400
F 0 "#PWR0111" H 4400 1250 50  0001 C CNN
F 1 "+5V" H 4415 1573 50  0000 C CNN
F 2 "" H 4400 1400 50  0001 C CNN
F 3 "" H 4400 1400 50  0001 C CNN
	1    4400 1400
	1    0    0    -1  
$EndComp
$Comp
L power:+3.3V #PWR0112
U 1 1 5CE937E2
P 5400 1400
F 0 "#PWR0112" H 5400 1250 50  0001 C CNN
F 1 "+3.3V" H 5417 1573 50  0000 C CNN
F 2 "" H 5400 1400 50  0001 C CNN
F 3 "" H 5400 1400 50  0001 C CNN
	1    5400 1400
	1    0    0    -1  
$EndComp
Wire Wire Line
	5400 1400 5400 1550
Wire Wire Line
	5400 1550 5100 1550
Wire Wire Line
	4900 1700 4900 1800
Wire Wire Line
	4400 1400 4400 1550
Wire Wire Line
	4400 1550 4700 1550
$Comp
L power:PWR_FLAG #FLG0102
U 1 1 5CEBB482
P 4900 1800
F 0 "#FLG0102" H 4900 1875 50  0001 C CNN
F 1 "PWR_FLAG" V 4900 1927 50  0000 L CNN
F 2 "" H 4900 1800 50  0001 C CNN
F 3 "~" H 4900 1800 50  0001 C CNN
	1    4900 1800
	0    -1   -1   0   
$EndComp
Connection ~ 4900 1800
Text Label 4300 5500 0    50   ~ 0
PA_RF_IN1
Text Label 7800 4450 0    50   ~ 0
PA_RF_OUT1
Wire Wire Line
	7600 4450 8000 4450
Connection ~ 7600 4450
Connection ~ 8000 4450
Wire Notes Line
	7500 4350 8350 4350
Wire Notes Line
	8350 4350 8350 5850
Wire Notes Line
	8350 5850 7500 5850
Wire Notes Line
	7500 5850 7500 4350
Text Notes 7550 5750 0    50   ~ 0
PA VCC 3.3V\nC4 = 12pF\nC36 = 2.2pF\n\nPA VCC 5V\nC4 = Not populated
Text Notes 2350 1500 0    50   ~ 0
JP2\n1-2 PA powered from V4 (5V)\n2-3 PA powered from 3.3V (LM1117 Not placed)
Wire Notes Line
	2300 1100 5550 1100
Wire Notes Line
	5550 1100 5550 1700
Wire Notes Line
	5550 1700 2300 1700
Wire Notes Line
	2300 1700 2300 1100
Wire Notes Line
	3850 3650 3850 4500
Wire Notes Line
	3850 4500 4500 4500
Wire Notes Line
	4500 4500 4500 3650
Wire Notes Line
	4500 3650 3850 3650
Text Notes 3950 4000 0    50   ~ 0
PA VCC 3.3V\nR1 = 510\nR2 = 1K
Wire Wire Line
	6250 4250 6450 4250
Wire Wire Line
	6450 2550 7150 2550
Connection ~ 7150 2550
Wire Wire Line
	7150 2550 7550 2550
$Comp
L power:GND #PWR016
U 1 1 5D7F1CBB
P 7150 2950
F 0 "#PWR016" H 7150 2700 50  0001 C CNN
F 1 "GND" H 7155 2777 50  0000 C CNN
F 2 "" H 7150 2950 50  0001 C CNN
F 3 "" H 7150 2950 50  0001 C CNN
	1    7150 2950
	1    0    0    -1  
$EndComp
$Comp
L power:GND #PWR022
U 1 1 5D7F1E42
P 7550 2950
F 0 "#PWR022" H 7550 2700 50  0001 C CNN
F 1 "GND" H 7555 2777 50  0000 C CNN
F 2 "" H 7550 2950 50  0001 C CNN
F 3 "" H 7550 2950 50  0001 C CNN
	1    7550 2950
	1    0    0    -1  
$EndComp
Wire Wire Line
	7550 2850 7550 2950
Wire Wire Line
	7150 2950 7150 2850
Wire Wire Line
	7150 2550 7150 2500
Wire Wire Line
	7150 2100 7150 2200
Wire Wire Line
	6450 2550 6450 4250
Text HLabel 7000 2100 0    60   Input ~ 0
PowerDown
Wire Wire Line
	4900 3200 3450 3200
Wire Wire Line
	3450 3200 3450 3900
Text Label 6450 3450 0    50   ~ 0
PA_PD
Wire Wire Line
	4900 1800 4900 2200
Wire Wire Line
	4900 2500 4900 3200
$Comp
L Device:Ferrite_Bead FB3
U 1 1 5D80D53A
P 4900 2350
F 0 "FB3" H 5037 2396 50  0000 L CNN
F 1 "Ferrite_Bead" H 5037 2305 50  0000 L CNN
F 2 "Inductor_SMD:L_0603_1608Metric_Pad1.05x0.95mm_HandSolder" V 4830 2350 50  0001 C CNN
F 3 "~" H 4900 2350 50  0001 C CNN
F 4 "ILHB0603ER600V" H 4900 2350 50  0001 C CNN "Part Number"
	1    4900 2350
	1    0    0    -1  
$EndComp
$Comp
L Device:C C43
U 1 1 5D7EF162
P 7550 2700
F 0 "C43" H 7665 2746 50  0000 L CNN
F 1 "100pF" H 7665 2655 50  0000 L CNN
F 2 "Capacitor_SMD:C_0603_1608Metric_Pad1.05x0.95mm_HandSolder" H 7588 2550 50  0001 C CNN
F 3 "~" H 7550 2700 50  0001 C CNN
F 4 "CBR06C101F5GAC" H 7550 2700 50  0001 C CNN "Part Number"
	1    7550 2700
	1    0    0    -1  
$EndComp
$Comp
L Device:R R5
U 1 1 5D7EEAB0
P 7150 2700
F 0 "R5" H 7220 2746 50  0000 L CNN
F 1 "3.3k" H 7220 2655 50  0000 L CNN
F 2 "Resistor_SMD:R_0603_1608Metric_Pad1.05x0.95mm_HandSolder" V 7080 2700 50  0001 C CNN
F 3 "~" H 7150 2700 50  0001 C CNN
F 4 "MCT06030C3301FP500" H 7150 2700 50  0001 C CNN "Part Number"
	1    7150 2700
	1    0    0    -1  
$EndComp
$Comp
L Device:R R4
U 1 1 5D7EE1ED
P 7150 2350
F 0 "R4" H 7220 2396 50  0000 L CNN
F 1 "3.3k" H 7220 2305 50  0000 L CNN
F 2 "Resistor_SMD:R_0603_1608Metric_Pad1.05x0.95mm_HandSolder" V 7080 2350 50  0001 C CNN
F 3 "~" H 7150 2350 50  0001 C CNN
F 4 "MCT06030C3301FP500" H 7150 2350 50  0001 C CNN "Part Number"
	1    7150 2350
	1    0    0    -1  
$EndComp
$Comp
L Device:C C4
U 1 1 5A7D1E2C
P 7600 4600
F 0 "C4" H 7625 4700 50  0000 L CNN
F 1 "NP" H 7625 4500 50  0000 L CNN
F 2 "Capacitor_SMD:C_0603_1608Metric_Pad1.05x0.95mm_HandSolder" H 7638 4450 50  0001 C CNN
F 3 "" H 7600 4600 50  0001 C CNN
F 4 "CBR06C120FAGAC" H 7600 4600 50  0001 C CNN "Part Number"
F 5 "12pF for 3V3 operation" H 7600 4600 50  0001 C CNN "Comment"
	1    7600 4600
	1    0    0    -1  
$EndComp
$Comp
L Jumper:SolderJumper_3_Open JP2
U 1 1 5CE90CE4
P 4900 1550
F 0 "JP2" H 4900 1755 50  0000 C CNN
F 1 "PA" H 4900 1664 50  0000 C CNN
F 2 "Jumper:SolderJumper-3_P1.3mm_Open_RoundedPad1.0x1.5mm" H 4900 1550 50  0001 C CNN
F 3 "~" H 4900 1550 50  0001 C CNN
	1    4900 1550
	1    0    0    -1  
$EndComp
$Comp
L lsf-kicad:MMZ09332B U5
U 1 1 5A7DBC7A
P 5650 4450
F 0 "U5" H 5850 5050 60  0000 C CNN
F 1 "MMZ09332B" H 5700 4250 60  0000 C CNN
F 2 "lsf-kicad-lib:MMZ09332B" H 5950 4850 60  0001 C CNN
F 3 "https://www.nxp.com/docs/en/data-sheet/MMZ09332B.pdf" H 6050 4950 60  0001 C CNN
F 4 "MMZ09332BT1" H -200 550 50  0001 C CNN "Part Number"
	1    5650 4450
	1    0    0    -1  
$EndComp
$Comp
L Device:C C36
U 1 1 5AD6D794
P 8000 4600
F 0 "C36" H 8025 4700 50  0000 L CNN
F 1 "18pF" H 8025 4500 50  0000 L CNN
F 2 "Capacitor_SMD:C_0603_1608Metric_Pad1.05x0.95mm_HandSolder" H 8038 4450 50  0001 C CNN
F 3 "" H 8000 4600 50  0001 C CNN
F 4 "06035J180FBSTR" H 8000 4600 50  0001 C CNN "Part Number"
F 5 "2.2pF for 3V3 operation" H 8000 4600 50  0001 C CNN "Comment"
	1    8000 4600
	1    0    0    -1  
$EndComp
$Comp
L Device:C C9
U 1 1 5A7D87E7
P 4900 3400
F 0 "C9" H 4925 3500 50  0000 L CNN
F 1 "1uF" H 4925 3300 50  0000 L CNN
F 2 "Capacitor_SMD:C_0603_1608Metric_Pad1.05x0.95mm_HandSolder" H 4938 3250 50  0001 C CNN
F 3 "" H 4900 3400 50  0001 C CNN
F 4 "CGB3B3X6S1A105K055AB" H 4900 3400 60  0001 C CNN "Part Number"
	1    4900 3400
	1    0    0    -1  
$EndComp
$Comp
L Device:C C6
U 1 1 5A7D1E53
P 3450 4850
F 0 "C6" H 3475 4950 50  0000 L CNN
F 1 "100pF" H 3475 4750 50  0000 L CNN
F 2 "Capacitor_SMD:C_0603_1608Metric_Pad1.05x0.95mm_HandSolder" H 3488 4700 50  0001 C CNN
F 3 "" H 3450 4850 50  0001 C CNN
F 4 "CBR06C101F5GAC" H -500 500 50  0001 C CNN "Part Number"
	1    3450 4850
	1    0    0    -1  
$EndComp
$Comp
L Device:R R1
U 1 1 5A7D1E4C
P 4100 4400
F 0 "R1" V 4050 4250 50  0000 C CNN
F 1 "1.8K" V 4100 4400 50  0000 C CNN
F 2 "Resistor_SMD:R_0603_1608Metric_Pad1.05x0.95mm_HandSolder" V 4030 4400 50  0001 C CNN
F 3 "" H 4100 4400 50  0001 C CNN
F 4 "ERJ-PB3B1801V" H -100 600 50  0001 C CNN "Part Number"
F 5 "510 for 3V3 operation" V 4100 4400 50  0001 C CNN "Comment"
	1    4100 4400
	0    1    1    0   
$EndComp
$Comp
L Device:R R2
U 1 1 5A7D1E45
P 4100 4250
F 0 "R2" V 4000 4100 50  0000 C CNN
F 1 "2K" V 4100 4250 50  0000 C CNN
F 2 "Resistor_SMD:R_0603_1608Metric_Pad1.05x0.95mm_HandSolder" V 4030 4250 50  0001 C CNN
F 3 "" H 4100 4250 50  0001 C CNN
F 4 "ERJ-PB3B2001V" H -100 600 50  0001 C CNN "Part Number"
F 5 "1k Ohm for 3V3 operation" V 4100 4250 50  0001 C CNN "Comment"
	1    4100 4250
	0    1    1    0   
$EndComp
$Comp
L Device:C C5
U 1 1 5A7D1DF5
P 5750 5500
F 0 "C5" H 5775 5600 50  0000 L CNN
F 1 "100pF" H 5775 5400 50  0000 L CNN
F 2 "Capacitor_SMD:C_0603_1608Metric_Pad1.05x0.95mm_HandSolder" H 5788 5350 50  0001 C CNN
F 3 "" H 5750 5500 50  0001 C CNN
F 4 "CBR06C101F5GAC" H -250 600 50  0001 C CNN "Part Number"
	1    5750 5500
	1    0    0    -1  
$EndComp
$Comp
L Device:C C10
U 1 1 5A7D1DE7
P 5350 3400
F 0 "C10" H 5375 3500 50  0000 L CNN
F 1 "2.4pF" H 5375 3300 50  0000 L CNN
F 2 "Capacitor_SMD:C_0603_1608Metric_Pad1.05x0.95mm_HandSolder" H 5388 3250 50  0001 C CNN
F 3 "" H 5350 3400 50  0001 C CNN
F 4 "06035J2R4ABSTR" H 5350 3400 50  0001 C CNN "Part Number"
	1    5350 3400
	1    0    0    -1  
$EndComp
$Comp
L Device:C C8
U 1 1 5A7D1DE0
P 3000 4050
F 0 "C8" H 3025 4150 50  0000 L CNN
F 1 "1uF" H 3025 3950 50  0000 L CNN
F 2 "Capacitor_SMD:C_0603_1608Metric_Pad1.05x0.95mm_HandSolder" H 3038 3900 50  0001 C CNN
F 3 "" H 3000 4050 50  0001 C CNN
F 4 "CGB3B3X6S1A105K055AB" H 3000 4050 60  0001 C CNN "Part Number"
	1    3000 4050
	1    0    0    -1  
$EndComp
$Comp
L Device:C C12
U 1 1 5A7D1DD9
P 7300 3900
F 0 "C12" H 7325 4000 50  0000 L CNN
F 1 "1000pF" H 7325 3800 50  0000 L CNN
F 2 "Capacitor_SMD:C_0603_1608Metric_Pad1.05x0.95mm_HandSolder" H 7338 3750 50  0001 C CNN
F 3 "" H 7300 3900 50  0001 C CNN
F 4 "GCD188R71H102KA01D" H -200 550 50  0001 C CNN "Part Number"
	1    7300 3900
	1    0    0    -1  
$EndComp
$Comp
L Device:C C11
U 1 1 5A7D1DD2
P 7700 3900
F 0 "C11" H 7725 4000 50  0000 L CNN
F 1 "4.7uF" H 7725 3800 50  0000 L CNN
F 2 "Capacitor_SMD:C_0603_1608Metric_Pad1.05x0.95mm_HandSolder" H 7738 3750 50  0001 C CNN
F 3 "" H 7700 3900 50  0001 C CNN
F 4 "GRM188R60J475KE19D" H -200 550 50  0001 C CNN "Part Number"
	1    7700 3900
	1    0    0    -1  
$EndComp
$Comp
L Device:C C3
U 1 1 5A7D1DCB
P 6850 4450
F 0 "C3" H 6875 4550 50  0000 L CNN
F 1 "220pF" H 6875 4350 50  0000 L CNN
F 2 "Capacitor_SMD:C_0603_1608Metric_Pad1.05x0.95mm_HandSolder" H 6888 4300 50  0001 C CNN
F 3 "" H 6850 4450 50  0001 C CNN
F 4 "VJ0603D221KXAAJ" H 6850 4450 50  0001 C CNN "Part Number"
	1    6850 4450
	0    1    1    0   
$EndComp
$Comp
L Device:L L2
U 1 1 5A7D1DC4
P 5150 3200
F 0 "L2" V 5100 3200 50  0000 C CNN
F 1 "5.6nH" V 5225 3200 50  0000 C CNN
F 2 "Inductor_SMD:L_0603_1608Metric_Pad1.05x0.95mm_HandSolder" H 5150 3200 50  0001 C CNN
F 3 "" H 5150 3200 50  0001 C CNN
F 4 "0603CT-5N6XJLW" V 5150 3200 60  0001 C CNN "Part Number"
	1    5150 3200
	0    -1   -1   0   
$EndComp
$Comp
L Device:L L1
U 1 1 5A7D1DBD
P 4900 5500
F 0 "L1" V 4850 5500 50  0000 C CNN
F 1 "15nH" V 4975 5500 50  0000 C CNN
F 2 "Inductor_SMD:L_0603_1608Metric_Pad1.05x0.95mm_HandSolder" H 4900 5500 50  0001 C CNN
F 3 "" H 4900 5500 50  0001 C CNN
F 4 "0603HP-15NXJLU" V 4600 4750 50  0001 C CNN "Part Number"
	1    4900 5500
	0    -1   -1   0   
$EndComp
$Comp
L Device:L L4
U 1 1 5A7D1DB6
P 7150 4750
F 0 "L4" V 7100 4750 50  0000 C CNN
F 1 "22nH" V 7225 4750 50  0000 C CNN
F 2 "Inductor_SMD:L_0603_1608Metric_Pad1.05x0.95mm_HandSolder" H 7150 4750 50  0001 C CNN
F 3 "" H 7150 4750 50  0001 C CNN
F 4 "0603HP-22NXJLU" V 7150 4750 60  0001 C CNN "Part Number"
	1    7150 4750
	1    0    0    -1  
$EndComp
$Comp
L Device:L L5
U 1 1 5A7D1DAF
P 7300 4450
F 0 "L5" V 7250 4450 50  0000 C CNN
F 1 "5.6nH" V 7375 4450 50  0000 C CNN
F 2 "Inductor_SMD:L_0603_1608Metric_Pad1.05x0.95mm_HandSolder" H 7300 4450 50  0001 C CNN
F 3 "" H 7300 4450 50  0001 C CNN
F 4 "0603CT-5N6XJLW" V 7300 4450 60  0001 C CNN "Part Number"
	1    7300 4450
	0    -1   -1   0   
$EndComp
$Comp
L Device:L L3
U 1 1 5A7D1DA8
P 7000 3750
F 0 "L3" V 6950 3750 50  0000 C CNN
F 1 "12nH" V 7075 3750 50  0000 C CNN
F 2 "Inductor_SMD:L_0603_1608Metric_Pad1.05x0.95mm_HandSolder" H 7000 3750 50  0001 C CNN
F 3 "" H 7000 3750 50  0001 C CNN
F 4 "0603HC-12NXJLU" V 7000 3750 60  0001 C CNN "Part Number"
	1    7000 3750
	0    -1   -1   0   
$EndComp
Wire Wire Line
	7000 2100 7150 2100
Wire Wire Line
	8000 4450 8600 4450
Wire Wire Line
	3000 5500 3250 5500
$Comp
L RF:PAT1220-C-5DB U301
U 1 1 5FCBD00C
P 3650 5600
F 0 "U301" H 3650 5967 50  0000 C CNN
F 1 "PAT1220-C-5DB" H 3650 5876 50  0000 C CNN
F 2 "RF_Converter:RF_Attenuator_Susumu_PAT1220" H 3650 5600 50  0001 C CNN
F 3 "https://www.susumu.co.jp/common/pdf/n_catalog_partition16_en.pdf" H 3400 5850 50  0001 C CNN
	1    3650 5600
	1    0    0    -1  
$EndComp
Wire Wire Line
	4050 5500 4750 5500
Wire Wire Line
	3650 5900 3650 6100
$Comp
L power:GND #PWR0302
U 1 1 5FCBE15F
P 3650 6100
F 0 "#PWR0302" H 3650 5850 50  0001 C CNN
F 1 "GND" H 3655 5927 50  0000 C CNN
F 2 "" H 3650 6100 50  0001 C CNN
F 3 "" H 3650 6100 50  0001 C CNN
	1    3650 6100
	1    0    0    -1  
$EndComp
$EndSCHEMATC
