#VRML V2.0 utf8
#kicad StepUp wrl exported

Shape {
    appearance Appearance {material DEF PIN-01 Material {
        ambientIntensity 0.271
        diffuseColor 0.824 0.820 0.781
        specularColor 0.328 0.258 0.172
        emissiveColor 0.0 0.0 0.0
        shininess 0.70
        transparency 0.0
        }
    }
}
Shape {
    appearance Appearance {material DEF MET-01 Material {
        ambientIntensity 0.249999
        diffuseColor 0.298 0.298 0.298
        specularColor 0.398 0.398 0.398
        emissiveColor 0.0 0.0 0.0
        shininess 0.056122
        transparency 0.0
        }
    }
}
Shape {
    appearance Appearance {material DEF PIN-02 Material {
        ambientIntensity 0.379
        diffuseColor 0.859 0.738 0.496
        specularColor 0.137 0.145 0.184
        emissiveColor 0.0 0.0 0.0
        shininess 0.40
        transparency 0.0
        }
    }
}
Shape {
    appearance Appearance {material DEF IC-BODY-EPOXY-04 Material {
        ambientIntensity 0.293
        diffuseColor 0.148 0.145 0.145
        specularColor 0.180 0.168 0.160
        emissiveColor 0.0 0.0 0.0
        shininess 0.35
        transparency 0.0
        }
    }
}
Shape {
    appearance Appearance {material DEF RES-SMD-01 Material {
        diffuseColor 0.082 0.086 0.094
        emissiveColor 0.000 0.000 0.000
        specularColor 0.066 0.063 0.063
        ambientIntensity 0.638
        transparency 0.0
        shininess 0.3
        }
    }
}
Shape {
    appearance Appearance {material DEF IC-BODY-EPOXY-01 Material {
        ambientIntensity 0.117
        diffuseColor 0.250 0.262 0.281
        specularColor 0.316 0.281 0.176
        emissiveColor 0.0 0.0 0.0
        shininess 0.25
        transparency 0.0
        }
    }
}
Shape {
    appearance Appearance {material DEF CAP-CERAMIC-05 Material {
        ambientIntensity 0.179
        diffuseColor 0.273 0.273 0.273
        specularColor 0.203 0.188 0.176
        emissiveColor 0.0 0.0 0.0
        shininess 0.15
        transparency 0.0
        }
    }
}
Shape {
    appearance Appearance {material DEF CAP-CERAMIC-06 Material {
        ambientIntensity 0.453
        diffuseColor 0.379 0.270 0.215
        specularColor 0.223 0.223 0.223
        emissiveColor 0.0 0.0 0.0
        shininess 0.15
        transparency 0.0
        }
    }
}
Shape {
    appearance Appearance {material DEF RES-THT-01 Material {
        ambientIntensity 0.149
        diffuseColor 0.883 0.711 0.492
        specularColor 0.043 0.121 0.281
        emissiveColor 0.0 0.0 0.0
        shininess 0.40
        transparency 0.0
        }
    }
}
Shape {
    appearance Appearance {material DEF PLASTIC-BLUE-01 Material {
        ambientIntensity 0.565
        diffuseColor 0.137 0.402 0.727
        specularColor 0.359 0.379 0.270
        emissiveColor 0.0 0.0 0.0
        shininess 0.25
        transparency 0.0
        }
    }
}
Shape {
    appearance Appearance {material DEF PLASTIC-GREEN-01 Material {
        ambientIntensity 0.315
        diffuseColor 0.340 0.680 0.445
        specularColor 0.176 0.105 0.195
        emissiveColor 0.0 0.0 0.0
        shininess 0.25
        transparency 0.0
        }
    }
}
Shape {
    appearance Appearance {material DEF PLASTIC-ORANGE-01 Material {
        ambientIntensity 0.284
        diffuseColor 0.809 0.426 0.148
        specularColor 0.039 0.102 0.145
        emissiveColor 0.0 0.0 0.0
        shininess 0.25
        transparency 0.0
        }
    }
}
Shape {
    appearance Appearance {material DEF RED-BODY Material {
        ambientIntensity 0.683
        diffuseColor 0.700 0.100 0.050
        emissiveColor 0.000 0.000 0.000
        specularColor 0.300 0.400 0.150
        shininess 0.25
        transparency 0.0
        }
    }
}
Shape {
    appearance Appearance {material DEF CAP-CERAMIC-02 Material {
        ambientIntensity 0.683
        diffuseColor 0.578 0.336 0.352
        specularColor 0.105 0.273 0.270
        emissiveColor 0.0 0.0 0.0
        shininess 0.25
        transparency 0.0
        }
    }
}
Shape {
    appearance Appearance {material DEF PLASTIC-YELLOW-01 Material {
        ambientIntensity 0.522
        diffuseColor 0.832 0.680 0.066
        specularColor 0.160 0.203 0.320
        emissiveColor 0.0 0.0 0.0
        shininess 0.25
        transparency 0.0
        }
    }
}
Shape {
    appearance Appearance {material DEF PLASTIC-WHITE-01 Material {
        ambientIntensity 0.494
        diffuseColor 0.895 0.891 0.813
        specularColor 0.047 0.055 0.109
        emissiveColor 0.0 0.0 0.0
        shininess 0.25
        transparency 0.0
        }
    }
}
Shape {
    appearance Appearance {material DEF IC-LABEL-01 Material {
        ambientIntensity 0.082
        diffuseColor 0.691 0.664 0.598
        specularColor 0.000 0.000 0.000
        emissiveColor 0.0 0.0 0.0
        shininess 0.01
        transparency 0.0
        }
    }
}
Shape {
    appearance Appearance {material DEF LED-RED Material {
        ambientIntensity 0.789
        diffuseColor 0.700 0.100 0.050
        emissiveColor 0.000 0.000 0.000
        specularColor 0.300 0.400 0.150
        shininess 0.125
        transparency 0.10
        }
    }
}
Shape {
    appearance Appearance {material DEF LED-GREEN Material {
        ambientIntensity 0.789
        diffuseColor 0.400 0.700 0.150
        emissiveColor 0.000 0.000 0.000
        specularColor 0.600 0.300 0.100
        shininess 0.05
        transparency 0.10
        }
    }
}
Shape {
    appearance Appearance {material DEF LED-BLUE Material {
        ambientIntensity 0.789
        diffuseColor 0.100 0.250 0.700
        emissiveColor 0.000 0.000 0.000
        specularColor 0.500 0.600 0.300
        shininess 0.125
        transparency 0.10
        }
    }
}
Shape {
    appearance Appearance {material DEF LED-YELLOW Material {
        ambientIntensity 0.522
        diffuseColor 0.98 0.840 0.066
        specularColor 0.160 0.203 0.320
        emissiveColor 0.0 0.0 0.0
        shininess 0.125
        transparency 0.10
        }
    }
}
Shape {
    appearance Appearance {material DEF LED-WHITE Material {
        ambientIntensity 0.494
        diffuseColor 0.895 0.891 0.813
        specularColor 0.047 0.055 0.109
        emissiveColor 0.0 0.0 0.0
        shininess 0.125
        transparency 0.10
        }
    }
}
Shape {
    appearance Appearance {material DEF LED-GREY Material {
        ambientIntensity 0.494
        diffuseColor 0.27 0.25 0.27
        specularColor 0.5 0.5 0.6
        emissiveColor 0.0 0.0 0.0
        shininess 0.35
        transparency 0.10
        }
    }
}
Shape {
    appearance Appearance {material DEF LED-BLACK Material {
        ambientIntensity 0.494
        diffuseColor 0.1 0.05 0.1
        specularColor 0.6 0.5 0.6
        emissiveColor 0.0 0.0 0.0
        shininess 0.5
        transparency 0.0
        }
    }
}
Shape {
    appearance Appearance {material DEF GLASS-19 Material {
        ambientIntensity 2.018212
        diffuseColor 0.400769 0.441922 0.459091
        specularColor 0.573887 0.649271 0.810811
        emissiveColor 0.000000 0.000000 0.000000
        shininess 0.127273
        transparency 0.37
        }
    }
}
Shape {
    appearance Appearance {material DEF GLASS-29 Material {
        ambientIntensity 0.234375
        diffuseColor 0.566681 0.580872 0.580874
        specularColor 0.617761 0.429816 0.400140
        emissiveColor 0.000000 0.000000 0.000000
        shininess 0.072727
        transparency 0.38
        }
    }
}
Shape {
    appearance Appearance {material DEF GLASS-13 Material {
        ambientIntensity 0.250000
        diffuseColor 0.000000 0.631244 0.748016
        specularColor 0.915152 0.915152 0.915152
        emissiveColor 0.000000 0.000000 0.000000
        shininess 0.642424
        transparency 0.39
        }
    }
}
Shape {
    appearance Appearance {material DEF GLASS-GREEN Material {
        ambientIntensity 0.250000
        diffuseColor 0.000000 0.75 0.44
        specularColor 0.915152 0.915152 0.915152
        emissiveColor 0.000000 0.000000 0.000000
        shininess 0.642424
        transparency 0.39
        }
    }
}
Shape {
    appearance Appearance {material DEF GLASS-ORANGE Material {
        ambientIntensity 0.250000
        diffuseColor 0.75 0.44 0.000000
        specularColor 0.915152 0.915152 0.915152
        emissiveColor 0.000000 0.000000 0.000000
        shininess 0.642424
        transparency 0.39
        }
    }
}
Shape {
    appearance Appearance {material DEF BOARD-GREEN-02 Material {
        ambientIntensity 1
        diffuseColor 0.07 0.3 0.12
        specularColor 0.07 0.3 0.12
        emissiveColor 0.0 0.0 0.0
        shininess 0.40
        transparency 0.0
        }
    }
}
Shape {
    appearance Appearance {material DEF BOARD-BLUE-01 Material {
        ambientIntensity 1
        diffuseColor 0.07 0.12 0.3
        specularColor 0.07 0.12 0.3
        emissiveColor 0.0 0.0 0.0
        shininess 0.40
        transparency 0.0
        }
    }
}
Shape {
    appearance Appearance {material DEF BOARD-BLACK-03 Material {
        ambientIntensity 1
        diffuseColor 0.16 0.16 0.16
        specularColor 0.16 0.16 0.16
        emissiveColor 0.0 0.0 0.0
        shininess 0.40
        transparency 0.0
        }
    }
}
Shape {
    appearance Appearance {material DEF MET-ALUMINUM Material {
        ambientIntensity 0.256000
        diffuseColor 0.372322 0.371574 0.373173
        specularColor 0.556122 0.554201 0.556122
        emissiveColor 0.0 0.0 0.0
        shininess 0.127551
        transparency 0.0
        }
    }
}
Shape {
    appearance Appearance {material DEF MET-BRONZE Material {
        ambientIntensity 0.022727
        diffuseColor 0.714 0.4284 0.18144
        specularColor 0.393548 0.271906 0.166721
        emissiveColor 0.000000 0.000000 0.000000
        shininess 0.2
        transparency 0.0
        }
    }
}
Shape {
    appearance Appearance {material DEF MET-SILVER Material {
        ambientIntensity 0.022727
        diffuseColor 0.50754 0.50754 0.50754
        specularColor 0.508273 0.508273 0.508273
        emissiveColor 0.000000 0.000000 0.000000
        shininess 0.4
        transparency 0.0
        }
    }
}
Shape {
    appearance Appearance {material DEF MET-COPPER Material {
        ambientIntensity 0.022727
        diffuseColor 0.7038 0.27048 0.0828
        specularColor 0.780612 0.37 0.000000
        emissiveColor 0.000000 0.000000 0.000000
        shininess 0.2
        transparency 0.0
        }
    }
}
Shape { geometry IndexedFaceSet 
{ creaseAngle 0.50 coordIndex [0,1,2,-1,3,1,0,-1]
coord Coordinate { point [0.62992 0.206693 0.842518,0.62992 -0.482282 0.704723,0.62992 0.206693 0.653542,0.62992 -0.482282 0.842518]
}}
appearance Appearance{material USE PIN-01 }}
Shape { geometry IndexedFaceSet 
{ creaseAngle 0.50 coordIndex [0,1,2,-1,3,1,0,-1]
coord Coordinate { point [0.62992 0.206693 0.842518,0.55118 -0.482282 0.842518,0.62992 -0.482282 0.842518,0.55118 0.206693 0.842518]
}}
appearance Appearance{material USE PIN-01 }}
Shape { geometry IndexedFaceSet 
{ creaseAngle 0.50 coordIndex [0,1,2,-1,2,3,0,-1,0,4,1,-1,5,6,3,-1,3,6,0,-1,0,7,4,-1,1,8,5,-1,4,8,1,-1,5,8,6,-1,8,9,6,-1,7,10,9,-1,11,10,7,-1,11,12,13,-1,14,12,15,-1,13,12,14,-1,13,16,17,-1,14,16,13,-1,12,18,15,-1,17,19,10,-1,18,19,16,-1,9,19,6,-1,10,19,9,-1,16,19,17,-1,12,19,18,-1,0,12,11,-1,0,11,7,-1]
coord Coordinate { point [0.86614 0.206693 1.00787,0.55118 0.206693 0.842518,0.62992 0.206693 0.842518,0.62992 0.206693 0.653542,0.23622 0.206693 0.842518,0.55118 0.206693 0.653542,0.86614 0.206693 0.181102,0.15748 0.206693 0.842518,0.23622 0.206693 0.653542,0.15748 0.206693 0.653542,-0.15748 0.206692 0.653542,-0.15748 0.206692 0.842518,-0.86614 0.206692 1.00787,-0.23622 0.206692 0.842518,-0.55118 0.206692 0.842518,-0.62992 0.206692 0.842518,-0.55118 0.206692 0.653542,-0.23622 0.206692 0.653542,-0.62992 0.206692 0.653542,-0.86614 0.206692 0.181102]
}}
appearance Appearance{material USE PLASTIC-WHITE-01 }}
Shape { geometry IndexedFaceSet 
{ creaseAngle 0.50 coordIndex [0,1,2,-1,3,1,0,-1]
coord Coordinate { point [0.62992 -0.482282 0.842518,0.55118 -0.482282 0.704723,0.62992 -0.482282 0.704723,0.55118 -0.482282 0.842518]
}}
appearance Appearance{material USE PIN-01 }}
Shape { geometry IndexedFaceSet 
{ creaseAngle 0.50 coordIndex [0,1,2,-1,3,1,0,-1]
coord Coordinate { point [0.62992 -0.482282 0.704723,0.55118 0.206693 0.653542,0.62992 0.206693 0.653542,0.55118 -0.482282 0.704723]
}}
appearance Appearance{material USE PIN-01 }}
Shape { geometry IndexedFaceSet 
{ creaseAngle 0.50 coordIndex [0,1,2,-1,0,3,1,-1]
coord Coordinate { point [0.55118 -0.482282 0.704723,0.55118 0.206693 0.842518,0.55118 0.206693 0.653542,0.55118 -0.482282 0.842518]
}}
appearance Appearance{material USE PIN-01 }}
Shape { geometry IndexedFaceSet 
{ creaseAngle 0.50 coordIndex [0,1,2,-1,3,1,0,-1]
coord Coordinate { point [0.86614 0.206693 1.00787,-0.86614 -0.974408 1.00787,-0.86614 0.206692 1.00787,0.86614 -0.974407 1.00787]
}}
appearance Appearance{material USE PLASTIC-WHITE-01 }}
Shape { geometry IndexedFaceSet 
{ creaseAngle 0.50 coordIndex [0,1,2,-1,3,1,0,-1]
coord Coordinate { point [-0.55118 0.206692 0.842518,-0.55118 -0.482283 0.704723,-0.55118 0.206692 0.653542,-0.55118 -0.482283 0.842518]
}}
appearance Appearance{material USE PIN-01 }}
Shape { geometry IndexedFaceSet 
{ creaseAngle 0.50 coordIndex [0,1,2,-1,0,3,1,-1,2,4,0,-1,4,5,0,-1,6,7,3,-1,3,7,1,-1]
coord Coordinate { point [0.86614 -0.0295275 0.574802,0.86614 0.206693 1.00787,0.86614 0.206693 0.181102,0.86614 -0.0295275 0.811022,0.86614 -0.974407 0.181102,0.86614 -0.974407 0.574802,0.86614 -0.974407 0.811022,0.86614 -0.974407 1.00787]
}}
appearance Appearance{material USE PLASTIC-WHITE-01 }}
Shape { geometry IndexedFaceSet 
{ creaseAngle 0.50 coordIndex [0,1,2,-1,3,1,0,-1]
coord Coordinate { point [-0.15748 0.206692 0.842518,-0.23622 -0.482283 0.842518,-0.15748 -0.482283 0.842518,-0.23622 0.206692 0.842518]
}}
appearance Appearance{material USE PIN-01 }}
Shape { geometry IndexedFaceSet 
{ creaseAngle 0.50 coordIndex [0,1,2,-1,3,1,0,-1]
coord Coordinate { point [0.23622 -0.482282 0.704723,0.15748 0.206693 0.653542,0.23622 0.206693 0.653542,0.15748 -0.482282 0.704723]
}}
appearance Appearance{material USE PIN-01 }}
Shape { geometry IndexedFaceSet 
{ creaseAngle 0.50 coordIndex [0,1,2,-1,3,1,0,-1]
coord Coordinate { point [-0.86614 0.206692 0.181102,0.86614 -0.974407 0.181102,0.86614 0.206693 0.181102,-0.86614 -0.974408 0.181102]
}}
appearance Appearance{material USE PLASTIC-WHITE-01 }}
Shape { geometry IndexedFaceSet 
{ creaseAngle 0.50 coordIndex [0,1,2,-1,0,3,1,-1]
coord Coordinate { point [-0.23622 -0.482283 0.704723,-0.23622 0.206692 0.842518,-0.23622 0.206692 0.653542,-0.23622 -0.482283 0.842518]
}}
appearance Appearance{material USE PIN-01 }}
Shape { geometry IndexedFaceSet 
{ creaseAngle 0.50 coordIndex [0,1,2,-1,0,3,1,-1]
coord Coordinate { point [-0.62992 -0.482283 0.704723,-0.62992 0.206692 0.842518,-0.62992 0.206692 0.653542,-0.62992 -0.482283 0.842518]
}}
appearance Appearance{material USE PIN-01 }}
Shape { geometry IndexedFaceSet 
{ creaseAngle 0.50 coordIndex [0,1,2,-1,3,1,0,-1]
coord Coordinate { point [0.23622 0.206693 0.842518,0.15748 -0.482282 0.842518,0.23622 -0.482282 0.842518,0.15748 0.206693 0.842518]
}}
appearance Appearance{material USE PIN-01 }}
Shape { geometry IndexedFaceSet 
{ creaseAngle 0.50 coordIndex [0,1,2,-1,3,1,0,-1]
coord Coordinate { point [-0.15748 0.206692 0.842518,-0.15748 -0.482283 0.704723,-0.15748 0.206692 0.653542,-0.15748 -0.482283 0.842518]
}}
appearance Appearance{material USE PIN-01 }}
Shape { geometry IndexedFaceSet 
{ creaseAngle 0.50 coordIndex [0,1,2,-1,0,3,1,-1]
coord Coordinate { point [0.15748 -0.482282 0.704723,0.15748 0.206693 0.842518,0.15748 0.206693 0.653542,0.15748 -0.482282 0.842518]
}}
appearance Appearance{material USE PIN-01 }}
Shape { geometry IndexedFaceSet 
{ creaseAngle 0.50 coordIndex [0,1,2,-1,1,3,2,-1,2,4,0,-1,4,5,0,-1,6,7,1,-1,1,7,3,-1]
coord Coordinate { point [-0.86614 -0.0295275 0.811022,-0.86614 -0.0295275 0.574802,-0.86614 0.206692 1.00787,-0.86614 0.206692 0.181102,-0.86614 -0.974408 1.00787,-0.86614 -0.974408 0.811022,-0.86614 -0.974408 0.574802,-0.86614 -0.974408 0.181102]
}}
appearance Appearance{material USE PLASTIC-WHITE-01 }}
Shape { geometry IndexedFaceSet 
{ creaseAngle 0.50 coordIndex [0,1,2,-1,3,1,0,-1]
coord Coordinate { point [-0.55118 0.206692 0.842518,-0.62992 -0.482283 0.842518,-0.55118 -0.482283 0.842518,-0.62992 0.206692 0.842518]
}}
appearance Appearance{material USE PIN-01 }}
Shape { geometry IndexedFaceSet 
{ creaseAngle 0.50 coordIndex [0,1,2,-1,3,1,0,-1]
coord Coordinate { point [0.23622 0.206693 0.842518,0.23622 -0.482282 0.704723,0.23622 0.206693 0.653542,0.23622 -0.482282 0.842518]
}}
appearance Appearance{material USE PIN-01 }}
Shape { geometry IndexedFaceSet 
{ creaseAngle 0.50 coordIndex [0,1,2,-1,3,1,0,-1]
coord Coordinate { point [-0.55118 -0.482283 0.704723,-0.62992 0.206692 0.653542,-0.55118 0.206692 0.653542,-0.62992 -0.482283 0.704723]
}}
appearance Appearance{material USE PIN-01 }}
Shape { geometry IndexedFaceSet 
{ creaseAngle 0.50 coordIndex [0,1,2,-1,3,1,0,-1]
coord Coordinate { point [-0.15748 -0.482283 0.704723,-0.23622 0.206692 0.653542,-0.15748 0.206692 0.653542,-0.23622 -0.482283 0.704723]
}}
appearance Appearance{material USE PIN-01 }}
Shape { geometry IndexedFaceSet 
{ creaseAngle 0.50 coordIndex [0,1,2,-1,0,3,1,-1,0,4,3,-1,5,6,4,-1,4,7,3,-1,6,7,4,-1,5,8,6,-1,5,9,8,-1,8,10,11,-1,9,10,8,-1,12,13,14,-1,15,13,12,-1,16,17,15,-1,15,17,13,-1,16,18,17,-1,18,19,17,-1,18,20,19,-1,21,22,20,-1,22,23,20,-1,20,23,19,-1,12,1,15,-1,15,1,3,-1,9,23,10,-1,10,23,22,-1]
coord Coordinate { point [1.06299 -0.974407 0.003937,0.98425 -0.974407 0.023622,0.98425 -0.974407 0.003937,0.86614 -0.974407 0.181102,1.06299 -0.974407 0.496062,1.1811 -0.974407 0.496062,1.00394 -0.974407 0.574802,0.86614 -0.974407 0.574802,1.00394 -0.974407 0.811022,1.1811 -0.974407 1.16535,0.86614 -0.974407 1.00787,0.86614 -0.974407 0.811022,-0.98425 -0.974407 0.023622,-1.06299 -0.974408 0.003937,-0.98425 -0.974408 0.003937,-0.86614 -0.974408 0.181102,-0.86614 -0.974408 0.574802,-1.06299 -0.974408 0.496062,-1.00393 -0.974408 0.574802,-1.1811 -0.974408 0.496062,-1.00393 -0.974408 0.811022,-0.86614 -0.974408 0.811022,-0.86614 -0.974408 1.00787,-1.1811 -0.974408 1.16535]
}}
appearance Appearance{material USE PLASTIC-WHITE-01 }}
Shape { geometry IndexedFaceSet 
{ creaseAngle 0.50 coordIndex [0,1,2,-1,3,1,0,-1]
coord Coordinate { point [-0.55118 -0.482283 0.842518,-0.62992 -0.482283 0.704723,-0.55118 -0.482283 0.704723,-0.62992 -0.482283 0.842518]
}}
appearance Appearance{material USE PIN-01 }}
Shape { geometry IndexedFaceSet 
{ creaseAngle 0.50 coordIndex [0,1,2,-1,0,2,3,-1]
coord Coordinate { point [0.86614 -0.0295275 0.811022,0.86614 -0.0295275 0.574802,1.00393 -0.0295275 0.574802,1.00393 -0.0295275 0.811022]
}}
appearance Appearance{material USE PLASTIC-WHITE-01 }}
Shape { geometry IndexedFaceSet 
{ creaseAngle 0.50 coordIndex [0,1,2,-1,3,1,0,-1]
coord Coordinate { point [0.86614 -0.0295275 0.574802,1.00394 -0.974407 0.574802,1.00393 -0.0295275 0.574802,0.86614 -0.974407 0.574802]
}}
appearance Appearance{material USE PLASTIC-WHITE-01 }}
Shape { geometry IndexedFaceSet 
{ creaseAngle 0.50 coordIndex [0,1,2,-1,3,1,0,-1]
coord Coordinate { point [1.00393 -0.0295275 0.811022,0.86614 -0.974407 0.811022,0.86614 -0.0295275 0.811022,1.00394 -0.974407 0.811022]
}}
appearance Appearance{material USE PLASTIC-WHITE-01 }}
Shape { geometry IndexedFaceSet 
{ creaseAngle 0.50 coordIndex [0,1,2,-1,3,1,0,-1]
coord Coordinate { point [-0.15748 -0.482283 0.842518,-0.23622 -0.482283 0.704723,-0.15748 -0.482283 0.704723,-0.23622 -0.482283 0.842518]
}}
appearance Appearance{material USE PIN-01 }}
Shape { geometry IndexedFaceSet 
{ creaseAngle 0.50 coordIndex [0,1,2,-1,3,1,0,-1]
coord Coordinate { point [0.23622 -0.482282 0.842518,0.15748 -0.482282 0.704723,0.23622 -0.482282 0.704723,0.15748 -0.482282 0.842518]
}}
appearance Appearance{material USE PIN-01 }}
Shape { geometry IndexedFaceSet 
{ creaseAngle 0.50 coordIndex [0,1,2,-1,3,1,0,-1]
coord Coordinate { point [-0.86614 -0.0295275 0.811022,-1.00394 -0.0295275 0.574802,-0.86614 -0.0295275 0.574802,-1.00394 -0.0295275 0.811022]
}}
appearance Appearance{material USE PLASTIC-WHITE-01 }}
Shape { geometry IndexedFaceSet 
{ creaseAngle 0.50 coordIndex [0,1,2,-1,3,1,0,-1]
coord Coordinate { point [-1.00394 -0.0295275 0.574802,-0.86614 -0.974408 0.574802,-0.86614 -0.0295275 0.574802,-1.00393 -0.974408 0.574802]
}}
appearance Appearance{material USE PLASTIC-WHITE-01 }}
Shape { geometry IndexedFaceSet 
{ creaseAngle 0.50 coordIndex [0,1,2,-1,3,1,0,-1]
coord Coordinate { point [-0.86614 -0.0295275 0.811022,-1.00393 -0.974408 0.811022,-1.00394 -0.0295275 0.811022,-0.86614 -0.974408 0.811022]
}}
appearance Appearance{material USE PLASTIC-WHITE-01 }}
Shape { geometry IndexedFaceSet 
{ creaseAngle 0.50 coordIndex [0,1,2,-1,3,1,0,-1]
coord Coordinate { point [1.06299 -0.974407 0.003937,0.98425 -0.383857 0.003937,1.06299 -0.383857 0.003937,0.98425 -0.974407 0.003937]
}}
appearance Appearance{material USE PIN-01 }}
Shape { geometry IndexedFaceSet 
{ creaseAngle 0.50 coordIndex [0,1,2,-1,3,1,0,-1]
coord Coordinate { point [-1.00394 -0.0295275 0.811022,-1.00393 -0.974408 0.574802,-1.00394 -0.0295275 0.574802,-1.00393 -0.974408 0.811022]
}}
appearance Appearance{material USE PLASTIC-WHITE-01 }}
Shape { geometry IndexedFaceSet 
{ creaseAngle 0.50 coordIndex [0,1,2,-1,1,3,2,-1]
coord Coordinate { point [-0.98425 -0.974408 0.003937,-0.98425 -0.383858 0.003937,-0.98425 -0.974407 0.023622,-0.98425 -0.383858 0.023622]
}}
appearance Appearance{material USE PIN-01 }}
Shape { geometry IndexedFaceSet 
{ creaseAngle 0.50 coordIndex [0,1,2,-1,0,3,1,-1,3,4,1,-1,1,5,6,-1,4,5,1,-1,7,8,4,-1,5,8,9,-1,4,8,5,-1,10,11,8,-1,8,11,9,-1]
coord Coordinate { point [-1.1811 0.698817 0.023622,-1.1811 0.482282 0.574802,-1.1811 0.698817 0.574802,-1.1811 -0.383858 0.023622,-1.1811 -0.383858 0.240157,-1.1811 0.226377 0.968502,-1.1811 0.482282 0.968502,-1.1811 -0.777558 0.240157,-1.1811 -0.777558 0.496062,-1.1811 0.112726 1.16535,-1.1811 -0.974408 0.496062,-1.1811 -0.974408 1.16535]
}}
appearance Appearance{material USE PLASTIC-WHITE-01 }}
Shape { geometry IndexedFaceSet 
{ creaseAngle 0.50 coordIndex [0,1,2,-1,3,4,5,-1,3,5,6,-1,7,8,1,-1,9,0,4,-1,9,3,10,-1,9,1,0,-1,9,4,3,-1,9,7,1,-1,11,10,12,-1,11,12,13,-1,14,15,16,-1,17,15,14,-1,18,19,20,-1,21,17,19,-1,21,11,15,-1,21,9,10,-1,21,10,11,-1,21,19,18,-1,21,15,17,-1,22,21,18,-1,23,22,18,-1,24,25,9,-1,24,9,21,-1]
coord Coordinate { point [-0.62992 0.659447 0.023622,-1.1811 0.698817 0.023622,-0.62992 0.698817 0.023622,-0.23622 0.659448 0.023622,-0.55118 0.659447 0.023622,-0.55118 0.698817 0.023622,-0.23622 0.698818 0.023622,-1.06299 -0.383858 0.023622,-1.1811 -0.383858 0.023622,-0.98425 -0.383858 0.023622,-0.15748 0.659448 0.023622,0.15748 0.659448 0.023622,-0.15748 0.698818 0.023622,0.15748 0.698818 0.023622,0.55118 0.698818 0.023622,0.23622 0.659448 0.023622,0.23622 0.698818 0.023622,0.55118 0.659448 0.023622,1.1811 0.698818 0.023622,0.62992 0.659448 0.023622,0.62992 0.698818 0.023622,0.98425 -0.383857 0.023622,1.06299 -0.383857 0.023622,1.1811 -0.383857 0.023622,0.98425 -0.974407 0.023622,-0.98425 -0.974407 0.023622]
}}
appearance Appearance{material USE PLASTIC-WHITE-01 }}
Shape { geometry IndexedFaceSet 
{ creaseAngle 0.50 coordIndex [0,1,2,-1,0,3,1,-1]
coord Coordinate { point [-1.1811 -0.974408 0.496062,-1.06299 -0.777558 0.496062,-1.06299 -0.974408 0.496062,-1.1811 -0.777558 0.496062]
}}
appearance Appearance{material USE PLASTIC-WHITE-01 }}
Shape { geometry IndexedFaceSet 
{ creaseAngle 0.50 coordIndex [0,1,2,-1,0,2,3,-1,0,3,4,-1,5,0,6,-1,5,1,0,-1]
coord Coordinate { point [1.06299 -0.777557 0.240157,1.06299 -0.974407 0.003937,1.06299 -0.383857 0.003937,1.06299 -0.383857 0.023622,1.06299 -0.383857 0.240157,1.06299 -0.974407 0.496062,1.06299 -0.777557 0.496062]
}}
appearance Appearance{material USE PIN-01 }}
Shape { geometry IndexedFaceSet 
{ creaseAngle 0.50 coordIndex [0,1,2,-1,3,2,1,-1,4,3,1,-1,5,1,0,-1,6,4,1,-1]
coord Coordinate { point [-1.06299 -0.974408 0.496062,-1.06299 -0.777558 0.240157,-1.06299 -0.974408 0.003937,-1.06299 -0.383858 0.003937,-1.06299 -0.383858 0.023622,-1.06299 -0.777558 0.496062,-1.06299 -0.383858 0.240157]
}}
appearance Appearance{material USE PIN-01 }}
Shape { geometry IndexedFaceSet 
{ creaseAngle 0.50 coordIndex [0,1,2,-1,3,4,5,-1,2,4,3,-1,4,6,7,-1,1,6,2,-1,2,6,4,-1]
coord Coordinate { point [-1.1811 0.112726 1.16535,-1.1811 -0.974408 1.16535,-0.98425 0.112726 1.16535,-0.98425 0.698817 1.16535,0.98425 0.112726 1.16535,0.98425 0.698818 1.16535,1.1811 -0.974407 1.16535,1.1811 0.112726 1.16535]
}}
appearance Appearance{material USE PLASTIC-WHITE-01 }}
Shape { geometry IndexedFaceSet 
{ creaseAngle 0.50 coordIndex [0,1,2,-1,3,1,0,-1]
coord Coordinate { point [0.98425 -0.383857 0.003937,0.98425 -0.974407 0.023622,0.98425 -0.383857 0.023622,0.98425 -0.974407 0.003937]
}}
appearance Appearance{material USE PIN-01 }}
Shape { geometry IndexedFaceSet 
{ creaseAngle 0.50 coordIndex [0,1,2,-1,1,3,2,-1,1,4,3,-1,5,6,1,-1,1,6,4,-1,7,8,6,-1,4,8,9,-1,6,8,4,-1,8,10,11,-1,7,10,8,-1]
coord Coordinate { point [1.1811 0.698818 0.574802,1.1811 0.482283 0.574802,1.1811 0.698818 0.023622,1.1811 -0.383857 0.023622,1.1811 -0.383857 0.240157,1.1811 0.482283 0.968502,1.1811 0.226378 0.968502,1.1811 0.112726 1.16535,1.1811 -0.777557 0.496062,1.1811 -0.777557 0.240157,1.1811 -0.974407 1.16535,1.1811 -0.974407 0.496062]
}}
appearance Appearance{material USE PLASTIC-WHITE-01 }}
Shape { geometry IndexedFaceSet 
{ creaseAngle 0.50 coordIndex [0,1,2,-1,2,1,3,-1]
coord Coordinate { point [1.00394 -0.974407 0.811022,1.00393 -0.0295275 0.811022,1.00394 -0.974407 0.574802,1.00393 -0.0295275 0.574802]
}}
appearance Appearance{material USE PLASTIC-WHITE-01 }}
Shape { geometry IndexedFaceSet 
{ creaseAngle 0.50 coordIndex [0,1,2,-1,2,1,3,-1]
coord Coordinate { point [1.06299 -0.974407 0.496062,1.06299 -0.777557 0.496062,1.1811 -0.974407 0.496062,1.1811 -0.777557 0.496062]
}}
appearance Appearance{material USE PLASTIC-WHITE-01 }}
Shape { geometry IndexedFaceSet 
{ creaseAngle 0.50 coordIndex [0,1,2,-1,0,3,1,-1]
coord Coordinate { point [-1.06299 -0.974408 0.003937,-0.98425 -0.383858 0.003937,-0.98425 -0.974408 0.003937,-1.06299 -0.383858 0.003937]
}}
appearance Appearance{material USE PIN-01 }}
Shape { geometry IndexedFaceSet 
{ creaseAngle 0.50 coordIndex [0,1,2,-1,3,1,0,-1]
coord Coordinate { point [1.06299 -0.383857 0.003937,0.98425 -0.383857 0.023622,1.06299 -0.383857 0.023622,0.98425 -0.383857 0.003937]
}}
appearance Appearance{material USE PIN-01 }}
Shape { geometry IndexedFaceSet 
{ creaseAngle 0.50 coordIndex [0,1,2,-1,0,2,3,-1]
coord Coordinate { point [-1.06299 -0.383858 0.003937,-1.06299 -0.383858 0.023622,-0.98425 -0.383858 0.023622,-0.98425 -0.383858 0.003937]
}}
appearance Appearance{material USE PIN-01 }}
Shape { geometry IndexedFaceSet 
{ creaseAngle 0.50 coordIndex [0,1,2,-1,0,2,3,-1]
coord Coordinate { point [-1.1811 0.482282 0.574802,-1.1811 0.482282 0.968502,-0.98425 0.482282 0.968502,-0.98425 0.482282 0.574802]
}}
appearance Appearance{material USE PLASTIC-WHITE-01 }}
Shape { geometry IndexedFaceSet 
{ creaseAngle 0.50 coordIndex [0,1,2,-1,0,2,3,-1]
coord Coordinate { point [-1.1811 0.226377 0.968502,-0.98425 0.226377 0.968502,-0.98425 0.482282 0.968502,-1.1811 0.482282 0.968502]
}}
appearance Appearance{material USE PLASTIC-WHITE-01 }}
Shape { geometry IndexedFaceSet 
{ creaseAngle 0.50 coordIndex [0,1,2,-1,0,2,3,-1]
coord Coordinate { point [-1.1811 0.226377 0.968502,-1.1811 0.112726 1.16535,-0.98425 0.112726 1.16535,-0.98425 0.226377 0.968502]
}}
appearance Appearance{material USE PLASTIC-WHITE-01 }}
Shape { geometry IndexedFaceSet 
{ creaseAngle 0.50 coordIndex [0,1,2,-1,1,3,4,-1,5,3,0,-1,0,3,1,-1,6,7,8,-1,4,7,6,-1,3,7,4,-1,7,9,10,-1,3,9,7,-1,11,12,13,-1,10,12,11,-1,14,15,16,-1,17,15,14,-1,18,19,20,-1,15,21,18,-1,18,21,19,-1,17,21,15,-1,21,22,19,-1,12,23,17,-1,9,23,10,-1,10,23,12,-1,17,23,21,-1]
coord Coordinate { point [-1.1811 0.698817 0.023622,-0.62992 0.698817 0.07874,-0.62992 0.698817 0.023622,-0.98425 0.698817 0.574802,-0.55118 0.698817 0.07874,-1.1811 0.698817 0.574802,-0.55118 0.698817 0.023622,-0.23622 0.698818 0.07874,-0.23622 0.698818 0.023622,-0.98425 0.698817 1.16535,-0.15748 0.698818 0.07874,-0.15748 0.698818 0.023622,0.15748 0.698818 0.07874,0.15748 0.698818 0.023622,0.23622 0.698818 0.023622,0.55118 0.698818 0.07874,0.55118 0.698818 0.023622,0.23622 0.698818 0.07874,0.62992 0.698818 0.07874,1.1811 0.698818 0.023622,0.62992 0.698818 0.023622,0.98425 0.698818 0.574802,1.1811 0.698818 0.574802,0.98425 0.698818 1.16535]
}}
appearance Appearance{material USE PLASTIC-WHITE-01 }}
Shape { geometry IndexedFaceSet 
{ creaseAngle 0.50 coordIndex [0,1,2,-1,0,3,1,-1]
coord Coordinate { point [-1.1811 -0.777558 0.240157,-1.06299 -0.383858 0.240157,-1.06299 -0.777558 0.240157,-1.1811 -0.383858 0.240157]
}}
appearance Appearance{material USE PLASTIC-WHITE-01 }}
Shape { geometry IndexedFaceSet 
{ creaseAngle 0.50 coordIndex [0,1,2,-1,0,2,3,-1]
coord Coordinate { point [-1.1811 0.482282 0.574802,-0.98425 0.482282 0.574802,-0.98425 0.698817 0.574802,-1.1811 0.698817 0.574802]
}}
appearance Appearance{material USE PLASTIC-WHITE-01 }}
Shape { geometry IndexedFaceSet 
{ creaseAngle 0.50 coordIndex [0,1,2,-1,0,3,1,-1]
coord Coordinate { point [-1.1811 -0.777558 0.496062,-1.06299 -0.777558 0.240157,-1.06299 -0.777558 0.496062,-1.1811 -0.777558 0.240157]
}}
appearance Appearance{material USE PLASTIC-WHITE-01 }}
Shape { geometry IndexedFaceSet 
{ creaseAngle 0.50 coordIndex [0,1,2,-1,0,3,1,-1]
coord Coordinate { point [-1.1811 -0.383858 0.240157,-1.06299 -0.383858 0.023622,-1.06299 -0.383858 0.240157,-1.1811 -0.383858 0.023622]
}}
appearance Appearance{material USE PLASTIC-WHITE-01 }}
Shape { geometry IndexedFaceSet 
{ creaseAngle 0.50 coordIndex [0,1,2,-1,0,2,3,-1,4,5,0,-1,4,0,3,-1]
coord Coordinate { point [0.15748 0.698818 0.023622,0.15748 0.698818 0.07874,0.15748 0.974408 0.07874,0.15748 0.974408 1.11022e-14,0.15748 0.659448 1.01406e-14,0.15748 0.659448 0.023622]
}}
appearance Appearance{material USE PIN-01 }}
Shape { geometry IndexedFaceSet 
{ creaseAngle 0.50 coordIndex [0,1,2,-1,2,1,3,-1,4,5,1,-1,1,5,3,-1]
coord Coordinate { point [0.62992 0.698818 0.07874,0.62992 0.698818 0.023622,0.62992 0.974408 0.07874,0.62992 0.974408 1.11022e-14,0.62992 0.659448 0.023622,0.62992 0.659448 1.01406e-14]
}}
appearance Appearance{material USE PIN-01 }}
Shape { geometry IndexedFaceSet 
{ creaseAngle 0.50 coordIndex [0,1,2,-1,2,1,3,-1]
coord Coordinate { point [1.06299 -0.383857 0.240157,1.06299 -0.383857 0.023622,1.1811 -0.383857 0.240157,1.1811 -0.383857 0.023622]
}}
appearance Appearance{material USE PLASTIC-WHITE-01 }}
Shape { geometry IndexedFaceSet 
{ creaseAngle 0.50 coordIndex [0,1,2,-1,0,2,3,-1,4,5,0,-1,4,0,3,-1]
coord Coordinate { point [-0.62992 0.698817 0.023622,-0.62992 0.698817 0.07874,-0.62992 0.974407 0.07874,-0.62992 0.974407 1.11022e-14,-0.62992 0.659447 1.01406e-14,-0.62992 0.659447 0.023622]
}}
appearance Appearance{material USE PIN-01 }}
Shape { geometry IndexedFaceSet 
{ creaseAngle 0.50 coordIndex [0,1,2,-1,2,1,3,-1,4,5,1,-1,1,5,3,-1]
coord Coordinate { point [0.23622 0.698818 0.07874,0.23622 0.698818 0.023622,0.23622 0.974408 0.07874,0.23622 0.974408 1.11022e-14,0.23622 0.659448 0.023622,0.23622 0.659448 1.01406e-14]
}}
appearance Appearance{material USE PIN-01 }}
Shape { geometry IndexedFaceSet 
{ creaseAngle 0.50 coordIndex [0,1,2,-1,2,1,3,-1,4,5,1,-1,1,5,3,-1]
coord Coordinate { point [-0.15748 0.698818 0.07874,-0.15748 0.698818 0.023622,-0.15748 0.974408 0.07874,-0.15748 0.974408 1.11022e-14,-0.15748 0.659448 0.023622,-0.15748 0.659448 1.01406e-14]
}}
appearance Appearance{material USE PIN-01 }}
Shape { geometry IndexedFaceSet 
{ creaseAngle 0.50 coordIndex [0,1,2,-1,2,1,3,-1]
coord Coordinate { point [0.15748 0.659448 0.023622,0.15748 0.659448 1.01406e-14,0.23622 0.659448 0.023622,0.23622 0.659448 1.01406e-14]
}}
appearance Appearance{material USE PIN-01 }}
Shape { geometry IndexedFaceSet 
{ creaseAngle 0.50 coordIndex [0,1,2,-1,0,2,3,-1,4,5,0,-1,4,0,3,-1]
coord Coordinate { point [-0.23622 0.698818 0.023622,-0.23622 0.698818 0.07874,-0.23622 0.974408 0.07874,-0.23622 0.974408 1.11022e-14,-0.23622 0.659448 1.01406e-14,-0.23622 0.659448 0.023622]
}}
appearance Appearance{material USE PIN-01 }}
Shape { geometry IndexedFaceSet 
{ creaseAngle 0.50 coordIndex [0,1,2,-1,2,1,3,-1]
coord Coordinate { point [-0.23622 0.659448 0.023622,-0.23622 0.659448 1.01406e-14,-0.15748 0.659448 0.023622,-0.15748 0.659448 1.01406e-14]
}}
appearance Appearance{material USE PIN-01 }}
Shape { geometry IndexedFaceSet 
{ creaseAngle 0.50 coordIndex [0,1,2,-1,2,1,3,-1,4,5,1,-1,1,5,3,-1]
coord Coordinate { point [-0.55118 0.698817 0.07874,-0.55118 0.698817 0.023622,-0.55118 0.974407 0.07874,-0.55118 0.974407 1.11022e-14,-0.55118 0.659447 0.023622,-0.55118 0.659447 1.01406e-14]
}}
appearance Appearance{material USE PIN-01 }}
Shape { geometry IndexedFaceSet 
{ creaseAngle 0.50 coordIndex [0,1,2,-1,2,1,3,-1]
coord Coordinate { point [-0.62992 0.659447 0.023622,-0.62992 0.659447 1.01406e-14,-0.55118 0.659447 0.023622,-0.55118 0.659447 1.01406e-14]
}}
appearance Appearance{material USE PIN-01 }}
Shape { geometry IndexedFaceSet 
{ creaseAngle 0.50 coordIndex [0,1,2,-1,0,2,3,-1,4,5,0,-1,4,0,3,-1]
coord Coordinate { point [0.55118 0.698818 0.023622,0.55118 0.698818 0.07874,0.55118 0.974408 0.07874,0.55118 0.974408 1.11022e-14,0.55118 0.659448 1.01406e-14,0.55118 0.659448 0.023622]
}}
appearance Appearance{material USE PIN-01 }}
Shape { geometry IndexedFaceSet 
{ creaseAngle 0.50 coordIndex [0,1,2,-1,2,1,3,-1]
coord Coordinate { point [0.55118 0.659448 0.023622,0.55118 0.659448 1.01406e-14,0.62992 0.659448 0.023622,0.62992 0.659448 1.01406e-14]
}}
appearance Appearance{material USE PIN-01 }}
Shape { geometry IndexedFaceSet 
{ creaseAngle 0.50 coordIndex [0,1,2,-1,2,1,3,-1]
coord Coordinate { point [1.06299 -0.777557 0.496062,1.06299 -0.777557 0.240157,1.1811 -0.777557 0.496062,1.1811 -0.777557 0.240157]
}}
appearance Appearance{material USE PLASTIC-WHITE-01 }}
Shape { geometry IndexedFaceSet 
{ creaseAngle 0.50 coordIndex [0,1,2,-1,2,1,3,-1]
coord Coordinate { point [1.06299 -0.777557 0.240157,1.06299 -0.383857 0.240157,1.1811 -0.777557 0.240157,1.1811 -0.383857 0.240157]
}}
appearance Appearance{material USE PLASTIC-WHITE-01 }}
Shape { geometry IndexedFaceSet 
{ creaseAngle 0.50 coordIndex [0,1,2,-1,2,3,0,-1,1,4,2,-1,2,5,3,-1]
coord Coordinate { point [0.98425 0.698818 1.16535,0.98425 0.112726 1.16535,0.98425 0.482283 0.968502,0.98425 0.698818 0.574802,0.98425 0.226378 0.968502,0.98425 0.482283 0.574802]
}}
appearance Appearance{material USE PLASTIC-WHITE-01 }}
Shape { geometry IndexedFaceSet 
{ creaseAngle 0.50 coordIndex [0,1,2,-1,0,3,1,-1,1,4,5,-1,3,4,1,-1]
coord Coordinate { point [-0.98425 0.112726 1.16535,-0.98425 0.482282 0.968502,-0.98425 0.226377 0.968502,-0.98425 0.698817 1.16535,-0.98425 0.698817 0.574802,-0.98425 0.482282 0.574802]
}}
appearance Appearance{material USE PLASTIC-WHITE-01 }}
Shape { geometry IndexedFaceSet 
{ creaseAngle 0.50 coordIndex [0,1,2,-1,3,1,0,-1]
coord Coordinate { point [1.1811 0.226378 0.968502,0.98425 0.112726 1.16535,1.1811 0.112726 1.16535,0.98425 0.226378 0.968502]
}}
appearance Appearance{material USE PLASTIC-WHITE-01 }}
Shape { geometry IndexedFaceSet 
{ creaseAngle 0.50 coordIndex [0,1,2,-1,3,1,0,-1]
coord Coordinate { point [0.98425 0.698818 0.574802,1.1811 0.482283 0.574802,1.1811 0.698818 0.574802,0.98425 0.482283 0.574802]
}}
appearance Appearance{material USE PLASTIC-WHITE-01 }}
Shape { geometry IndexedFaceSet 
{ creaseAngle 0.50 coordIndex [0,1,2,-1,3,1,0,-1]
coord Coordinate { point [1.1811 0.482283 0.574802,0.98425 0.482283 0.968502,1.1811 0.482283 0.968502,0.98425 0.482283 0.574802]
}}
appearance Appearance{material USE PLASTIC-WHITE-01 }}
Shape { geometry IndexedFaceSet 
{ creaseAngle 0.50 coordIndex [0,1,2,-1,3,1,0,-1]
coord Coordinate { point [0.98425 0.482283 0.968502,1.1811 0.226378 0.968502,1.1811 0.482283 0.968502,0.98425 0.226378 0.968502]
}}
appearance Appearance{material USE PLASTIC-WHITE-01 }}
Shape { geometry IndexedFaceSet 
{ creaseAngle 0.50 coordIndex [0,1,2,-1,3,1,0,-1]
coord Coordinate { point [-0.55118 0.974407 0.07874,-0.62992 0.698817 0.07874,-0.55118 0.698817 0.07874,-0.62992 0.974407 0.07874]
}}
appearance Appearance{material USE PIN-01 }}
Shape { geometry IndexedFaceSet 
{ creaseAngle 0.50 coordIndex [0,1,2,-1,3,1,0,-1]
coord Coordinate { point [0.23622 0.974408 0.07874,0.15748 0.698818 0.07874,0.23622 0.698818 0.07874,0.15748 0.974408 0.07874]
}}
appearance Appearance{material USE PIN-01 }}
Shape { geometry IndexedFaceSet 
{ creaseAngle 0.50 coordIndex [0,1,2,-1,3,1,0,-1]
coord Coordinate { point [-0.15748 0.974408 0.07874,-0.23622 0.698818 0.07874,-0.15748 0.698818 0.07874,-0.23622 0.974408 0.07874]
}}
appearance Appearance{material USE PIN-01 }}
Shape { geometry IndexedFaceSet 
{ creaseAngle 0.50 coordIndex [0,1,2,-1,3,1,0,-1]
coord Coordinate { point [0.62992 0.974408 0.07874,0.55118 0.698818 0.07874,0.62992 0.698818 0.07874,0.55118 0.974408 0.07874]
}}
appearance Appearance{material USE PIN-01 }}
Shape { geometry IndexedFaceSet 
{ creaseAngle 0.50 coordIndex [0,1,2,-1,3,1,0,-1]
coord Coordinate { point [0.23622 0.659448 1.01406e-14,0.15748 0.974408 1.11022e-14,0.23622 0.974408 1.11022e-14,0.15748 0.659448 1.01406e-14]
}}
appearance Appearance{material USE PIN-01 }}
Shape { geometry IndexedFaceSet 
{ creaseAngle 0.50 coordIndex [0,1,2,-1,3,1,0,-1]
coord Coordinate { point [0.23622 0.974408 1.11022e-14,0.15748 0.974408 0.07874,0.23622 0.974408 0.07874,0.15748 0.974408 1.11022e-14]
}}
appearance Appearance{material USE PIN-01 }}
Shape { geometry IndexedFaceSet 
{ creaseAngle 0.50 coordIndex [0,1,2,-1,3,1,0,-1]
coord Coordinate { point [0.62992 0.659448 1.01406e-14,0.55118 0.974408 1.11022e-14,0.62992 0.974408 1.11022e-14,0.55118 0.659448 1.01406e-14]
}}
appearance Appearance{material USE PIN-01 }}
Shape { geometry IndexedFaceSet 
{ creaseAngle 0.50 coordIndex [0,1,2,-1,3,1,0,-1]
coord Coordinate { point [0.62992 0.974408 1.11022e-14,0.55118 0.974408 0.07874,0.62992 0.974408 0.07874,0.55118 0.974408 1.11022e-14]
}}
appearance Appearance{material USE PIN-01 }}
Shape { geometry IndexedFaceSet 
{ creaseAngle 0.50 coordIndex [0,1,2,-1,3,1,0,-1]
coord Coordinate { point [-0.55118 0.974407 1.11022e-14,-0.62992 0.974407 0.07874,-0.55118 0.974407 0.07874,-0.62992 0.974407 1.11022e-14]
}}
appearance Appearance{material USE PIN-01 }}
Shape { geometry IndexedFaceSet 
{ creaseAngle 0.50 coordIndex [0,1,2,-1,3,1,0,-1]
coord Coordinate { point [-0.55118 0.659447 1.01406e-14,-0.62992 0.974407 1.11022e-14,-0.55118 0.974407 1.11022e-14,-0.62992 0.659447 1.01406e-14]
}}
appearance Appearance{material USE PIN-01 }}
Shape { geometry IndexedFaceSet 
{ creaseAngle 0.50 coordIndex [0,1,2,-1,3,1,0,-1]
coord Coordinate { point [-0.15748 0.659448 1.01406e-14,-0.23622 0.974408 1.11022e-14,-0.15748 0.974408 1.11022e-14,-0.23622 0.659448 1.01406e-14]
}}
appearance Appearance{material USE PIN-01 }}
Shape { geometry IndexedFaceSet 
{ creaseAngle 0.50 coordIndex [0,1,2,-1,3,1,0,-1]
coord Coordinate { point [-0.15748 0.974408 1.11022e-14,-0.23622 0.974408 0.07874,-0.15748 0.974408 0.07874,-0.23622 0.974408 1.11022e-14]
}}
appearance Appearance{material USE PIN-01 }}
