@startuml

title Sattelite Sandbox

legend
|= |= Legend |
|<back:#lightgreen>green</back>| Re-usable in real Sat |
|<back:#lightblue>blue</back>| librepus-dev components |
|<back:#lightgray>gray</back>| External components |
endlegend

package "ST32 Nucleo board - sandbox OBC" {
    [FreeRTOS] #lightgray
    [Comm tread] #lightgreen
    [Supportive treads] #lightblue
    [LibrePUS lib] #lightgreen
    [SPI Driver] #lightgray

    [Comm tread] --> [FreeRTOS]
    [Supportive treads] --> [FreeRTOS]
    [LibrePUS lib] --> [Comm tread]
    [SPI Driver] --> [Comm tread]
    [SPI Driver] - SPI1
}

package "Raspberry Pi - sandbox interfaces" {
    package "to sandbox OBC" {
        [spi.py] #lightgray
        [comm-bridge.py] #lightblue

        SPI2 - [spi.py]
        [comm-bridge.py] --> [spi.py]
        [comm-bridge.py] - UDP1
    }

    cloud {
        [localhost]

        [localhost] - UDP2
    }

    package "web interface" {
        [lighthttpd] #lightgray
        [lpusnode] #lightblue
        [web-gauge] #lightblue
        [.txt files] #lightblue

        UDP3 - [lpusnode]
        [lpusnode] --> [.txt files]
        [web-gauge] --> [lighthttpd]
        [web-gauge] --> [.txt files]
        [lighthttpd] - HTTP1
    }

    package "remote console" {
        [lpusnode ]

        UDP4 - [lpusnode ]
        [lpusnode ] - SSH1
    }
}

cloud {
    [LAN]

    HTTP2 - [LAN]
    [LAN] - SSH2
}

SPI1 --> SPI2
UDP1 -up-> UDP2
UDP3 -up-> UDP2
UDP4 -up-> UDP2
HTTP1 --> HTTP2
SSH1 --> SSH2

@enduml

