{
  "parent": "block/cube_bottom_top",
  "textures": {
      "side": "tardis:blocks/roundel/chiseled_quartz_full",
      "top":"tardis:blocks/roundel/chiseled_quartz_top_full",
      "bottom":"tardis:blocks/roundel/chiseled_quartz_top_full"
  }
}