{
	"credit": "Made with Blockbench",
	"textures": {
		"0": "tardis:blocks/xion_crystal",
		"particle": "tardis:blocks/xion_crystal"
	},
	"elements": [
		{
			"from": [2, -0.66421, 9.34315],
			"to": [3, 0.33579, 10.34315],
			"rotation": {"angle": 22.5, "axis": "y", "origin": [4, 2.33579, 9.34315]},
			"faces": {
				"north": {"uv": [5, 5, 6, 6], "rotation": 180, "texture": "#0"},
				"east": {"uv": [5, 5, 6, 6], "rotation": 180, "texture": "#0"},
				"south": {"uv": [5, 5, 6, 6], "rotation": 180, "texture": "#0"},
				"west": {"uv": [5, 5, 6, 6], "rotation": 180, "texture": "#0"},
				"up": {"uv": [5, 5, 6, 6], "rotation": 180, "texture": "#0"},
				"down": {"uv": [5, 5, 6, 6], "rotation": 180, "texture": "#0"}
			}
		},
		{
			"from": [4, -4.66421, 2.34315],
			"to": [10, 1.33579, 8.34315],
			"rotation": {"angle": 22.5, "axis": "x", "origin": [7, -1.66421, 5.34315]},
			"faces": {
				"north": {"uv": [5, 5, 11, 11], "texture": "#0"},
				"east": {"uv": [5, 5, 11, 11], "texture": "#0"},
				"south": {"uv": [5, 5, 11, 11], "texture": "#0"},
				"west": {"uv": [5, 5, 11, 11], "texture": "#0"},
				"up": {"uv": [5, 5, 11, 11], "texture": "#0"},
				"down": {"uv": [5, 5, 11, 11], "texture": "#0"}
			}
		},
		{
			"from": [4, -1.66421, 10.34315],
			"to": [7, 1.33579, 13.34315],
			"rotation": {"angle": -22.5, "axis": "y", "origin": [5.5, -0.16421, 11.84315]},
			"faces": {
				"north": {"uv": [9, 5, 12, 8], "texture": "#0"},
				"east": {"uv": [9, 5, 12, 8], "texture": "#0"},
				"south": {"uv": [9, 5, 12, 8], "texture": "#0"},
				"west": {"uv": [9, 5, 12, 8], "texture": "#0"},
				"up": {"uv": [9, 5, 12, 8], "texture": "#0"},
				"down": {"uv": [9, 5, 12, 8], "texture": "#0"}
			}
		},
		{
			"from": [9, -2.66421, 8.34315],
			"to": [13, 1.33579, 12.34315],
			"rotation": {"angle": -45, "axis": "y", "origin": [12, -1.66421, 9.34315]},
			"faces": {
				"north": {"uv": [5, 5, 9, 9], "texture": "#0"},
				"east": {"uv": [5, 5, 9, 9], "texture": "#0"},
				"south": {"uv": [5, 5, 9, 9], "texture": "#0"},
				"west": {"uv": [5, 5, 9, 9], "texture": "#0"},
				"up": {"uv": [5, 5, 9, 9], "texture": "#0"},
				"down": {"uv": [5, 5, 9, 9], "texture": "#0"}
			}
		}
	],
	"display": {
		"thirdperson_righthand": {
			"translation": [0.25, 3, 1.25],
			"scale": [0.35, 0.35, 0.35]
		},
		"thirdperson_lefthand": {
			"translation": [0.25, 3, 1.25],
			"scale": [0.35, 0.35, 0.35]
		},
		"firstperson_righthand": {
			"translation": [0, 5.5, 2.25],
			"scale": [0.35, 0.35, 0.35]
		},
		"firstperson_lefthand": {
			"translation": [0, 5.5, 2.25],
			"scale": [0.35, 0.35, 0.35]
		},
		"ground": {
			"translation": [0, 4, 0],
			"scale": [0.5, 0.5, 0.5]
		},
		"gui": {
			"rotation": [30, 135, 0],
			"translation": [0, 6, 0],
			"scale": [0.75, 0.75, 0.75]
		},
		"fixed": {
			"rotation": [-90, 0, 0],
			"translation": [0.25, 0.75, -7],
			"scale": [0.75, 0.75, 0.75]
		}
	},
	"groups": [
		{
			"name": "Xion A",
			"origin": [8, -8, 8],
			"children": [0, 1, 2, 3]
		}
	]
}