{
  "type": "normal",
  "text":"Lorem ipsum dolor sit amet, consectetur adipiscing elit. Morbi euismod metus sem, eget accumsan nibh maximus quis. Nullam ut sem quis orci dapibus ultricies id eget neque. Vivamus in velit ante. Vivamus bibendum sem arcu, vitae laoreet nisl varius quis. In facilisis rhoncus augue sit amet ullamcorper. Fusce id pretium. "
}