{
	"lines":[
		"Flight Hazards (cont.)",
		"",
		"Exterior Bulkhead",
		" The Exterior shell of your Timeship can be vulnerable to the energies of the Time Vortex.",
		"Use the door control to ensure your exterior doors doesn't allow time energies to seep in."
	]
}