{
  "replace": false,
  "values": [
    "tardis:alabaster",
    "tardis:alabaster_stairs",
    "tardis:alabaster_slab",
    "tardis:alabaster_bookshelf",
    
    "tardis:roundel/alabaster",
    "tardis:roundel/alabaster_offset",
    "tardis:roundel/oak_planks_full",
    "tardis:roundel/oak_planks_offset",
    "tardis:roundel/spruce_planks_full",
    "tardis:roundel/spruce_planks_offset",
    "tardis:roundel/birch_planks_full",
    "tardis:roundel/birch_planks_offset",
    "tardis:roundel/jungle_planks_full",
    "tardis:roundel/jungle_planks_offset",
    "tardis:roundel/acacia_planks_full",
    "tardis:roundel/acacia_planks_offset",
    "tardis:roundel/dark_oak_planks_full",
    "tardis:roundel/dark_oak_planks_offset",
    "tardis:roundel/acacia_stripped_full",
    "tardis:roundel/acacia_stripped_offset",
    "tardis:roundel/birch_stripped_full",
    "tardis:roundel/birch_stripped_offset",
    "tardis:roundel/dark_oak_stripped_full",
    "tardis:roundel/dark_oak_stripped_offset",
    "tardis:roundel/jungle_stripped_full",
    "tardis:roundel/jungle_stripped_offset",
    "tardis:roundel/oak_stripped_full",
    "tardis:roundel/oak_stripped_offset",
    "tardis:roundel/spruce_stripped_full",
    "tardis:roundel/spruce_stripped_offset",
    "tardis:roundel/warped_stripped_full",
    "tardis:roundel/warped_stripped_offset",
    "tardis:roundel/crimson_stripped_full",
    "tardis:roundel/crimson_stripped_offset",
    "tardis:roundel/white_concrete_full",
    "tardis:roundel/white_concrete_offset",
    "tardis:roundel/orange_concrete_full",
    "tardis:roundel/orange_concrete_offset",
    "tardis:roundel/magenta_concrete_full",
    "tardis:roundel/magenta_concrete_offset",
    "tardis:roundel/light_blue_concrete_full",
    "tardis:roundel/light_blue_concrete_offset",
    "tardis:roundel/yellow_concrete_full",
    "tardis:roundel/yellow_concrete_offset",
    "tardis:roundel/lime_concrete_full",
    "tardis:roundel/lime_concrete_offset",
    "tardis:roundel/pink_concrete_full",
    "tardis:roundel/pink_concrete_offset",
    "tardis:roundel/gray_concrete_full",
    "tardis:roundel/gray_concrete_offset",
    "tardis:roundel/light_gray_concrete_full",
    "tardis:roundel/light_gray_concrete_offset",
    "tardis:roundel/cyan_concrete_full",
    "tardis:roundel/cyan_concrete_offset",
    "tardis:roundel/purple_concrete_full",
    "tardis:roundel/purple_concrete_offset",
    "tardis:roundel/blue_concrete_full",
    "tardis:roundel/blue_concrete_offset",
    "tardis:roundel/brown_concrete_full",
    "tardis:roundel/brown_concrete_offset",
    "tardis:roundel/green_concrete_full",
    "tardis:roundel/green_concrete_offset",
    "tardis:roundel/red_concrete_full",
    "tardis:roundel/red_concrete_offset",
    "tardis:roundel/black_concrete_full",
    "tardis:roundel/black_concrete_offset",
    "tardis:roundel/white_terracotta_full",
    "tardis:roundel/white_terracotta_offset",
    "tardis:roundel/orange_terracotta_full",
    "tardis:roundel/orange_terracotta_offset",
    "tardis:roundel/magenta_terracotta_full",
    "tardis:roundel/magenta_terracotta_offset",
    "tardis:roundel/light_blue_terracotta_full",
    "tardis:roundel/light_blue_terracotta_offset",
    "tardis:roundel/yellow_terracotta_full",
    "tardis:roundel/yellow_terracotta_offset",
    "tardis:roundel/lime_terracotta_full",
    "tardis:roundel/lime_terracotta_offset",
    "tardis:roundel/pink_terracotta_full",
    "tardis:roundel/pink_terracotta_offset",
    "tardis:roundel/gray_terracotta_full",
    "tardis:roundel/gray_terracotta_offset",
    "tardis:roundel/light_gray_terracotta_full",
    "tardis:roundel/light_gray_terracotta_offset",
    "tardis:roundel/cyan_terracotta_full",
    "tardis:roundel/cyan_terracotta_offset",
    "tardis:roundel/purple_terracotta_full",
    "tardis:roundel/purple_terracotta_offset",
    "tardis:roundel/blue_terracotta_full",
    "tardis:roundel/blue_terracotta_offset",
    "tardis:roundel/brown_terracotta_full",
    "tardis:roundel/brown_terracotta_offset",
    "tardis:roundel/green_terracotta_full",
    "tardis:roundel/green_terracotta_offset",
    "tardis:roundel/red_terracotta_full",
    "tardis:roundel/red_terracotta_offset",
    "tardis:roundel/black_terracotta_full",
    "tardis:roundel/black_terracotta_offset",
    "tardis:roundel/quartz",
    "tardis:roundel/quartz_pillar_full",
    "tardis:roundel/quartz_pillar_offset",
    "tardis:roundel/chiseled_quartz_full",
    "tardis:roundel/chiseled_quartz_offset",
    "tardis:roundel/coralised",
    "tardis:roundel/coral_divider",
    "tardis:roundel/coralised_large",
    "tardis:roundel/coralised_small",
    "tardis:roundel/stone_bricks_full",
    "tardis:roundel/stone_bricks_offset",
    "tardis:roundel/smooth_stone_full",
    "tardis:roundel/smooth_stone_offset",
    "tardis:roundel/polished_andesite_full",
    "tardis:roundel/polished_andesite_offset",
    "tardis:roundel/polished_granite_full",
    "tardis:roundel/polished_granite_offset",
    "tardis:roundel/polished_diorite_full",
    "tardis:roundel/polished_diorite_offset",
    "tardis:roundel/cut_red_sandstone_full",
    "tardis:roundel/cut_red_sandstone_offset",
    "tardis:roundel/cut_sandstone_full",
    "tardis:roundel/cut_sandstone_offset",
    "tardis:roundel/sandstone_full",
    "tardis:roundel/sandstone_offset",
    "tardis:roundel/end_stone_bricks_full",
    "tardis:roundel/end_stone_bricks_offset",
    "tardis:roundel/end_stone_full",
    "tardis:roundel/end_stone_offset",
    "tardis:roundel/purpur_bricks_full",
    "tardis:roundel/purpur_bricks_offset",
    "tardis:roundel/purpur_pillar_full",
    "tardis:roundel/purpur_pillar_offset",
    "tardis:roundel/nether_bricks_full",
    "tardis:roundel/nether_bricks_offset",
    "tardis:roundel/nether_wart_block_full",
    "tardis:roundel/nether_wart_block_offset",
    "tardis:roundel/red_nether_bricks_full",
    "tardis:roundel/red_nether_bricks_offset",
    "tardis:roundel/gilded_blackstone_full",
    "tardis:roundel/gilded_blackstone_offset",
    "tardis:roundel/polished_basalt_full",
    "tardis:roundel/polished_basalt_offset",
    "tardis:roundel/polished_blackstone_bricks_full",
    "tardis:roundel/polished_blackstone_bricks_offset",
    "tardis:roundel/polished_blackstone_full",
    "tardis:roundel/polished_blackstone_offset",
    "tardis:roundel/prismarine_bricks_full",
    "tardis:roundel/prismarine_bricks_offset",
    "tardis:roundel/bone_block_full",
    "tardis:roundel/bone_block_offset",
    "tardis:roundel/tech_wall_lamp",
    "tardis:roundel/tech_wall_lamp_offset",
	
    "tardis:ebony_bookshelf",
    "tardis:tech_strut",
    "tardis:tungsten_plate_slab",
    "tardis:tungsten_pipes_slab",
    "tardis:tungsten_pattern_slab",
    "tardis:tungsten_slab",
    "tardis:tungsten_plate_stairs",
    "tardis:tungsten_pipes_stairs",
    "tardis:tungsten_pattern_stairs",
    "tardis:tungsten_stairs",
    "tardis:holo_ladders",
    "tardis:metal_grate_slab",
    "tardis:metal_grate_stairs",
    "tardis:metal_grate_trapdoor",
    "tardis:steel_grate_frame",
    "tardis:steel_grate_frame_offset",
    "tardis:blue_concrete_slab",
    "tardis:gallifreyan_yellow_slab",
    "tardis:yellow_crystal",
    "tardis:yellow_crystal_slab",
    "tardis:yellow_crystal_stairs",
    "tardis:blue_pillar",
    "tardis:foam_pipes",
    "tardis:three_point_lamp",
    "tardis:tardis_engine",
    "tardis:anti_grav",
    "tardis:corridor_spawn",
    "tardis:eye_monitor",
    "tardis:rca_monitor",
    "tardis:rotate_monitor",
    "tardis:tungsten_pattern",
    "tardis:tungsten_pipes",
    "tardis:tungsten_plate",
    "tardis:tungsten_plate_small",
    "tardis:tungsten_blue_runner_lights",
    "tardis:tungsten",
    "tardis:tungsten_screen",
    "tardis:wire_hang",
    "tardis:comfy_chair_red",
    "tardis:comfy_chair_green",
    "tardis:crash_chair",
    "tardis:crash_chair_wood",
    "tardis:crash_chair_red",
    "tardis:blinking_lights",
    "tardis:spinny_thing",
    "tardis:plaque",
    "tardis:chemlight",
    "tardis:chemlamp",
    "tardis:dynamic_monitor",
    "tardis:steam_grate"
  ]
}