{
    "textures": {
        "particle": "#wall"
    },
    "elements": [
        {   "from": [ 4, 0, 4 ],
            "to": [ 12, 16, 12 ],
            "faces": {
                "down":  { "uv": [ 0, 0, 16, 16 ], "texture": "#up", "cullface": "down" },
                "up":    { "uv": [ 0, 0, 16, 16 ], "texture": "#up", "cullface": "up" },
                "north": { "uv": [ 0, 0, 16,  8 ], "texture": "#wall"},
                "south": { "uv": [ 0, 0, 16,  8 ], "texture": "#wall"},
                "west":  { "uv": [ 0, 0, 16,  8 ], "texture": "#wall"},
                "east":  { "uv": [ 0, 0, 16,  8 ], "texture": "#wall"}
            }
        }
    ]
}