{
	"lines":[
		"Artron Converter",
		"",
		" This block can be used to covert Forge Energy to Artron Units, and vice versa.",
		" -Push: Uses Artron to create FE",
		" -Pull: Uses FE to create AU",
		"Rate: 1AU / 100FE and 1000FE to 1 AU"
	]
}