{
	"lines":[
		"Flight Hazards (cont.)"
		,""
		,"If Pilot A fails:"
		," -A takes damage and crash land."
		," -Pilot B will take damage but not crash."
		,"If Pilot A succeeds:"
		," -Receive Event sent to B"
		," -A waits for B's results"
	]
}