{
	"type": "tardis:quantiscope",
	"repair":false,
	"ingredients":[
		{"item":"minecraft:clock"},
		{"item":"minecraft:compass"},
		{"item":"minecraft:ender_eye"},
		{"item":"tardis:xion_crystal"}
	],
	"result":{
		"item":"tardis:subsystem/nav_com"
	}
}