{
  "replace": false,
  "values": [
    "tardis:multiblock",
    "tardis:bottom_exterior",
    "tardis:exterior_clock",
    "tardis:exterior_steampunk",
    "tardis:exterior_trunk",
    "tardis:exterior_telephone",
    "tardis:exterior_police_box",
    "tardis:exterior_fortune",
    "tardis:exterior_modern_police_box",
    "tardis:exterior_safe",
    "tardis:exterior_tt_capsule",
    "tardis:exterior_tt2020",
    "tardis:exterior_japan",
    "tardis:exterior_aperture",
    "tardis:exterior_disguise",
    "tardis:roundel/alabaster",
    "tardis:roundel/alabaster_offset",
    "tardis:roundel/oak_planks_full",
    "tardis:roundel/oak_planks_offset",
    "tardis:roundel/spruce_planks_full",
    "tardis:roundel/spruce_planks_offset",
    "tardis:roundel/birch_planks_full",
    "tardis:roundel/birch_planks_offset",
    "tardis:roundel/jungle_planks_full",
    "tardis:roundel/jungle_planks_offset",
    "tardis:roundel/acacia_planks_full",
    "tardis:roundel/acacia_planks_offset",
    "tardis:roundel/dark_oak_planks_full",
    "tardis:roundel/dark_oak_planks_offset",
    "tardis:roundel/acacia_stripped_full",
    "tardis:roundel/acacia_stripped_offset",
    "tardis:roundel/birch_stripped_full",
    "tardis:roundel/birch_stripped_offset",
    "tardis:roundel/dark_oak_stripped_full",
    "tardis:roundel/dark_oak_stripped_offset",
    "tardis:roundel/jungle_stripped_full",
    "tardis:roundel/jungle_stripped_offset",
    "tardis:roundel/oak_stripped_full",
    "tardis:roundel/oak_stripped_offset",
    "tardis:roundel/spruce_stripped_full",
    "tardis:roundel/spruce_stripped_offset",
    "tardis:roundel/warped_stripped_full",
    "tardis:roundel/warped_stripped_offset",
    "tardis:roundel/crimson_stripped_full",
    "tardis:roundel/crimson_stripped_offset",
    "tardis:roundel/white_concrete_full",
    "tardis:roundel/white_concrete_offset",
    "tardis:roundel/orange_concrete_full",
    "tardis:roundel/orange_concrete_offset",
    "tardis:roundel/magenta_concrete_full",
    "tardis:roundel/magenta_concrete_offset",
    "tardis:roundel/light_blue_concrete_full",
    "tardis:roundel/light_blue_concrete_offset",
    "tardis:roundel/yellow_concrete_full",
    "tardis:roundel/yellow_concrete_offset",
    "tardis:roundel/lime_concrete_full",
    "tardis:roundel/lime_concrete_offset",
    "tardis:roundel/pink_concrete_full",
    "tardis:roundel/pink_concrete_offset",
    "tardis:roundel/gray_concrete_full",
    "tardis:roundel/gray_concrete_offset",
    "tardis:roundel/light_gray_concrete_full",
    "tardis:roundel/light_gray_concrete_offset",
    "tardis:roundel/cyan_concrete_full",
    "tardis:roundel/cyan_concrete_offset",
    "tardis:roundel/purple_concrete_full",
    "tardis:roundel/purple_concrete_offset",
    "tardis:roundel/blue_concrete_full",
    "tardis:roundel/blue_concrete_offset",
    "tardis:roundel/brown_concrete_full",
    "tardis:roundel/brown_concrete_offset",
    "tardis:roundel/green_concrete_full",
    "tardis:roundel/green_concrete_offset",
    "tardis:roundel/red_concrete_full",
    "tardis:roundel/red_concrete_offset",
    "tardis:roundel/black_concrete_full",
    "tardis:roundel/black_concrete_offset",
    "tardis:roundel/white_terracotta_full",
    "tardis:roundel/white_terracotta_offset",
    "tardis:roundel/orange_terracotta_full",
    "tardis:roundel/orange_terracotta_offset",
    "tardis:roundel/magenta_terracotta_full",
    "tardis:roundel/magenta_terracotta_offset",
    "tardis:roundel/light_blue_terracotta_full",
    "tardis:roundel/light_blue_terracotta_offset",
    "tardis:roundel/yellow_terracotta_full",
    "tardis:roundel/yellow_terracotta_offset",
    "tardis:roundel/lime_terracotta_full",
    "tardis:roundel/lime_terracotta_offset",
    "tardis:roundel/pink_terracotta_full",
    "tardis:roundel/pink_terracotta_offset",
    "tardis:roundel/gray_terracotta_full",
    "tardis:roundel/gray_terracotta_offset",
    "tardis:roundel/light_gray_terracotta_full",
    "tardis:roundel/light_gray_terracotta_offset",
    "tardis:roundel/cyan_terracotta_full",
    "tardis:roundel/cyan_terracotta_offset",
    "tardis:roundel/purple_terracotta_full",
    "tardis:roundel/purple_terracotta_offset",
    "tardis:roundel/blue_terracotta_full",
    "tardis:roundel/blue_terracotta_offset",
    "tardis:roundel/brown_terracotta_full",
    "tardis:roundel/brown_terracotta_offset",
    "tardis:roundel/green_terracotta_full",
    "tardis:roundel/green_terracotta_offset",
    "tardis:roundel/red_terracotta_full",
    "tardis:roundel/red_terracotta_offset",
    "tardis:roundel/black_terracotta_full",
    "tardis:roundel/black_terracotta_offset",
    "tardis:roundel/quartz",
    "tardis:roundel/quartz_pillar_full",
    "tardis:roundel/quartz_pillar_offset",
    "tardis:roundel/chiseled_quartz_full",
    "tardis:roundel/chiseled_quartz_offset",
    "tardis:roundel/coralised",
    "tardis:roundel/coral_divider",
    "tardis:roundel/coralised_large",
    "tardis:roundel/coralised_small",
    "tardis:roundel/stone_bricks_full",
    "tardis:roundel/stone_bricks_offset",
    "tardis:roundel/smooth_stone_full",
    "tardis:roundel/smooth_stone_offset",
    "tardis:roundel/polished_andesite_full",
    "tardis:roundel/polished_andesite_offset",
    "tardis:roundel/polished_granite_full",
    "tardis:roundel/polished_granite_offset",
    "tardis:roundel/polished_diorite_full",
    "tardis:roundel/polished_diorite_offset",
    "tardis:roundel/cut_red_sandstone_full",
    "tardis:roundel/cut_red_sandstone_offset",
    "tardis:roundel/cut_sandstone_full",
    "tardis:roundel/cut_sandstone_offset",
    "tardis:roundel/sandstone_full",
    "tardis:roundel/sandstone_offset",
    "tardis:roundel/end_stone_bricks_full",
    "tardis:roundel/end_stone_bricks_offset",
    "tardis:roundel/end_stone_full",
    "tardis:roundel/end_stone_offset",
    "tardis:roundel/purpur_bricks_full",
    "tardis:roundel/purpur_bricks_offset",
    "tardis:roundel/purpur_pillar_full",
    "tardis:roundel/purpur_pillar_offset",
    "tardis:roundel/nether_bricks_full",
    "tardis:roundel/nether_bricks_offset",
    "tardis:roundel/nether_wart_block_full",
    "tardis:roundel/nether_wart_block_offset",
    "tardis:roundel/red_nether_bricks_full",
    "tardis:roundel/red_nether_bricks_offset",
    "tardis:roundel/gilded_blackstone_full",
    "tardis:roundel/gilded_blackstone_offset",
    "tardis:roundel/polished_basalt_full",
    "tardis:roundel/polished_basalt_offset",
    "tardis:roundel/polished_blackstone_bricks_full",
    "tardis:roundel/polished_blackstone_bricks_offset",
    "tardis:roundel/polished_blackstone_full",
    "tardis:roundel/polished_blackstone_offset",
    "tardis:roundel/prismarine_bricks_full",
    "tardis:roundel/prismarine_bricks_offset",
    "tardis:roundel/bone_block_full",
    "tardis:roundel/bone_block_offset",
    "tardis:roundel/tech_wall_lamp",
    "tardis:roundel/tech_wall_lamp_offset",
    "tardis:tungsten_blue_runner_lights",
    "tardis:broken_exterior"
  ]
}