{
  "parent": "tardis:exterior/root",
  "display": {
    "icon": {
      "item": "minecraft:snowball"
    },
    "title": {
      "translate": "advancements.tardis.exterior.safe"
    },
    "description": {
      "translate": "advancements.tardis.exterior.safe.desc"
    },
    "frame": "task",
    "show_toast": true,
    "announce_to_chat": true,
    "hidden": false
  },
  "criteria": {
    "stronghold": {
      "trigger": "minecraft:location",
      "conditions": {
        "feature": "stronghold"
      }
    }
  },
  "requirements": [
    [
      "stronghold"
    ]
  ]
}