{
	"lines":[
	"Chameleon Circuit"
	,""
	," An optional component required to allow the outer-plasmic shell to change its appearance."
	,""
	,"It is repaired by combining it with an Exotronic Circuit in the Quantiscope."
	]
}