{
 "parent": "tardis:interior/root",
  "display": {
    "icon": {
      "item": "minecraft:iron_block"
    },
    "title": {
      "translate": "advancements.tardis.interior.panamax"
    },
    "description": {
      "translate": "advancements.tardis.interior.panamax.desc"
    },
    "frame": "task",
    "show_toast": true,
    "announce_to_chat": true,
    "hidden": false
  },
  "criteria": {
    "hero": {
      "trigger": "minecraft:hero_of_the_village"
    },
    "panamax":{
      "trigger": "panamax"
    }
  },
  "requirements": [
    [
      "hero"
    ],
    [
      "panamax"
    ]
  ]
}