{
	"lines":[
	"Flight"
	,""
	," This section is for the controls and what they do. For your specific capsule and it's layout, please shadow the Holographic Pilot for a few flights (NOT IMPLEMENTED)"
	]
}