{
"skeleton": { "hash": "tFfkBY4bdnUg+u8mH1M0lcE8Hos", "spine": "3.6.53", "width": 234, "height": 236, "images": "./images/" },
"bones": [
	{ "name": "root" },
	{ "name": "Bonus", "parent": "root", "x": -0.3, "y": 3.38 },
	{ "name": "Bonus3", "parent": "Bonus", "x": -7.02, "y": 22.79 },
	{ "name": "Layer 4", "parent": "Bonus", "x": 38.84, "y": 31.68 },
	{ "name": "FXquat", "parent": "Layer 4", "x": -15.18, "y": 15.88 }
],
"slots": [
	{ "name": "Layer 4", "bone": "Layer 4", "attachment": "Layer 4" },
	{ "name": "Bonus", "bone": "Bonus3", "attachment": "Bonus" },
	{ "name": "FXQuat", "bone": "FXquat", "attachment": "FX/Set_00001" }
],
"skins": {
	"default": {
		"Bonus": {
			"Bonus": { "x": 1.12, "y": 3.61, "width": 141, "height": 36 }
		},
		"FXQuat": {
			"FX/Set_00001": { "width": 234, "height": 236 },
			"FX/Set_00002": { "width": 234, "height": 236 },
			"FX/Set_00003": { "width": 234, "height": 236 },
			"FX/Set_00004": { "width": 234, "height": 236 },
			"FX/Set_00005": { "width": 234, "height": 236 },
			"FX/Set_00006": { "width": 234, "height": 236 },
			"FX/Set_00007": { "width": 234, "height": 236 },
			"FX/Set_00008": { "width": 234, "height": 236 },
			"FX/Set_00009": { "width": 234, "height": 236 },
			"FX/Set_00010": { "width": 234, "height": 236 },
			"FX/Set_00011": { "width": 234, "height": 236 },
			"FX/Set_00012": { "width": 234, "height": 236 },
			"FX/Set_00013": { "width": 234, "height": 236 },
			"FX/Set_00014": { "width": 234, "height": 236 },
			"FX/Set_00015": { "width": 234, "height": 236 },
			"FX/Set_00016": { "width": 234, "height": 236 }
		},
		"Layer 4": {
			"Layer 4": { "x": -46.25, "y": 44.23, "width": 132, "height": 115 }
		}
	}
},
"animations": {
	"animation": {
		"slots": {
			"FXQuat": {
				"attachment": [
					{ "time": 1, "name": "FX/Set_00001" },
					{ "time": 1.0333, "name": "FX/Set_00002" },
					{ "time": 1.0667, "name": "FX/Set_00003" },
					{ "time": 1.1, "name": "FX/Set_00004" },
					{ "time": 1.1333, "name": "FX/Set_00005" },
					{ "time": 1.1667, "name": "FX/Set_00006" },
					{ "time": 1.2, "name": "FX/Set_00007" },
					{ "time": 1.2333, "name": "FX/Set_00008" },
					{ "time": 1.2667, "name": "FX/Set_00009" },
					{ "time": 1.3, "name": "FX/Set_00010" },
					{ "time": 1.3333, "name": "FX/Set_00011" },
					{ "time": 1.3667, "name": "FX/Set_00012" },
					{ "time": 1.4, "name": "FX/Set_00013" },
					{ "time": 1.4333, "name": "FX/Set_00014" },
					{ "time": 1.4667, "name": "FX/Set_00015" },
					{ "time": 1.5, "name": "FX/Set_00016" },
					{ "time": 1.5333, "name": "FX/Set_00001" },
					{ "time": 1.5667, "name": "FX/Set_00002" },
					{ "time": 1.6, "name": "FX/Set_00003" },
					{ "time": 1.6333, "name": "FX/Set_00004" },
					{ "time": 1.6667, "name": "FX/Set_00005" },
					{ "time": 1.7, "name": "FX/Set_00006" },
					{ "time": 1.7333, "name": "FX/Set_00007" },
					{ "time": 1.7667, "name": "FX/Set_00008" },
					{ "time": 1.8, "name": "FX/Set_00009" },
					{ "time": 1.8333, "name": "FX/Set_00010" },
					{ "time": 1.8667, "name": "FX/Set_00011" },
					{ "time": 1.9, "name": "FX/Set_00012" },
					{ "time": 1.9333, "name": "FX/Set_00013" },
					{ "time": 1.9667, "name": "FX/Set_00014" },
					{ "time": 2, "name": "FX/Set_00015" }
				]
			}
		},
		"bones": {
			"Bonus3": {
				"scale": [
					{
						"time": 0,
						"x": 1,
						"y": 1,
						"curve": [ 0.25, 0, 0.75, 1 ]
					},
					{
						"time": 0.1,
						"x": 1.157,
						"y": 1.157,
						"curve": [ 0.25, 0, 0.75, 1 ]
					},
					{
						"time": 0.2,
						"x": 1,
						"y": 1,
						"curve": [ 0.25, 0, 0.75, 1 ]
					},
					{
						"time": 0.3,
						"x": 1.157,
						"y": 1.157,
						"curve": [ 0.25, 0, 0.75, 1 ]
					},
					{
						"time": 0.4,
						"x": 1,
						"y": 1,
						"curve": [ 0.25, 0, 0.75, 1 ]
					},
					{
						"time": 0.5,
						"x": 1.157,
						"y": 1.157,
						"curve": [ 0.25, 0, 0.75, 1 ]
					},
					{
						"time": 0.6,
						"x": 1,
						"y": 1,
						"curve": [ 0.25, 0, 0.75, 1 ]
					},
					{
						"time": 0.7,
						"x": 1.157,
						"y": 1.157,
						"curve": [ 0.25, 0, 0.75, 1 ]
					},
					{
						"time": 0.8,
						"x": 1,
						"y": 1,
						"curve": [ 0.25, 0, 0.75, 1 ]
					},
					{
						"time": 0.9,
						"x": 1.157,
						"y": 1.157,
						"curve": [ 0.25, 0, 0.75, 1 ]
					},
					{
						"time": 1,
						"x": 1,
						"y": 1,
						"curve": [ 0.25, 0, 0.75, 1 ]
					},
					{
						"time": 1.1,
						"x": 1.157,
						"y": 1.157,
						"curve": [ 0.25, 0, 0.75, 1 ]
					},
					{
						"time": 1.2,
						"x": 1,
						"y": 1,
						"curve": [ 0.25, 0, 0.75, 1 ]
					},
					{
						"time": 1.3,
						"x": 1.157,
						"y": 1.157,
						"curve": [ 0.25, 0, 0.75, 1 ]
					},
					{
						"time": 1.4,
						"x": 1,
						"y": 1,
						"curve": [ 0.25, 0, 0.75, 1 ]
					},
					{
						"time": 1.5,
						"x": 1.157,
						"y": 1.157,
						"curve": [ 0.25, 0, 0.75, 1 ]
					},
					{
						"time": 1.6,
						"x": 1,
						"y": 1,
						"curve": [ 0.25, 0, 0.75, 1 ]
					},
					{
						"time": 1.7,
						"x": 1.157,
						"y": 1.157,
						"curve": [ 0.25, 0, 0.75, 1 ]
					},
					{
						"time": 1.8,
						"x": 1,
						"y": 1,
						"curve": [ 0.25, 0, 0.75, 1 ]
					},
					{
						"time": 1.9,
						"x": 1.157,
						"y": 1.157,
						"curve": [ 0.25, 0, 0.75, 1 ]
					},
					{ "time": 2, "x": 1, "y": 1 }
				]
			},
			"Layer 4": {
				"rotate": [
					{
						"time": 0,
						"angle": 0,
						"curve": [ 0.25, 0, 0.385, 1 ]
					},
					{
						"time": 0.2333,
						"angle": 8.86,
						"curve": [ 0.52, 0, 0.75, 1 ]
					},
					{
						"time": 0.5,
						"angle": 0,
						"curve": [ 0.25, 0, 0.337, 1 ]
					},
					{
						"time": 0.7333,
						"angle": 8.86,
						"curve": [ 0.734, 0, 0.75, 1 ]
					},
					{ "time": 1, "angle": 0 }
				],
				"translate": [
					{
						"time": 0,
						"x": 0,
						"y": 0,
						"curve": [ 0.25, 0, 0.385, 1 ]
					},
					{
						"time": 0.2333,
						"x": 0,
						"y": -9.55,
						"curve": [ 0.52, 0, 0.75, 1 ]
					},
					{
						"time": 0.5,
						"x": 0,
						"y": 0,
						"curve": [ 0.25, 0, 0.337, 1 ]
					},
					{
						"time": 0.7333,
						"x": 0,
						"y": -9.55,
						"curve": [ 0.52, 0, 0.75, 1 ]
					},
					{ "time": 1, "x": 0, "y": 0 }
				],
				"shear": [
					{
						"time": 0,
						"x": -17.94,
						"y": -17.81,
						"curve": [ 0.25, 0, 0.385, 1 ]
					},
					{
						"time": 0.2333,
						"x": -19.35,
						"y": 41.94,
						"curve": [ 0.52, 0, 0.75, 1 ]
					},
					{
						"time": 0.5,
						"x": -17.94,
						"y": -17.81,
						"curve": [ 0.25, 0, 0.337, 1 ]
					},
					{
						"time": 0.7333,
						"x": -19.35,
						"y": 41.94,
						"curve": [ 0.734, 0, 0.75, 1 ]
					},
					{ "time": 1, "x": -17.94, "y": -17.81 }
				]
			},
			"FXquat": {
				"translate": [
					{ "time": 0, "x": -43.38, "y": 42.52 }
				],
				"scale": [
					{ "time": 0, "x": 1, "y": 0.689 }
				]
			}
		}
	}
}
}