
NgoKhong.png
size: 2048,512
format: RGBA8888
filter: Linear,Linear
repeat: none
Bodymk
  rotate: true
  xy: 314, 351
  size: 158, 332
  orig: 158, 332
  offset: 0, 0
  index: -1
FX/11 (1)
  rotate: false
  xy: 679, 34
  size: 61, 61
  orig: 61, 61
  offset: 0, 0
  index: -1
FX/11 (10)
  rotate: false
  xy: 753, 128
  size: 61, 61
  orig: 61, 61
  offset: 0, 0
  index: -1
FX/11 (11)
  rotate: false
  xy: 753, 65
  size: 61, 61
  orig: 61, 61
  offset: 0, 0
  index: -1
FX/11 (12)
  rotate: false
  xy: 742, 2
  size: 61, 61
  orig: 61, 61
  offset: 0, 0
  index: -1
FX/11 (13)
  rotate: false
  xy: 824, 203
  size: 61, 57
  orig: 61, 57
  offset: 0, 0
  index: -1
FX/11 (14)
  rotate: false
  xy: 891, 210
  size: 61, 61
  orig: 61, 61
  offset: 0, 0
  index: -1
FX/11 (15)
  rotate: false
  xy: 954, 203
  size: 61, 61
  orig: 61, 61
  offset: 0, 0
  index: -1
FX/11 (2)
  rotate: false
  xy: 1017, 203
  size: 61, 61
  orig: 61, 61
  offset: 0, 0
  index: -1
FX/11 (3)
  rotate: true
  xy: 1574, 193
  size: 61, 47
  orig: 61, 47
  offset: 0, 0
  index: -1
FX/11 (4)
  rotate: false
  xy: 1080, 198
  size: 61, 56
  orig: 61, 56
  offset: 0, 0
  index: -1
FX/11 (5)
  rotate: false
  xy: 1143, 193
  size: 61, 61
  orig: 61, 61
  offset: 0, 0
  index: -1
FX/11 (6)
  rotate: false
  xy: 1206, 193
  size: 61, 61
  orig: 61, 61
  offset: 0, 0
  index: -1
FX/11 (7)
  rotate: false
  xy: 1269, 193
  size: 61, 61
  orig: 61, 61
  offset: 0, 0
  index: -1
FX/11 (8)
  rotate: false
  xy: 1332, 193
  size: 61, 61
  orig: 61, 61
  offset: 0, 0
  index: -1
FX/11 (9)
  rotate: false
  xy: 1395, 193
  size: 61, 61
  orig: 61, 61
  offset: 0, 0
  index: -1
FX/40 (1)
  rotate: false
  xy: 1120, 383
  size: 127, 126
  orig: 127, 126
  offset: 0, 0
  index: -1
FX/40 (10)
  rotate: false
  xy: 1249, 383
  size: 127, 126
  orig: 127, 126
  offset: 0, 0
  index: -1
FX/40 (11)
  rotate: false
  xy: 1378, 383
  size: 127, 126
  orig: 127, 126
  offset: 0, 0
  index: -1
FX/40 (12)
  rotate: false
  xy: 498, 224
  size: 127, 125
  orig: 127, 125
  offset: 0, 0
  index: -1
FX/40 (13)
  rotate: true
  xy: 240, 135
  size: 127, 125
  orig: 127, 125
  offset: 0, 0
  index: -1
FX/40 (14)
  rotate: false
  xy: 240, 8
  size: 126, 125
  orig: 126, 125
  offset: 0, 0
  index: -1
FX/40 (15)
  rotate: false
  xy: 1507, 256
  size: 126, 125
  orig: 126, 125
  offset: 0, 0
  index: -1
FX/40 (16)
  rotate: false
  xy: 1635, 255
  size: 126, 126
  orig: 126, 126
  offset: 0, 0
  index: -1
FX/40 (17)
  rotate: false
  xy: 1507, 383
  size: 127, 126
  orig: 127, 126
  offset: 0, 0
  index: -1
FX/40 (18)
  rotate: false
  xy: 1636, 383
  size: 127, 126
  orig: 127, 126
  offset: 0, 0
  index: -1
FX/40 (19)
  rotate: false
  xy: 1765, 383
  size: 127, 126
  orig: 127, 126
  offset: 0, 0
  index: -1
FX/40 (2)
  rotate: false
  xy: 1894, 383
  size: 127, 126
  orig: 127, 126
  offset: 0, 0
  index: -1
FX/40 (20)
  rotate: false
  xy: 367, 141
  size: 127, 126
  orig: 127, 126
  offset: 0, 0
  index: -1
FX/40 (21)
  rotate: false
  xy: 1120, 256
  size: 127, 125
  orig: 127, 125
  offset: 0, 0
  index: -1
FX/40 (22)
  rotate: false
  xy: 1891, 256
  size: 126, 125
  orig: 126, 125
  offset: 0, 0
  index: -1
FX/40 (3)
  rotate: false
  xy: 1249, 256
  size: 127, 125
  orig: 127, 125
  offset: 0, 0
  index: -1
FX/40 (4)
  rotate: false
  xy: 1378, 256
  size: 127, 125
  orig: 127, 125
  offset: 0, 0
  index: -1
FX/40 (5)
  rotate: false
  xy: 627, 224
  size: 126, 125
  orig: 126, 125
  offset: 0, 0
  index: -1
FX/40 (6)
  rotate: false
  xy: 625, 97
  size: 126, 125
  orig: 126, 125
  offset: 0, 0
  index: -1
FX/40 (7)
  rotate: false
  xy: 1763, 255
  size: 126, 126
  orig: 126, 126
  offset: 0, 0
  index: -1
FX/40 (8)
  rotate: true
  xy: 368, 12
  size: 127, 126
  orig: 127, 126
  offset: 0, 0
  index: -1
FX/40 (9)
  rotate: false
  xy: 496, 96
  size: 127, 126
  orig: 127, 126
  offset: 0, 0
  index: -1
FXMK
  rotate: false
  xy: 2, 25
  size: 236, 237
  orig: 236, 237
  offset: 0, 0
  index: -1
HandMK
  rotate: false
  xy: 496, 13
  size: 108, 81
  orig: 108, 81
  offset: 0, 0
  index: -1
HeadMK
  rotate: false
  xy: 755, 245
  size: 67, 108
  orig: 67, 108
  offset: 0, 0
  index: -1
Rau1
  rotate: true
  xy: 891, 273
  size: 48, 97
  orig: 48, 97
  offset: 0, 0
  index: -1
StoneMK
  rotate: false
  xy: 2, 264
  size: 310, 245
  orig: 310, 245
  offset: 0, 0
  index: -1
capeMK
  rotate: true
  xy: 891, 323
  size: 186, 227
  orig: 186, 227
  offset: 0, 0
  index: -1
dressmk
  rotate: false
  xy: 1458, 193
  size: 56, 61
  orig: 56, 61
  offset: 0, 0
  index: -1
dressmk2
  rotate: false
  xy: 606, 21
  size: 71, 73
  orig: 71, 73
  offset: 0, 0
  index: -1
dressmk3
  rotate: false
  xy: 1623, 193
  size: 41, 60
  orig: 41, 60
  offset: 0, 0
  index: -1
gay
  rotate: true
  xy: 648, 355
  size: 154, 241
  orig: 154, 241
  offset: 0, 0
  index: -1
hand2Mk
  rotate: false
  xy: 1516, 193
  size: 56, 61
  orig: 56, 61
  offset: 0, 0
  index: -1
hand3MK
  rotate: true
  xy: 755, 191
  size: 52, 63
  orig: 52, 63
  offset: 0, 0
  index: -1
hand4mk
  rotate: false
  xy: 1081, 288
  size: 24, 33
  orig: 24, 33
  offset: 0, 0
  index: -1
hand5mk
  rotate: true
  xy: 990, 266
  size: 55, 89
  orig: 55, 89
  offset: 0, 0
  index: -1
rau2
  rotate: false
  xy: 824, 262
  size: 65, 91
  orig: 65, 91
  offset: 0, 0
  index: -1
shadowMK
  rotate: false
  xy: 314, 269
  size: 182, 80
  orig: 182, 80
  offset: 0, 0
  index: -1
