{
"skeleton": { "hash": "S7JxzVT6p6hFOc5mPEKfv9wyo30", "spine": "3.6.53", "width": 100, "height": 107, "images": "./images/" },
"bones": [
	{ "name": "root" },
	{ "name": "Layer 8 copy", "parent": "root", "x": 1.44, "y": 25.91 }
],
"slots": [
	{ "name": "Layer 8 copy", "bone": "Layer 8 copy", "attachment": "Layer 8 copy" }
],
"skins": {
	"default": {
		"Layer 8 copy": {
			"Layer 8 copy": { "x": 7.15, "y": 17.44, "width": 100, "height": 107 }
		}
	}
},
"animations": {
	"animation": {
		"bones": {
			"Layer 8 copy": {
				"rotate": [
					{
						"time": 0,
						"angle": 0,
						"curve": [ 0.25, 0, 0.75, 1 ]
					},
					{
						"time": 0.1667,
						"angle": -4.18,
						"curve": [ 0.25, 0, 0.75, 1 ]
					},
					{
						"time": 0.3333,
						"angle": 0,
						"curve": [ 0.25, 0, 0.75, 1 ]
					},
					{
						"time": 0.5,
						"angle": 3.94,
						"curve": [ 0.25, 0, 0.75, 1 ]
					},
					{
						"time": 0.6667,
						"angle": 0,
						"curve": [ 0.25, 0, 0.75, 1 ]
					},
					{
						"time": 0.8333,
						"angle": -4.18,
						"curve": [ 0.25, 0, 0.75, 1 ]
					},
					{
						"time": 1,
						"angle": 0,
						"curve": [ 0.25, 0, 0.75, 1 ]
					},
					{
						"time": 1.1667,
						"angle": 3.94,
						"curve": [ 0.25, 0, 0.75, 1 ]
					},
					{
						"time": 1.3333,
						"angle": 0,
						"curve": [ 0.25, 0, 0.75, 1 ]
					},
					{
						"time": 1.5,
						"angle": -4.18,
						"curve": [ 0.25, 0, 0.75, 1 ]
					},
					{
						"time": 1.6667,
						"angle": 0,
						"curve": [ 0.25, 0, 0.75, 1 ]
					},
					{
						"time": 1.8333,
						"angle": 3.94,
						"curve": [ 0.25, 0, 0.75, 1 ]
					},
					{ "time": 2, "angle": 0 },
					{
						"time": 2.1667,
						"angle": 3.94,
						"curve": [ 0.25, 0, 0.75, 1 ]
					},
					{ "time": 2.3333, "angle": 0 }
				],
				"scale": [
					{
						"time": 0,
						"x": 1,
						"y": 1,
						"curve": [ 0.25, 0, 0.75, 1 ]
					},
					{
						"time": 0.1667,
						"x": 1.046,
						"y": 1.046,
						"curve": [ 0.25, 0, 0.75, 1 ]
					},
					{
						"time": 0.3333,
						"x": 1,
						"y": 1,
						"curve": [ 0.25, 0, 0.75, 1 ]
					},
					{
						"time": 0.5,
						"x": 1.046,
						"y": 1.046,
						"curve": [ 0.25, 0, 0.75, 1 ]
					},
					{
						"time": 0.6667,
						"x": 1,
						"y": 1,
						"curve": [ 0.25, 0, 0.75, 1 ]
					},
					{
						"time": 0.8333,
						"x": 1.046,
						"y": 1.046,
						"curve": [ 0.25, 0, 0.75, 1 ]
					},
					{
						"time": 1,
						"x": 1,
						"y": 1,
						"curve": [ 0.25, 0, 0.75, 1 ]
					},
					{
						"time": 1.1667,
						"x": 1.046,
						"y": 1.046,
						"curve": [ 0.25, 0, 0.75, 1 ]
					},
					{
						"time": 1.3333,
						"x": 1,
						"y": 1,
						"curve": [ 0.25, 0, 0.75, 1 ]
					},
					{
						"time": 1.5,
						"x": 1.046,
						"y": 1.046,
						"curve": [ 0.25, 0, 0.75, 1 ]
					},
					{
						"time": 1.6667,
						"x": 1,
						"y": 1,
						"curve": [ 0.25, 0, 0.75, 1 ]
					},
					{
						"time": 1.8333,
						"x": 1.046,
						"y": 1.046,
						"curve": [ 0.25, 0, 0.75, 1 ]
					},
					{ "time": 2, "x": 1, "y": 1 },
					{
						"time": 2.1667,
						"x": 1.046,
						"y": 1.046,
						"curve": [ 0.25, 0, 0.75, 1 ]
					},
					{ "time": 2.3333, "x": 1, "y": 1 }
				]
			}
		}
	}
}
}