{
    "android": {
        "OneSignal": {
            "sound": true, 
            "vibrate": true, 
            "project_number": "250190107837", 
            "debug": false, 
            "notifications_when_active": false, 
            "id": "f1a722dd-ccc2-4e0c-b998-c9f10d8d55b5"
        }, 
        "Facebook": {
            "debug": false
        }
    }, 
    "ios": {
        "OneSignal": {
            "debug": false, 
            "id": "f1a722dd-ccc2-4e0c-b998-c9f10d8d55b5",
            "auto_register": true
        }, 
        "Facebook": {
            "debug": true
        }
    }
}