{
"skeleton": { "hash": "H1v/LCCPkYgM4pkUFt+c1Q/zJk0", "spine": "3.6.53", "width": 448.09, "height": 404.52, "images": "./images/" },
"bones": [
	{ "name": "root" },
	{ "name": "Layer 36", "parent": "root", "x": -3.35, "y": 41.25 },
	{ "name": "bone2", "parent": "Layer 36", "x": 1.25, "y": 0.91, "scaleX": 2.074, "scaleY": 2.074 }
],
"slots": [
	{ "name": "Layer 36", "bone": "Layer 36", "attachment": "Layer 36" },
	{ "name": "Clipping1", "bone": "Layer 36", "attachment": "Clipping1" },
	{ "name": "FX3", "bone": "bone2", "attachment": "Comp 5/FX2_00000", "blend": "additive" }
],
"skins": {
	"default": {
		"Clipping1": {
			"Clipping1": {
				"type": "clipping",
				"end": "FX3",
				"vertexCount": 5,
				"vertices": [ -0.92, 43.02, -40.32, 11.94, -22.1, -35.25, 25.42, -33.45, 41.37, 13.43 ],
				"color": "ce3a3aff"
			}
		},
		"FX3": {
			"Comp 5/FX2_00000": { "x": -2.19, "y": -11.74, "width": 216, "height": 195 },
			"Comp 5/FX2_00001": { "x": -2.19, "y": -11.74, "width": 216, "height": 195 },
			"Comp 5/FX2_00002": { "x": -2.19, "y": -11.74, "width": 216, "height": 195 },
			"Comp 5/FX2_00003": { "x": -2.19, "y": -11.74, "width": 216, "height": 195 },
			"Comp 5/FX2_00004": { "x": -2.19, "y": -11.74, "width": 216, "height": 195 },
			"Comp 5/FX2_00005": { "x": -2.19, "y": -11.74, "width": 216, "height": 195 },
			"Comp 5/FX2_00006": { "x": -2.19, "y": -11.74, "width": 216, "height": 195 },
			"Comp 5/FX2_00007": { "x": -2.19, "y": -11.74, "width": 216, "height": 195 },
			"Comp 5/FX2_00008": { "x": -2.19, "y": -11.74, "width": 216, "height": 195 },
			"Comp 5/FX2_00009": { "x": -2.19, "y": -11.74, "width": 216, "height": 195 },
			"Comp 5/FX2_00010": { "x": -2.19, "y": -11.74, "width": 216, "height": 195 },
			"Comp 5/FX2_00011": { "x": -2.19, "y": -11.74, "width": 216, "height": 195 },
			"Comp 5/FX2_00012": { "x": -2.19, "y": -11.74, "width": 216, "height": 195 },
			"Comp 5/FX2_00013": { "x": -2.19, "y": -11.74, "width": 216, "height": 195 },
			"Comp 5/FX2_00014": { "x": -4.46, "y": -16.28, "width": 216, "height": 195 }
		},
		"Layer 36": {
			"Layer 36": { "x": 0.53, "y": 6.91, "width": 102, "height": 102 }
		}
	}
},
"animations": {
	"animation": {
		"slots": {
			"FX3": {
				"attachment": [
					{ "time": 0, "name": "Comp 5/FX2_00000" },
					{ "time": 0.0333, "name": "Comp 5/FX2_00001" },
					{ "time": 0.0667, "name": "Comp 5/FX2_00002" },
					{ "time": 0.1, "name": "Comp 5/FX2_00003" },
					{ "time": 0.1333, "name": "Comp 5/FX2_00004" },
					{ "time": 0.1667, "name": "Comp 5/FX2_00005" },
					{ "time": 0.2, "name": "Comp 5/FX2_00006" },
					{ "time": 0.2333, "name": "Comp 5/FX2_00007" },
					{ "time": 0.2667, "name": "Comp 5/FX2_00008" },
					{ "time": 0.3, "name": "Comp 5/FX2_00009" },
					{ "time": 0.3333, "name": "Comp 5/FX2_00010" },
					{ "time": 0.3667, "name": "Comp 5/FX2_00011" },
					{ "time": 0.4, "name": "Comp 5/FX2_00012" },
					{ "time": 0.4333, "name": "Comp 5/FX2_00013" },
					{ "time": 0.4667, "name": "Comp 5/FX2_00014" },
					{ "time": 0.5, "name": null },
					{ "time": 0.9333, "name": "Comp 5/FX2_00000" },
					{ "time": 0.9667, "name": "Comp 5/FX2_00001" },
					{ "time": 1, "name": "Comp 5/FX2_00002" },
					{ "time": 1.0333, "name": "Comp 5/FX2_00003" },
					{ "time": 1.0667, "name": "Comp 5/FX2_00004" },
					{ "time": 1.1, "name": "Comp 5/FX2_00005" },
					{ "time": 1.1333, "name": "Comp 5/FX2_00006" },
					{ "time": 1.1667, "name": "Comp 5/FX2_00007" },
					{ "time": 1.2, "name": "Comp 5/FX2_00008" },
					{ "time": 1.2333, "name": "Comp 5/FX2_00009" },
					{ "time": 1.2667, "name": "Comp 5/FX2_00010" },
					{ "time": 1.3, "name": "Comp 5/FX2_00011" },
					{ "time": 1.3333, "name": "Comp 5/FX2_00012" },
					{ "time": 1.3667, "name": "Comp 5/FX2_00013" },
					{ "time": 1.4, "name": "Comp 5/FX2_00014" },
					{ "time": 1.4333, "name": null }
				]
			}
		},
		"bones": {
			"bone2": {
				"translate": [
					{ "time": 0, "x": 0.58, "y": 0 }
				],
				"scale": [
					{ "time": 0, "x": 0.778, "y": 0.778 }
				]
			},
			"Layer 36": {
				"scale": [
					{
						"time": 0.4,
						"x": 1,
						"y": 1,
						"curve": [ 0.25, 0, 0.75, 1 ]
					},
					{
						"time": 0.5333,
						"x": 1.081,
						"y": 1.081,
						"curve": [ 0.25, 0, 0.75, 1 ]
					},
					{
						"time": 0.6667,
						"x": 1,
						"y": 1,
						"curve": [ 0.25, 0, 0.75, 1 ]
					},
					{
						"time": 0.8,
						"x": 1.081,
						"y": 1.081,
						"curve": [ 0.25, 0, 0.75, 1 ]
					},
					{ "time": 0.9333, "x": 1, "y": 1, "curve": "stepped" },
					{
						"time": 1.4333,
						"x": 1,
						"y": 1,
						"curve": [ 0.25, 0, 0.75, 1 ]
					},
					{
						"time": 1.5667,
						"x": 1.081,
						"y": 1.081,
						"curve": [ 0.25, 0, 0.75, 1 ]
					},
					{
						"time": 1.7,
						"x": 1,
						"y": 1,
						"curve": [ 0.25, 0, 0.75, 1 ]
					},
					{
						"time": 1.8333,
						"x": 1.081,
						"y": 1.081,
						"curve": [ 0.25, 0, 0.75, 1 ]
					},
					{ "time": 1.9667, "x": 1, "y": 1 }
				]
			}
		}
	},
	"animation2": {}
}
}