{
	"game": {
		"name": "webgameclient",
		"appid": "610724731",
		"cid": 0
	},
	"needExecNative": true,
	"configs": [
		{
			"appid": "610724731",
			"services": [
				{
					"service_id": "235",
					"enable": false
				}
			]
		}
	]
}