{
"skeleton": { "hash": "+IbyiSF14109H3+tzmUsJ1hKy8E", "spine": "3.6.53", "width": 738.8, "height": 738.8, "images": "./images/" },
"bones": [
	{ "name": "root" },
	{ "name": "Layer 5", "parent": "root", "x": 34.83, "y": -15.73 },
	{ "name": "FX4", "parent": "Layer 5", "x": -26.39, "y": 312.46, "scaleX": 1.186, "scaleY": 1.186 },
	{ "name": "FX6", "parent": "Layer 5", "x": -30.51, "y": 114.89, "scaleX": 3.694, "scaleY": 3.694 },
	{ "name": "Layer 8", "parent": "Layer 5", "x": -12.21, "y": 235.78 },
	{ "name": "Layer 9", "parent": "Layer 5", "x": -45.18, "y": 240.49 }
],
"slots": [
	{ "name": "Layer 9", "bone": "Layer 9", "attachment": "Layer 9" },
	{ "name": "Layer 5", "bone": "Layer 5", "attachment": "Layer 5" },
	{ "name": "Layer 8", "bone": "Layer 8", "attachment": "Layer 8" },
	{ "name": "FX7", "bone": "FX6", "attachment": "FX/Comp 5/fx4_00014", "blend": "additive" },
	{ "name": "FX4", "bone": "FX4", "attachment": "FX/Comp 5/FX1_00007", "blend": "additive" }
],
"skins": {
	"default": {
		"FX4": {
			"FX/Comp 5/FX1_00000": { "width": 200, "height": 200 },
			"FX/Comp 5/FX1_00001": { "width": 200, "height": 200 },
			"FX/Comp 5/FX1_00002": { "width": 200, "height": 200 },
			"FX/Comp 5/FX1_00003": { "width": 200, "height": 200 },
			"FX/Comp 5/FX1_00004": { "width": 200, "height": 200 },
			"FX/Comp 5/FX1_00005": { "width": 200, "height": 200 },
			"FX/Comp 5/FX1_00006": { "width": 200, "height": 200 },
			"FX/Comp 5/FX1_00007": { "width": 200, "height": 200 },
			"FX/Comp 5/FX1_00008": { "width": 200, "height": 200 },
			"FX/Comp 5/FX1_00009": { "width": 200, "height": 200 },
			"FX/Comp 5/FX1_00010": { "width": 200, "height": 200 },
			"FX/Comp 5/FX1_00011": { "width": 200, "height": 200 },
			"FX/Comp 5/FX1_00012": { "width": 200, "height": 200 },
			"FX/Comp 5/FX1_00013": { "width": 200, "height": 200 },
			"FX/Comp 5/FX1_00014": { "width": 200, "height": 200 },
			"FX/Comp 5/FX1_00015": { "width": 200, "height": 200 },
			"FX/Comp 5/FX1_00016": { "width": 200, "height": 200 },
			"FX/Comp 5/FX1_00017": { "width": 200, "height": 200 },
			"FX/Comp 5/FX1_00018": { "width": 200, "height": 200 },
			"FX/Comp 5/FX1_00019": { "width": 200, "height": 200 },
			"FX/Comp 5/FX1_00020": { "width": 200, "height": 200 },
			"FX/Comp 5/FX1_00021": { "width": 200, "height": 200 },
			"FX/Comp 5/FX1_00022": { "width": 200, "height": 200 },
			"FX/Comp 5/FX1_00023": { "width": 200, "height": 200 },
			"FX/Comp 5/FX1_00024": { "width": 200, "height": 200 }
		},
		"FX7": {
			"FX/Comp 5/fx4_00000": { "x": -2.96, "y": 46.26, "width": 200, "height": 200 },
			"FX/Comp 5/fx4_00001": { "x": -2.96, "y": 46.26, "width": 200, "height": 200 },
			"FX/Comp 5/fx4_00002": { "x": -2.96, "y": 46.26, "width": 200, "height": 200 },
			"FX/Comp 5/fx4_00003": { "x": -2.96, "y": 46.26, "width": 200, "height": 200 },
			"FX/Comp 5/fx4_00004": { "x": -2.96, "y": 46.26, "width": 200, "height": 200 },
			"FX/Comp 5/fx4_00005": { "x": -2.96, "y": 46.26, "width": 200, "height": 200 },
			"FX/Comp 5/fx4_00006": { "x": -2.96, "y": 46.26, "width": 200, "height": 200 },
			"FX/Comp 5/fx4_00007": { "x": -2.96, "y": 46.26, "width": 200, "height": 200 },
			"FX/Comp 5/fx4_00008": { "x": -2.96, "y": 46.26, "width": 200, "height": 200 },
			"FX/Comp 5/fx4_00009": { "x": -2.96, "y": 46.26, "width": 200, "height": 200 },
			"FX/Comp 5/fx4_00010": { "x": -2.96, "y": 46.26, "width": 200, "height": 200 },
			"FX/Comp 5/fx4_00011": { "x": -2.96, "y": 46.26, "width": 200, "height": 200 },
			"FX/Comp 5/fx4_00012": { "x": -2.96, "y": 46.26, "width": 200, "height": 200 },
			"FX/Comp 5/fx4_00013": { "x": -2.96, "y": 46.26, "width": 200, "height": 200 },
			"FX/Comp 5/fx4_00014": { "x": -2.96, "y": 46.26, "width": 200, "height": 200 }
		},
		"Layer 5": {
			"Layer 5": { "x": -20.84, "y": 119.03, "width": 371, "height": 275 }
		},
		"Layer 8": {
			"Layer 8": { "x": 7.87, "y": 31.75, "width": 52, "height": 116 }
		},
		"Layer 9": {
			"Layer 9": { "x": -3.16, "y": 40.54, "width": 36, "height": 91 }
		}
	}
},
"animations": {
	"animation": {
		"slots": {
			"FX4": {
				"attachment": [
					{ "time": 0, "name": "FX/Comp 5/FX1_00000" },
					{ "time": 0.0333, "name": "FX/Comp 5/FX1_00001" },
					{ "time": 0.0667, "name": "FX/Comp 5/FX1_00002" },
					{ "time": 0.1, "name": "FX/Comp 5/FX1_00003" },
					{ "time": 0.1333, "name": "FX/Comp 5/FX1_00004" },
					{ "time": 0.1667, "name": "FX/Comp 5/FX1_00005" },
					{ "time": 0.2, "name": "FX/Comp 5/FX1_00006" },
					{ "time": 0.2333, "name": "FX/Comp 5/FX1_00007" },
					{ "time": 0.2667, "name": "FX/Comp 5/FX1_00008" },
					{ "time": 0.3, "name": "FX/Comp 5/FX1_00009" },
					{ "time": 0.3333, "name": "FX/Comp 5/FX1_00010" },
					{ "time": 0.3667, "name": "FX/Comp 5/FX1_00011" },
					{ "time": 0.4, "name": "FX/Comp 5/FX1_00012" },
					{ "time": 0.4333, "name": "FX/Comp 5/FX1_00013" },
					{ "time": 0.4667, "name": "FX/Comp 5/FX1_00014" },
					{ "time": 0.5, "name": "FX/Comp 5/FX1_00015" },
					{ "time": 0.5333, "name": "FX/Comp 5/FX1_00016" },
					{ "time": 0.5667, "name": "FX/Comp 5/FX1_00017" },
					{ "time": 0.6, "name": "FX/Comp 5/FX1_00018" },
					{ "time": 0.6333, "name": "FX/Comp 5/FX1_00019" },
					{ "time": 0.6667, "name": "FX/Comp 5/FX1_00020" },
					{ "time": 0.7, "name": "FX/Comp 5/FX1_00021" },
					{ "time": 0.7333, "name": "FX/Comp 5/FX1_00022" },
					{ "time": 0.7667, "name": "FX/Comp 5/FX1_00023" },
					{ "time": 0.8, "name": "FX/Comp 5/FX1_00024" },
					{ "time": 0.8667, "name": "FX/Comp 5/FX1_00000" },
					{ "time": 0.9, "name": "FX/Comp 5/FX1_00001" },
					{ "time": 0.9333, "name": "FX/Comp 5/FX1_00002" },
					{ "time": 0.9667, "name": "FX/Comp 5/FX1_00003" },
					{ "time": 1, "name": "FX/Comp 5/FX1_00004" },
					{ "time": 1.0333, "name": "FX/Comp 5/FX1_00005" },
					{ "time": 1.0667, "name": "FX/Comp 5/FX1_00006" },
					{ "time": 1.1, "name": "FX/Comp 5/FX1_00007" },
					{ "time": 1.1333, "name": "FX/Comp 5/FX1_00008" },
					{ "time": 1.1667, "name": "FX/Comp 5/FX1_00009" },
					{ "time": 1.2, "name": "FX/Comp 5/FX1_00010" },
					{ "time": 1.2333, "name": "FX/Comp 5/FX1_00011" },
					{ "time": 1.2667, "name": "FX/Comp 5/FX1_00012" },
					{ "time": 1.3, "name": "FX/Comp 5/FX1_00013" },
					{ "time": 1.3333, "name": "FX/Comp 5/FX1_00014" },
					{ "time": 1.3667, "name": "FX/Comp 5/FX1_00015" },
					{ "time": 1.4, "name": "FX/Comp 5/FX1_00016" },
					{ "time": 1.4333, "name": "FX/Comp 5/FX1_00017" },
					{ "time": 1.4667, "name": "FX/Comp 5/FX1_00018" },
					{ "time": 1.5, "name": "FX/Comp 5/FX1_00019" },
					{ "time": 1.5333, "name": "FX/Comp 5/FX1_00020" },
					{ "time": 1.5667, "name": "FX/Comp 5/FX1_00021" },
					{ "time": 1.6, "name": "FX/Comp 5/FX1_00022" },
					{ "time": 1.6333, "name": "FX/Comp 5/FX1_00023" },
					{ "time": 1.6667, "name": "FX/Comp 5/FX1_00024" },
					{ "time": 1.7333, "name": "FX/Comp 5/FX1_00000" },
					{ "time": 1.7667, "name": "FX/Comp 5/FX1_00001" },
					{ "time": 1.8, "name": "FX/Comp 5/FX1_00002" },
					{ "time": 1.8333, "name": "FX/Comp 5/FX1_00003" },
					{ "time": 1.8667, "name": "FX/Comp 5/FX1_00004" },
					{ "time": 1.9, "name": "FX/Comp 5/FX1_00005" },
					{ "time": 1.9333, "name": "FX/Comp 5/FX1_00006" },
					{ "time": 1.9667, "name": "FX/Comp 5/FX1_00007" },
					{ "time": 2, "name": "FX/Comp 5/FX1_00008" }
				]
			},
			"FX7": {
				"attachment": [
					{ "time": 0, "name": "FX/Comp 5/fx4_00000" },
					{ "time": 0.0333, "name": "FX/Comp 5/fx4_00001" },
					{ "time": 0.0667, "name": "FX/Comp 5/fx4_00002" },
					{ "time": 0.1, "name": "FX/Comp 5/fx4_00003" },
					{ "time": 0.1333, "name": "FX/Comp 5/fx4_00004" },
					{ "time": 0.1667, "name": "FX/Comp 5/fx4_00005" },
					{ "time": 0.2, "name": "FX/Comp 5/fx4_00006" },
					{ "time": 0.2333, "name": "FX/Comp 5/fx4_00007" },
					{ "time": 0.2667, "name": "FX/Comp 5/fx4_00008" },
					{ "time": 0.3, "name": "FX/Comp 5/fx4_00009" },
					{ "time": 0.3333, "name": "FX/Comp 5/fx4_00010" },
					{ "time": 0.3667, "name": "FX/Comp 5/fx4_00011" },
					{ "time": 0.4, "name": "FX/Comp 5/fx4_00012" },
					{ "time": 0.4333, "name": "FX/Comp 5/fx4_00013" },
					{ "time": 0.4667, "name": "FX/Comp 5/fx4_00014" },
					{ "time": 0.5, "name": "FX/Comp 5/fx4_00000" },
					{ "time": 0.5333, "name": "FX/Comp 5/fx4_00001" },
					{ "time": 0.5667, "name": "FX/Comp 5/fx4_00002" },
					{ "time": 0.6, "name": "FX/Comp 5/fx4_00003" },
					{ "time": 0.6333, "name": "FX/Comp 5/fx4_00004" },
					{ "time": 0.6667, "name": "FX/Comp 5/fx4_00005" },
					{ "time": 0.7, "name": "FX/Comp 5/fx4_00006" },
					{ "time": 0.7333, "name": "FX/Comp 5/fx4_00007" },
					{ "time": 0.7667, "name": "FX/Comp 5/fx4_00008" },
					{ "time": 0.8, "name": "FX/Comp 5/fx4_00009" },
					{ "time": 0.8333, "name": "FX/Comp 5/fx4_00010" },
					{ "time": 0.8667, "name": "FX/Comp 5/fx4_00011" },
					{ "time": 0.9, "name": "FX/Comp 5/fx4_00012" },
					{ "time": 0.9333, "name": "FX/Comp 5/fx4_00013" },
					{ "time": 0.9667, "name": "FX/Comp 5/fx4_00014" },
					{ "time": 1, "name": "FX/Comp 5/fx4_00000" },
					{ "time": 1.0333, "name": "FX/Comp 5/fx4_00001" },
					{ "time": 1.0667, "name": "FX/Comp 5/fx4_00002" },
					{ "time": 1.1, "name": "FX/Comp 5/fx4_00003" },
					{ "time": 1.1333, "name": "FX/Comp 5/fx4_00004" },
					{ "time": 1.1667, "name": "FX/Comp 5/fx4_00005" },
					{ "time": 1.2, "name": "FX/Comp 5/fx4_00006" },
					{ "time": 1.2333, "name": "FX/Comp 5/fx4_00007" },
					{ "time": 1.2667, "name": "FX/Comp 5/fx4_00008" },
					{ "time": 1.3, "name": "FX/Comp 5/fx4_00009" },
					{ "time": 1.3333, "name": "FX/Comp 5/fx4_00010" },
					{ "time": 1.3667, "name": "FX/Comp 5/fx4_00011" },
					{ "time": 1.4, "name": "FX/Comp 5/fx4_00012" },
					{ "time": 1.4333, "name": "FX/Comp 5/fx4_00013" },
					{ "time": 1.4667, "name": "FX/Comp 5/fx4_00014" },
					{ "time": 1.5, "name": "FX/Comp 5/fx4_00000" },
					{ "time": 1.5333, "name": "FX/Comp 5/fx4_00001" },
					{ "time": 1.5667, "name": "FX/Comp 5/fx4_00002" },
					{ "time": 1.6, "name": "FX/Comp 5/fx4_00003" },
					{ "time": 1.6333, "name": "FX/Comp 5/fx4_00004" },
					{ "time": 1.6667, "name": "FX/Comp 5/fx4_00005" },
					{ "time": 1.7, "name": "FX/Comp 5/fx4_00006" },
					{ "time": 1.7333, "name": "FX/Comp 5/fx4_00007" },
					{ "time": 1.7667, "name": "FX/Comp 5/fx4_00008" },
					{ "time": 1.8, "name": "FX/Comp 5/fx4_00009" },
					{ "time": 1.8333, "name": "FX/Comp 5/fx4_00010" },
					{ "time": 1.8667, "name": "FX/Comp 5/fx4_00011" },
					{ "time": 1.9, "name": "FX/Comp 5/fx4_00012" },
					{ "time": 1.9333, "name": "FX/Comp 5/fx4_00013" },
					{ "time": 1.9667, "name": "FX/Comp 5/fx4_00014" }
				]
			}
		},
		"bones": {
			"Layer 9": {
				"rotate": [
					{
						"time": 0,
						"angle": 5.22,
						"curve": [ 0.382, 0.57, 0.735, 1 ]
					},
					{
						"time": 0.3333,
						"angle": 0,
						"curve": [ 0.25, 0, 0.75, 1 ]
					},
					{
						"time": 1.3333,
						"angle": 18.41,
						"curve": [ 0.243, 0, 0.649, 0.6 ]
					},
					{ "time": 2, "angle": 5.22 }
				],
				"scale": [
					{ "time": 0, "x": 1, "y": 1, "curve": "stepped" },
					{ "time": 0.3333, "x": 1, "y": 1, "curve": "stepped" },
					{ "time": 1.3333, "x": 1, "y": 1, "curve": "stepped" },
					{ "time": 2, "x": 1, "y": 1 }
				]
			},
			"Layer 5": {
				"rotate": [
					{ "time": 0, "angle": 0, "curve": "stepped" },
					{ "time": 0.3333, "angle": 0, "curve": "stepped" },
					{ "time": 1.3333, "angle": 0, "curve": "stepped" },
					{ "time": 2, "angle": 0 }
				],
				"scale": [
					{
						"time": 0,
						"x": 1,
						"y": 0.988,
						"curve": [ 0.382, 0.57, 0.735, 1 ]
					},
					{
						"time": 0.3333,
						"x": 1,
						"y": 1,
						"curve": [ 0.25, 0, 0.75, 1 ]
					},
					{
						"time": 1.3333,
						"x": 1,
						"y": 0.957,
						"curve": [ 0.243, 0, 0.649, 0.6 ]
					},
					{ "time": 2, "x": 1, "y": 0.988 }
				]
			},
			"Layer 8": {
				"rotate": [
					{
						"time": 0,
						"angle": -3.51,
						"curve": [ 0.382, 0.57, 0.735, 1 ]
					},
					{ "time": 0.3333, "angle": 0 },
					{
						"time": 1.3333,
						"angle": -12.37,
						"curve": [ 0.243, 0, 0.649, 0.6 ]
					},
					{ "time": 2, "angle": -3.51 }
				],
				"scale": [
					{ "time": 0, "x": 1, "y": 1, "curve": "stepped" },
					{ "time": 0.3333, "x": 1, "y": 1, "curve": "stepped" },
					{ "time": 1.3333, "x": 1, "y": 1, "curve": "stepped" },
					{ "time": 2, "x": 1, "y": 1 }
				]
			}
		}
	}
}
}