{
"skeleton": { "hash": "SoMrGY+94DQ6qI1JqNVAvycZdwU", "spine": "3.6.53", "width": 866, "height": 212, "images": "./images/" },
"bones": [
	{ "name": "root" },
	{ "name": "ThangThua", "parent": "root", "x": 89.8, "y": -29.09 },
	{ "name": "Thang", "parent": "ThangThua", "x": -99.51, "y": 133.13 },
	{ "name": "Thang2", "parent": "Thang", "x": 50.86, "y": 2.03 },
	{ "name": "Shape 43", "parent": "Thang2", "x": -296.47, "y": -49.23 },
	{ "name": "Shape 44", "parent": "Thang2", "x": -155.71, "y": -45.9 },
	{ "name": "Shape 53", "parent": "Thang2", "x": 19.57, "y": -68.23 },
	{ "name": "Shape 66", "parent": "Thang2", "x": 76.07, "y": -53.98 },
	{ "name": "Shape 76", "parent": "Thang2", "x": 234.37, "y": -69.76 },
	{ "name": "Shape 4 copy3", "parent": "Thang2", "x": 164.12, "y": -60.09 },
	{ "name": "Shape 5 copy3", "parent": "Thang2", "x": -183.01, "y": -77.27 },
	{ "name": "Shape 6 copy5", "parent": "Thang2", "x": -140.02, "y": -43.57 },
	{ "name": "Shape 7 copy5", "parent": "Thang2", "x": -220.74, "y": -53.92 },
	{ "name": "Thang3", "parent": "Thang", "x": -2.72, "y": -60.76 },
	{ "name": "ThangThua3", "parent": "ThangThua", "x": -1286.63, "y": -133.2 },
	{ "name": "light5", "parent": "Thang2", "x": -34.87, "y": -59.15 },
	{ "name": "star21", "parent": "Thang2", "x": 45.93, "y": -83.07 },
	{ "name": "star22", "parent": "Thang2", "x": 45.53, "y": -39.73 },
	{ "name": "star23", "parent": "Thang2", "x": -136.53, "y": -63.91 },
	{ "name": "star24", "parent": "Thang2", "x": -285.9, "y": -67.43 }
],
"slots": [
	{ "name": "frame10", "bone": "Thang", "attachment": "frame10" },
	{ "name": "star25", "bone": "Shape 44", "attachment": "star25" },
	{ "name": "star24", "bone": "star24", "attachment": "star24" },
	{ "name": "star23", "bone": "star23", "attachment": "star23" },
	{ "name": "star22", "bone": "star22", "attachment": "star22" },
	{ "name": "star21", "bone": "star21", "attachment": "star21" },
	{ "name": "Shape 43", "bone": "Shape 43", "attachment": "Shape 43" },
	{ "name": "Shape 53", "bone": "Shape 53", "attachment": "Shape 53" },
	{ "name": "Shape 66", "bone": "Shape 66", "attachment": "Shape 66" },
	{ "name": "Shape 76", "bone": "Shape 76", "attachment": "Shape 76" },
	{ "name": "Shape 4 copy3", "bone": "Shape 4 copy3", "attachment": "Shape 4 copy3" },
	{ "name": "Shape 5 copy3", "bone": "Shape 5 copy3", "attachment": "Shape 5 copy3" },
	{ "name": "Shape 6 copy5", "bone": "Shape 6 copy5", "attachment": "Shape 6 copy5" },
	{ "name": "light5", "bone": "light5", "attachment": "light5" },
	{ "name": "Shape 7 copy5", "bone": "Shape 7 copy5", "attachment": "Shape 7 copy5" },
	{ "name": "Thang", "bone": "Thang3", "attachment": "Thang" }
],
"skins": {
	"default": {
		"Shape 4 copy3": {
			"Shape 4 copy3": { "x": -0.63, "y": 3.22, "width": 37, "height": 36 }
		},
		"Shape 43": {
			"Shape 43": { "x": 2.46, "y": 1.86, "width": 44, "height": 43 }
		},
		"Shape 5 copy3": {
			"Shape 5 copy3": { "x": -0.99, "y": -0.6, "width": 46, "height": 42 }
		},
		"Shape 53": {
			"Shape 53": { "x": 2.93, "y": -2.14, "width": 53, "height": 49 }
		},
		"Shape 6 copy5": {
			"Shape 6 copy5": { "x": 3.02, "y": 0.71, "width": 38, "height": 38 }
		},
		"Shape 66": {
			"Shape 66": { "x": 0.43, "y": 0.61, "width": 45, "height": 45 }
		},
		"Shape 7 copy5": {
			"Shape 7 copy5": { "x": -0.76, "y": 0.56, "width": 31, "height": 39 }
		},
		"Shape 76": {
			"Shape 76": { "x": 0.01, "y": 1.18, "width": 34, "height": 32 }
		},
		"Thang": {
			"Thang": { "x": 4.08, "y": 12.46, "width": 199, "height": 84 }
		},
		"frame10": {
			"frame10": { "x": 17.85, "y": -54.34, "width": 866, "height": 85 }
		},
		"light5": {
			"light5": { "x": 1.87, "y": 2.28, "width": 660, "height": 212 }
		},
		"star21": {
			"star21": { "x": -1.85, "y": 0.61, "width": 37, "height": 38 }
		},
		"star22": {
			"star22": { "x": -0.03, "y": -0.14, "width": 53, "height": 54 }
		},
		"star23": {
			"star23": { "x": 0.03, "y": 3.04, "width": 53, "height": 54 }
		},
		"star24": {
			"star24": { "x": 0.4, "y": 1.56, "width": 53, "height": 54 }
		},
		"star25": {
			"star25": { "x": -0.8, "y": 0.53, "width": 103, "height": 105 }
		}
	}
},
"animations": {
	"animation": {
		"slots": {
			"Shape 43": {
				"color": [
					{ "time": 0, "color": "ffffff00" },
					{ "time": 0.3333, "color": "ffffffff", "curve": "stepped" },
					{ "time": 1.1667, "color": "ffffffff" },
					{ "time": 2, "color": "ffffff00" }
				]
			},
			"Shape 53": {
				"color": [
					{ "time": 0, "color": "ffffff00" },
					{ "time": 0.3333, "color": "ffffffff", "curve": "stepped" },
					{ "time": 1.1667, "color": "ffffffff" },
					{ "time": 2, "color": "ffffff00" }
				]
			},
			"Shape 66": {
				"color": [
					{ "time": 0, "color": "ffffff00" },
					{ "time": 0.3333, "color": "ffffffff", "curve": "stepped" },
					{ "time": 1.1667, "color": "ffffffff" },
					{ "time": 2, "color": "ffffff00" }
				]
			},
			"Shape 76": {
				"color": [
					{ "time": 0, "color": "ffffff00" },
					{ "time": 0.3333, "color": "ffffffff", "curve": "stepped" },
					{ "time": 1.1667, "color": "ffffffff" },
					{ "time": 2, "color": "ffffff00" }
				]
			},
			"Shape 4 copy3": {
				"color": [
					{ "time": 0, "color": "ffffff00" },
					{ "time": 0.3333, "color": "ffffffff", "curve": "stepped" },
					{ "time": 1.1667, "color": "ffffffff" },
					{ "time": 2, "color": "ffffff00" }
				]
			},
			"Shape 5 copy3": {
				"color": [
					{ "time": 0, "color": "ffffff00" },
					{ "time": 0.3333, "color": "ffffffff", "curve": "stepped" },
					{ "time": 1.1667, "color": "ffffffff" },
					{ "time": 2, "color": "ffffff00" }
				]
			},
			"Shape 6 copy5": {
				"color": [
					{ "time": 0, "color": "ffffff00" },
					{ "time": 0.3333, "color": "ffffffff", "curve": "stepped" },
					{ "time": 1.1667, "color": "ffffffff" },
					{ "time": 2, "color": "ffffff00" }
				]
			},
			"Shape 7 copy5": {
				"color": [
					{ "time": 0, "color": "ffffff00" },
					{ "time": 0.3333, "color": "ffffffff", "curve": "stepped" },
					{ "time": 1.1667, "color": "ffffffff" },
					{ "time": 2, "color": "ffffff00" }
				]
			},
			"Thang": {
				"color": [
					{ "time": 0, "color": "ffffff00" },
					{ "time": 0.3333, "color": "ffffffff" }
				]
			},
			"light5": {
				"color": [
					{ "time": 0, "color": "ffffff00" },
					{ "time": 0.3333, "color": "ffffffff" },
					{ "time": 0.6667, "color": "ffffff00", "curve": "stepped" },
					{ "time": 0.7, "color": "ffffff00" },
					{ "time": 1.0333, "color": "ffffffff" },
					{ "time": 1.3333, "color": "ffffff00", "curve": "stepped" },
					{ "time": 1.3667, "color": "ffffff00" },
					{ "time": 1.7, "color": "ffffffff" },
					{ "time": 2, "color": "ffffff00" }
				]
			},
			"star21": {
				"color": [
					{ "time": 0, "color": "ffffff00" },
					{ "time": 0.3333, "color": "ffffffff", "curve": "stepped" },
					{ "time": 1.1667, "color": "ffffffff" },
					{ "time": 2, "color": "ffffff00" }
				]
			},
			"star22": {
				"color": [
					{ "time": 0, "color": "ffffff00" },
					{ "time": 0.3333, "color": "ffffffff", "curve": "stepped" },
					{ "time": 1.1667, "color": "ffffffff" },
					{ "time": 2, "color": "ffffff00" }
				]
			},
			"star23": {
				"color": [
					{ "time": 0, "color": "ffffff00" },
					{ "time": 0.3333, "color": "ffffffff", "curve": "stepped" },
					{ "time": 1.1667, "color": "ffffffff" },
					{ "time": 2, "color": "ffffff00" }
				]
			},
			"star24": {
				"color": [
					{ "time": 0, "color": "ffffff00" },
					{ "time": 0.3333, "color": "ffffffff", "curve": "stepped" },
					{ "time": 1.1667, "color": "ffffffff" },
					{ "time": 2, "color": "ffffff00" }
				]
			},
			"star25": {
				"color": [
					{ "time": 0, "color": "ffffff00" },
					{ "time": 0.3333, "color": "ffffffff", "curve": "stepped" },
					{ "time": 1.1667, "color": "ffffffff" },
					{ "time": 2, "color": "ffffff00" }
				]
			}
		},
		"bones": {
			"Thang3": {
				"rotate": [
					{
						"time": 0.3333,
						"angle": 0,
						"curve": [ 0.25, 0, 0.75, 1 ]
					},
					{
						"time": 0.4333,
						"angle": 3.18,
						"curve": [ 0.25, 0, 0.75, 1 ]
					},
					{
						"time": 0.5333,
						"angle": 0,
						"curve": [ 0.25, 0, 0.75, 1 ]
					},
					{
						"time": 0.6333,
						"angle": -4.54,
						"curve": [ 0.25, 0, 0.75, 1 ]
					},
					{
						"time": 0.7333,
						"angle": 0,
						"curve": [ 0.25, 0, 0.75, 1 ]
					},
					{
						"time": 0.8333,
						"angle": 3.18,
						"curve": [ 0.25, 0, 0.75, 1 ]
					},
					{
						"time": 0.9333,
						"angle": 0,
						"curve": [ 0.25, 0, 0.75, 1 ]
					},
					{
						"time": 1.0333,
						"angle": -4.54,
						"curve": [ 0.25, 0, 0.75, 1 ]
					},
					{
						"time": 1.1333,
						"angle": 0,
						"curve": [ 0.25, 0, 0.75, 1 ]
					},
					{
						"time": 1.2333,
						"angle": 3.18,
						"curve": [ 0.25, 0, 0.75, 1 ]
					},
					{
						"time": 1.3333,
						"angle": 0,
						"curve": [ 0.25, 0, 0.75, 1 ]
					},
					{
						"time": 1.4333,
						"angle": -4.54,
						"curve": [ 0.25, 0, 0.75, 1 ]
					},
					{
						"time": 1.5333,
						"angle": 0,
						"curve": [ 0.25, 0, 0.75, 1 ]
					},
					{
						"time": 1.6333,
						"angle": -4.54,
						"curve": [ 0.25, 0, 0.75, 1 ]
					},
					{
						"time": 1.7333,
						"angle": 0,
						"curve": [ 0.25, 0, 0.75, 1 ]
					},
					{
						"time": 1.8333,
						"angle": -4.54,
						"curve": [ 0.25, 0, 0.75, 1 ]
					},
					{
						"time": 1.9333,
						"angle": 0,
						"curve": [ 0.25, 0, 0.75, 1 ]
					},
					{ "time": 2, "angle": -4.54 }
				],
				"translate": [
					{ "time": 0, "x": 0, "y": 0, "curve": "stepped" },
					{ "time": 0.3333, "x": 0, "y": 0, "curve": "stepped" },
					{ "time": 0.5333, "x": 0, "y": 0, "curve": "stepped" },
					{ "time": 0.7333, "x": 0, "y": 0, "curve": "stepped" },
					{ "time": 0.9333, "x": 0, "y": 0, "curve": "stepped" },
					{ "time": 1.1333, "x": 0, "y": 0, "curve": "stepped" },
					{ "time": 1.3333, "x": 0, "y": 0, "curve": "stepped" },
					{ "time": 1.5333, "x": 0, "y": 0, "curve": "stepped" },
					{ "time": 1.7333, "x": 0, "y": 0, "curve": "stepped" },
					{ "time": 1.9333, "x": 0, "y": 0 }
				],
				"scale": [
					{
						"time": 0,
						"x": 2.426,
						"y": 2.426,
						"curve": [ 0.996, 0, 0.75, 1 ]
					},
					{
						"time": 0.3333,
						"x": 1,
						"y": 1,
						"curve": [ 0.25, 0, 0.75, 1 ]
					},
					{
						"time": 0.4333,
						"x": 1.126,
						"y": 1.126,
						"curve": [ 0.25, 0, 0.75, 1 ]
					},
					{
						"time": 0.5333,
						"x": 1,
						"y": 1,
						"curve": [ 0.25, 0, 0.75, 1 ]
					},
					{
						"time": 0.6333,
						"x": 1.126,
						"y": 1.126,
						"curve": [ 0.25, 0, 0.75, 1 ]
					},
					{
						"time": 0.7333,
						"x": 1,
						"y": 1,
						"curve": [ 0.25, 0, 0.75, 1 ]
					},
					{
						"time": 0.8333,
						"x": 1.126,
						"y": 1.126,
						"curve": [ 0.25, 0, 0.75, 1 ]
					},
					{
						"time": 0.9333,
						"x": 1,
						"y": 1,
						"curve": [ 0.25, 0, 0.75, 1 ]
					},
					{
						"time": 1.0333,
						"x": 1.126,
						"y": 1.126,
						"curve": [ 0.25, 0, 0.75, 1 ]
					},
					{
						"time": 1.1333,
						"x": 1,
						"y": 1,
						"curve": [ 0.25, 0, 0.75, 1 ]
					},
					{
						"time": 1.2333,
						"x": 1.126,
						"y": 1.126,
						"curve": [ 0.25, 0, 0.75, 1 ]
					},
					{
						"time": 1.3333,
						"x": 1,
						"y": 1,
						"curve": [ 0.25, 0, 0.75, 1 ]
					},
					{
						"time": 1.4333,
						"x": 1.126,
						"y": 1.126,
						"curve": [ 0.25, 0, 0.75, 1 ]
					},
					{
						"time": 1.5333,
						"x": 1,
						"y": 1,
						"curve": [ 0.25, 0, 0.75, 1 ]
					},
					{
						"time": 1.6333,
						"x": 1.126,
						"y": 1.126,
						"curve": [ 0.25, 0, 0.75, 1 ]
					},
					{
						"time": 1.7333,
						"x": 1,
						"y": 1,
						"curve": [ 0.25, 0, 0.75, 1 ]
					},
					{
						"time": 1.8333,
						"x": 1.126,
						"y": 1.126,
						"curve": [ 0.25, 0, 0.75, 1 ]
					},
					{
						"time": 1.9333,
						"x": 1,
						"y": 1,
						"curve": [ 0.25, 0, 0.75, 1 ]
					},
					{ "time": 2, "x": 1.126, "y": 1.126 }
				]
			},
			"light5": {
				"scale": [
					{ "time": 0, "x": 0.235, "y": 1 },
					{ "time": 0.6667, "x": 1, "y": 1 },
					{ "time": 0.7, "x": 0.235, "y": 1 },
					{ "time": 1.3333, "x": 1, "y": 1 },
					{ "time": 1.3667, "x": 0.235, "y": 1 },
					{ "time": 2, "x": 1, "y": 1 }
				]
			},
			"star21": {
				"rotate": [
					{ "time": 0, "angle": 0 },
					{ "time": 0.5, "angle": -89.3 },
					{ "time": 1, "angle": -178.24 },
					{ "time": 1.5, "angle": 89.04 },
					{ "time": 2, "angle": 0 }
				],
				"translate": [
					{ "time": 0, "x": -13.91, "y": 0.52 },
					{ "time": 2, "x": 46.35, "y": -3.61 }
				]
			},
			"star22": {
				"rotate": [
					{ "time": 0, "angle": 0 },
					{ "time": 0.5, "angle": -89.3 },
					{ "time": 1, "angle": -178.24 },
					{ "time": 1.5, "angle": 89.04 },
					{ "time": 2, "angle": 0 }
				],
				"translate": [
					{ "time": 0, "x": -13.91, "y": 0.52 },
					{ "time": 2, "x": 66.95, "y": 4.12 }
				]
			},
			"star23": {
				"rotate": [
					{ "time": 0, "angle": 0 },
					{ "time": 0.5, "angle": 87.62 },
					{ "time": 1, "angle": 178.53 },
					{ "time": 1.5, "angle": -93.82 },
					{ "time": 2, "angle": 0 }
				],
				"translate": [
					{ "time": 0, "x": 57.68, "y": -7.72 },
					{ "time": 2, "x": -14.93, "y": -23.69 }
				]
			},
			"Shape 44": {
				"rotate": [
					{ "time": 0, "angle": 0 },
					{ "time": 0.5, "angle": 87.62 },
					{ "time": 1, "angle": 178.53 },
					{ "time": 1.5, "angle": -93.82 },
					{ "time": 2, "angle": 0 }
				],
				"translate": [
					{ "time": 0, "x": 57.68, "y": -7.72 },
					{ "time": 2, "x": -46.86, "y": 15.45 }
				]
			},
			"star24": {
				"rotate": [
					{ "time": 0, "angle": 0 },
					{ "time": 0.5, "angle": 87.62 },
					{ "time": 1, "angle": 178.53 },
					{ "time": 1.5, "angle": -93.82 },
					{ "time": 2, "angle": 0 }
				],
				"translate": [
					{ "time": 0, "x": 57.68, "y": -7.72 },
					{ "time": 2, "x": 0, "y": 0 }
				]
			},
			"Shape 5 copy3": {
				"rotate": [
					{ "time": 0, "angle": -149.31 },
					{ "time": 2, "angle": 0 }
				],
				"translate": [
					{ "time": 0, "x": 61.8, "y": -5.15 },
					{ "time": 2, "x": 0, "y": 0 }
				],
				"scale": [
					{ "time": 0, "x": 0.591, "y": 0.591 },
					{ "time": 2, "x": 1, "y": 1 }
				]
			},
			"Shape 43": {
				"rotate": [
					{ "time": 0, "angle": -149.31 },
					{ "time": 2, "angle": 0 }
				],
				"translate": [
					{ "time": 0, "x": 60.25, "y": -4.64 },
					{ "time": 2, "x": 0, "y": 0 }
				],
				"scale": [
					{ "time": 0, "x": 0.591, "y": 0.591 },
					{ "time": 2, "x": 1, "y": 1 }
				]
			},
			"Shape 7 copy5": {
				"rotate": [
					{ "time": 0, "angle": -149.31 },
					{ "time": 2, "angle": 0 }
				],
				"translate": [
					{ "time": 0, "x": 54.59, "y": -12.87 },
					{ "time": 2, "x": 0, "y": 0 }
				],
				"scale": [
					{ "time": 0, "x": 0.591, "y": 0.591 },
					{ "time": 2, "x": 1, "y": 1 }
				]
			},
			"Shape 6 copy5": {
				"rotate": [
					{ "time": 0, "angle": -149.31 },
					{ "time": 2, "angle": 0 }
				],
				"translate": [
					{ "time": 0, "x": 69.01, "y": -6.7 },
					{ "time": 2, "x": 0, "y": 0 }
				],
				"scale": [
					{ "time": 0, "x": 0.591, "y": 0.591 },
					{ "time": 2, "x": 1, "y": 1 }
				]
			},
			"Shape 53": {
				"rotate": [
					{ "time": 0, "angle": 98.82 },
					{ "time": 2, "angle": 0 }
				],
				"translate": [
					{ "time": 0, "x": -72.14, "y": -11.93 },
					{ "time": 2, "x": 0, "y": 0 }
				],
				"scale": [
					{ "time": 0, "x": 0.584, "y": 0.584 },
					{ "time": 2, "x": 1, "y": 1 }
				]
			},
			"Shape 4 copy3": {
				"rotate": [
					{ "time": 0, "angle": 98.82 },
					{ "time": 2, "angle": 0 }
				],
				"translate": [
					{ "time": 0, "x": -74.41, "y": -7.38 },
					{ "time": 2, "x": 0, "y": 0 }
				],
				"scale": [
					{ "time": 0, "x": 0.584, "y": 0.584 },
					{ "time": 2, "x": 1, "y": 1 }
				]
			},
			"Shape 76": {
				"rotate": [
					{ "time": 0, "angle": 98.82 },
					{ "time": 2, "angle": 0 }
				],
				"translate": [
					{ "time": 0, "x": -72.7, "y": -10.79 },
					{ "time": 2, "x": 0, "y": 0 }
				],
				"scale": [
					{ "time": 0, "x": 0.584, "y": 0.584 },
					{ "time": 2, "x": 1, "y": 1 }
				]
			},
			"Shape 66": {
				"rotate": [
					{ "time": 0, "angle": 98.82 },
					{ "time": 2, "angle": 0 }
				],
				"translate": [
					{ "time": 0, "x": -56.8, "y": -5.11 },
					{ "time": 2, "x": 0, "y": 0 }
				],
				"scale": [
					{ "time": 0, "x": 0.584, "y": 0.584 },
					{ "time": 2, "x": 1, "y": 1 }
				]
			}
		}
	}
}
}