{
"skeleton": { "hash": "yTDglkuGk86gmbO1JXMDLia7/Qk", "spine": "3.6.53", "width": 198.03, "height": 264, "images": "./images/" },
"bones": [
	{ "name": "root" },
	{ "name": "it3", "parent": "root", "x": -1.21, "y": 6.11 },
	{ "name": "it11", "parent": "it3", "x": -97.94, "y": 64.22 },
	{ "name": "it13", "parent": "it3", "x": 1.52, "y": 63.38 }
],
"slots": [
	{ "name": "it3", "bone": "it13", "attachment": "it3" },
	{ "name": "clip3", "bone": "it13", "attachment": "clip3" },
	{ "name": "lia sang3", "bone": "it11", "attachment": "lia sang" }
],
"skins": {
	"default": {
		"clip3": {
			"clip3": {
				"type": "clipping",
				"end": "lia sang3",
				"vertexCount": 27,
				"vertices": [ -0.89, 42.85, -8.44, 46.84, -17.98, 50.39, -29.75, 50.62, -42.62, 47.73, -51.06, 42.62, -58.61, 35.74, -63.71, 25.53, -65.71, 14.43, -64.82, 2.89, -57.72, -10.88, -48.84, -19.98, -30.86, -33.52, 0.44, -56.61, 16.21, -43.07, 33.52, -31.3, 50.62, -18.43, 60.61, -5.33, 66.16, 6.66, 66.16, 20.65, 60.83, 35.08, 51.5, 43.96, 41.29, 48.4, 26.86, 51.06, 16.21, 47.95, 6.22, 43.73, 1.78, 39.96 ],
				"color": "61ce3aff"
			}
		},
		"it3": {
			"it3": { "x": 1.08, "y": -3.06, "width": 134, "height": 110 }
		},
		"lia sang3": {
			"lia sang": { "width": 61, "height": 264 }
		}
	}
},
"animations": {
	"animation": {
		"bones": {
			"it13": {
				"rotate": [
					{
						"time": 0,
						"angle": -7.81,
						"curve": [ 0.293, 0.19, 0.644, 0.59 ]
					},
					{
						"time": 0.1667,
						"angle": -4.55,
						"curve": [ 0.372, 0.48, 0.752, 1 ]
					},
					{
						"time": 0.4333,
						"angle": 0,
						"curve": [ 0.25, 0, 0.75, 1 ]
					},
					{
						"time": 0.9333,
						"angle": -8.37,
						"curve": [ 0.25, 0, 0.75, 1 ]
					},
					{
						"time": 1.4333,
						"angle": 0,
						"curve": [ 0.25, 0, 0.75, 1 ]
					},
					{
						"time": 1.9333,
						"angle": -8.37,
						"curve": [ 0.297, 0, 0.634, 0.37 ]
					},
					{ "time": 2, "angle": -7.81 }
				],
				"translate": [
					{
						"time": 0,
						"x": 0,
						"y": 2.69,
						"curve": [ 0.382, 0.57, 0.735, 1 ]
					},
					{
						"time": 0.1667,
						"x": 0,
						"y": 0,
						"curve": [ 0.25, 0, 0.75, 1 ]
					},
					{
						"time": 0.6667,
						"x": 0,
						"y": 9.49,
						"curve": [ 0.25, 0, 0.75, 1 ]
					},
					{
						"time": 1.1667,
						"x": 0,
						"y": 0,
						"curve": [ 0.25, 0, 0.75, 1 ]
					},
					{
						"time": 1.6667,
						"x": 0,
						"y": 9.49,
						"curve": [ 0.243, 0, 0.649, 0.6 ]
					},
					{ "time": 2, "x": 0, "y": 2.69 }
				],
				"scale": [
					{ "time": 2, "x": 1, "y": 1 }
				]
			},
			"it11": {
				"rotate": [
					{ "time": 2, "angle": 0 }
				],
				"translate": [
					{ "time": 0.6, "x": 0, "y": 0 },
					{ "time": 1.0333, "x": 198.4, "y": 0, "curve": "stepped" },
					{ "time": 1.7667, "x": 200.84, "y": 0 }
				],
				"scale": [
					{ "time": 2, "x": 1, "y": 1 }
				]
			},
			"root": {
				"rotate": [
					{ "time": 0, "angle": 0, "curve": "stepped" },
					{ "time": 1, "angle": 0, "curve": "stepped" },
					{ "time": 2, "angle": 0 }
				],
				"translate": [
					{ "time": 0, "x": 0, "y": 0, "curve": "stepped" },
					{ "time": 1, "x": 0, "y": 0, "curve": "stepped" },
					{ "time": 2, "x": 0, "y": 0 }
				],
				"scale": [
					{ "time": 2, "x": 1, "y": 1 }
				]
			},
			"it3": {
				"rotate": [
					{ "time": 2, "angle": 0 }
				],
				"translate": [
					{ "time": 2, "x": 0, "y": 0 }
				],
				"scale": [
					{ "time": 2, "x": 1, "y": 1 }
				]
			}
		}
	}
}
}