
itemJackpot.png
size: 256,128
format: RGBA8888
filter: Linear,Linear
repeat: none
Gold_Soccer_Ball_PNG_Clip_Art_Image
  rotate: false
  xy: 2, 2
  size: 97, 96
  orig: 97, 96
  offset: 0, 0
  index: -1
jackpot1
  rotate: false
  xy: 101, 57
  size: 131, 41
  orig: 131, 41
  offset: 0, 0
  index: -1
