
CaoThap.png
size: 1024,512
format: RGBA8888
filter: Linear,Linear
repeat: none
Cao
  rotate: false
  xy: 551, 124
  size: 120, 69
  orig: 120, 69
  offset: 0, 0
  index: -1
Group 4
  rotate: false
  xy: 551, 195
  size: 129, 130
  orig: 129, 130
  offset: 0, 0
  index: -1
Group 5
  rotate: false
  xy: 551, 327
  size: 132, 130
  orig: 132, 130
  offset: 0, 0
  index: -1
Layer 105
  rotate: false
  xy: 295, 39
  size: 254, 418
  orig: 254, 418
  offset: 0, 0
  index: -1
Rounded Rectangle 2
  rotate: false
  xy: 2, 2
  size: 291, 455
  orig: 291, 455
  offset: 0, 0
  index: -1
Thap
  rotate: false
  xy: 685, 366
  size: 147, 91
  orig: 147, 91
  offset: 0, 0
  index: -1
