{
"skeleton": { "hash": "9T4/zHwlwMRc+Tw7+67WPqVvGuw", "spine": "3.6.53", "width": 259, "height": 244.67, "images": "./images/" },
"bones": [
	{ "name": "root" },
	{ "name": "XocXOc", "parent": "root", "x": -1.12, "y": -4.74 },
	{ "name": "FX4", "parent": "XocXOc", "x": -5.51, "y": 127.2 },
	{ "name": "XocXOc2", "parent": "XocXOc", "x": -6.94, "y": 121.56, "color": "ff0000ff" },
	{ "name": "Layer 9", "parent": "XocXOc2", "x": -32.15, "y": 3.29 },
	{ "name": "Layer 9 copy", "parent": "XocXOc2", "x": -1.66, "y": -27.19 },
	{ "name": "Layer 9 copy 2", "parent": "XocXOc2", "x": -2, "y": 31.1 },
	{ "name": "Layer 9 copy 3", "parent": "XocXOc2", "x": 25.14, "y": 13.68 },
	{ "name": "XocXOc3", "parent": "XocXOc", "x": -43.15, "y": 41.71 },
	{ "name": "XocXOc4", "parent": "XocXOc", "x": 57.04, "y": 41.71 },
	{ "name": "bat(1)", "parent": "XocXOc2", "x": -0.16, "y": 3.76, "scaleX": 1.328, "scaleY": 1.328 }
],
"slots": [
	{ "name": "Frame4", "bone": "XocXOc", "attachment": "Frame4" },
	{ "name": "Layer 19", "bone": "XocXOc", "attachment": "Layer 19" },
	{ "name": "Layer 24", "bone": "XocXOc", "color": "ffffff00", "attachment": "Layer 19", "blend": "additive" },
	{ "name": "dia", "bone": "XocXOc2", "attachment": "dia" },
	{ "name": "FX4", "bone": "FX4", "color": "ffffff00", "attachment": "FX4", "blend": "additive" },
	{ "name": "Layer 9", "bone": "Layer 9", "attachment": "Layer 9" },
	{ "name": "Layer 9 copy 2", "bone": "Layer 9 copy 2", "attachment": "Layer 9 copy 2" },
	{ "name": "Layer 9 copy 3", "bone": "Layer 9 copy 3", "attachment": "Layer 9 copy 3" },
	{ "name": "Layer 9 copy", "bone": "Layer 9 copy", "attachment": "Layer 9 copy" },
	{ "name": "bat(1)", "bone": "bat(1)", "attachment": "bat(1)" },
	{ "name": "Xoc", "bone": "XocXOc3", "attachment": "Xoc" },
	{ "name": "Xoc2", "bone": "XocXOc4", "attachment": "Xoc" }
],
"skins": {
	"default": {
		"FX4": {
			"FX4": { "x": 0.11, "y": 0.95, "width": 202, "height": 236 }
		},
		"Frame4": {
			"Frame4": { "x": 2.82, "y": 112.98, "width": 259, "height": 223 }
		},
		"Layer 19": {
			"Layer 19": { "x": 3.32, "y": 112.48, "width": 236, "height": 200 }
		},
		"Layer 24": {
			"Layer 19": { "x": 3.32, "y": 112.48, "width": 236, "height": 200 }
		},
		"Layer 9": {
			"Layer 9": { "x": -1.09, "y": 1.62, "width": 47, "height": 47 }
		},
		"Layer 9 copy": {
			"Layer 9 copy": { "x": 1.42, "y": 0.6, "width": 47, "height": 47 }
		},
		"Layer 9 copy 2": {
			"Layer 9 copy 2": { "x": 1.76, "y": 0.81, "width": 48, "height": 48 }
		},
		"Layer 9 copy 3": {
			"Layer 9 copy 3": { "x": 0.62, "y": 0.73, "width": 48, "height": 48 }
		},
		"Xoc": {
			"Xoc": { "y": 7.26, "width": 109, "height": 62 }
		},
		"Xoc2": {
			"Xoc": { "y": 7.26, "width": 109, "height": 62 }
		},
		"bat(1)": {
			"bat(1)": { "x": 3.62, "y": -0.93, "width": 109, "height": 109 }
		},
		"dia": {
			"dia": { "x": 2.76, "y": 2.91, "width": 147, "height": 148 }
		}
	}
},
"animations": {
	"animation": {
		"slots": {
			"FX4": {
				"color": [
					{ "time": 0.6667, "color": "ffffff00" },
					{ "time": 0.8333, "color": "ffffffff" }
				]
			},
			"Layer 24": {
				"color": [
					{ "time": 0, "color": "ffffff00" },
					{ "time": 0.1667, "color": "ffffffff" },
					{ "time": 0.3333, "color": "ffffff00" },
					{ "time": 0.5, "color": "ffffffff" },
					{ "time": 0.6667, "color": "ffffff00" },
					{ "time": 0.8333, "color": "ffffffff" },
					{ "time": 1, "color": "ffffff00" },
					{ "time": 1.1667, "color": "ffffffff" },
					{ "time": 1.3333, "color": "ffffff00" },
					{ "time": 1.5, "color": "ffffffff" },
					{ "time": 1.6667, "color": "ffffff00" },
					{ "time": 1.8333, "color": "ffffffff" },
					{ "time": 2, "color": "ffffff00" }
				]
			}
		},
		"bones": {
			"XocXOc": {
				"rotate": [
					{ "time": 2, "angle": 0 }
				],
				"translate": [
					{ "time": 2, "x": 0, "y": 0 }
				],
				"scale": [
					{ "time": 2, "x": 1, "y": 1 }
				]
			},
			"XocXOc2": {
				"translate": [
					{ "time": 0, "x": 0, "y": 0 },
					{ "time": 0.0333, "x": 0, "y": 5.25 },
					{ "time": 0.0667, "x": -4.2, "y": -0.7 },
					{ "time": 0.1, "x": 0.7, "y": -1.75 },
					{ "time": 0.1333, "x": -0.7, "y": 4.2 },
					{ "time": 0.1667, "x": -2.1, "y": -2.45 },
					{ "time": 0.2, "x": -7, "y": 2.45 },
					{ "time": 0.2333, "x": 0, "y": 0 },
					{ "time": 0.2667, "x": 0, "y": 5.25 },
					{ "time": 0.3, "x": -4.2, "y": -0.7 },
					{ "time": 0.3333, "x": 0.7, "y": -1.75 },
					{ "time": 0.3667, "x": -0.7, "y": 4.2 },
					{ "time": 0.4, "x": -2.1, "y": -2.45 },
					{ "time": 0.4333, "x": 0, "y": 0 }
				],
				"scale": [
					{ "time": 0.4333, "x": 1, "y": 1 }
				]
			},
			"bat(1)": {
				"translate": [
					{ "time": 0.4333, "x": 0, "y": 0 },
					{ "time": 0.5667, "x": 57.19, "y": -38.76 }
				],
				"scale": [
					{ "time": 0, "x": 1, "y": 1, "curve": "stepped" },
					{ "time": 0.4333, "x": 1, "y": 1 },
					{ "time": 0.5667, "x": 0.73, "y": 0.73 }
				]
			},
			"Layer 9": {
				"translate": [
					{ "time": 0.4333, "x": 27.78, "y": -5.81 },
					{ "time": 0.6667, "x": 0, "y": 0 }
				]
			},
			"Layer 9 copy": {
				"translate": [
					{ "time": 0.4333, "x": 0.97, "y": 22.29 },
					{ "time": 0.6667, "x": 0, "y": 0 }
				]
			},
			"Layer 9 copy 2": {
				"translate": [
					{ "time": 0.4333, "x": 2.58, "y": -27.46 },
					{ "time": 0.6667, "x": 0, "y": 0 }
				]
			},
			"Layer 9 copy 3": {
				"translate": [
					{ "time": 0.4333, "x": -21.32, "y": -12.92 },
					{ "time": 0.6667, "x": 0, "y": 0 }
				]
			},
			"FX4": {
				"rotate": [
					{ "time": 0.6667, "angle": 0 },
					{ "time": 1, "angle": -87.93 },
					{ "time": 1.3333, "angle": -178.11 },
					{ "time": 1.6667, "angle": 96.96 },
					{ "time": 2, "angle": 0 }
				],
				"scale": [
					{ "time": 0.6667, "x": 1, "y": 1 }
				]
			},
			"XocXOc3": {
				"scale": [
					{ "time": 0, "x": 1, "y": 1 },
					{ "time": 0.1, "x": 1.176, "y": 1.176 },
					{ "time": 0.2, "x": 1, "y": 1 },
					{ "time": 0.3, "x": 1.176, "y": 1.176 },
					{ "time": 0.4, "x": 1, "y": 1 },
					{ "time": 0.5, "x": 1.176, "y": 1.176 },
					{ "time": 0.6, "x": 1, "y": 1 },
					{ "time": 0.7, "x": 1.176, "y": 1.176 },
					{ "time": 0.8, "x": 1, "y": 1 },
					{ "time": 0.9, "x": 1.176, "y": 1.176 },
					{ "time": 1, "x": 1, "y": 1 }
				]
			},
			"XocXOc4": {
				"scale": [
					{ "time": 1, "x": 1, "y": 1 },
					{ "time": 1.1, "x": 1.176, "y": 1.176 },
					{ "time": 1.2, "x": 1, "y": 1 },
					{ "time": 1.3, "x": 1.176, "y": 1.176 },
					{ "time": 1.4, "x": 1, "y": 1 },
					{ "time": 1.5, "x": 1.176, "y": 1.176 },
					{ "time": 1.6, "x": 1, "y": 1 },
					{ "time": 1.7, "x": 1.176, "y": 1.176 },
					{ "time": 1.8, "x": 1, "y": 1 },
					{ "time": 1.9, "x": 1.176, "y": 1.176 },
					{ "time": 2, "x": 1, "y": 1 }
				]
			}
		},
		"drawOrder": [
			{ "time": 0.1 },
			{ "time": 0.3667 },
			{ "time": 0.4333 },
			{ "time": 0.5 },
			{ "time": 0.9 },
			{ "time": 1.1 },
			{ "time": 1.5 },
			{ "time": 1.9333 }
		]
	}
}
}