{
"skeleton": { "hash": "sDme9kvc9Dwz4nXXBOSAS6O1tr0", "spine": "3.6.53", "width": 387.11, "height": 502.14, "images": "./images/" },
"bones": [
	{ "name": "root" },
	{ "name": "Jackpot", "parent": "root", "x": -4.65, "y": -11.42, "color": "ff0000ff" },
	{ "name": "arm2nv3", "parent": "Jackpot", "x": 21.2, "y": -191.78, "scaleX": 1.264, "scaleY": 1.264 },
	{ "name": "arm2nv4", "parent": "arm2nv3", "length": 64.74, "rotation": 98.41, "x": -11.14, "y": 51.24 },
	{ "name": "arm2nv5", "parent": "arm2nv4", "x": 64.74 },
	{ "name": "Ctr_handLnv2", "parent": "arm2nv5", "rotation": 108.8, "x": 58.17, "y": -8.71, "color": "ff0000ff" },
	{ "name": "Ctr_handRnv2", "parent": "arm2nv5", "rotation": 131.4, "x": 56.2, "y": -76.24, "color": "ff0000ff" },
	{ "name": "FX3", "parent": "Jackpot", "x": -12.83, "y": 129.76, "scaleX": 2.466, "scaleY": 2.466, "color": "00ff17ff" },
	{ "name": "Fx8", "parent": "Jackpot", "x": -47.79, "y": 154.92, "color": "ff0000ff" },
	{ "name": "Jackpot3", "parent": "Jackpot", "x": 8.77, "y": 31.29 },
	{ "name": "arm2nv6", "parent": "arm2nv5", "x": 32.02, "y": 0.74 },
	{ "name": "arm2nv8", "parent": "arm2nv5", "x": 81.42, "y": -46.73 },
	{ "name": "arm2nv9", "parent": "arm2nv8", "x": 17.4, "y": 21.82 },
	{ "name": "arm2nv10", "parent": "arm2nv8", "length": 29.64, "rotation": -158.25, "x": 67.21, "y": -19.92 },
	{ "name": "arm2nv11", "parent": "arm2nv10", "length": 28.39, "rotation": -18.6, "x": 29.64 },
	{ "name": "arm2nv12", "parent": "arm2nv11", "length": 46.48, "rotation": -17.79, "x": 28.39 },
	{ "name": "armnv2", "parent": "Ctr_handRnv2", "length": 102.73 },
	{ "name": "hair2nv21", "parent": "arm2nv8", "length": 14.26, "rotation": 148.39, "x": 31.26, "y": -23.23 },
	{ "name": "hair2nv31", "parent": "hair2nv21", "length": 12.92, "rotation": -29.65, "x": 14.26 },
	{ "name": "hair2nv41", "parent": "hair2nv31", "length": 11.61, "rotation": -0.89, "x": 12.92 },
	{ "name": "hair2nv51", "parent": "hair2nv41", "length": 11.99, "rotation": 15.09, "x": 11.61 },
	{ "name": "hair3nv21", "parent": "arm2nv8", "length": 38.39, "rotation": 125.93, "x": 46.7, "y": 12.96 },
	{ "name": "hair3nv31", "parent": "hair3nv21", "length": 41.26, "rotation": 15.21, "x": 38.39 },
	{ "name": "hair3nv41", "parent": "hair3nv31", "length": 37.03, "rotation": 9.72, "x": 41.52, "y": 0.16 },
	{ "name": "hair3nv5", "parent": "hair3nv41", "length": 25.9, "rotation": 21.42, "x": 37.39, "y": 0.8 },
	{ "name": "hair4nv2", "parent": "arm2nv8", "length": 51.4, "rotation": 152.82, "x": -44.69, "y": 60.23 },
	{ "name": "hair4nv3", "parent": "hair4nv2", "length": 32.07, "rotation": 1.21, "x": 51.4 },
	{ "name": "hair4nv4", "parent": "hair4nv3", "length": 39.18, "rotation": 23.04, "x": 32.07 },
	{ "name": "hair4nv5", "parent": "hair4nv4", "length": 22.47, "rotation": 21.79, "x": 39.18 },
	{ "name": "hair5nv21", "parent": "arm2nv12", "length": 29.1, "rotation": 1.92, "x": 46.93, "y": -0.5 },
	{ "name": "hair5nv31", "parent": "hair5nv21", "length": 30.23, "rotation": -7.01, "x": 29.1 },
	{ "name": "hair5nv41", "parent": "hair5nv31", "length": 31.39, "rotation": 1, "x": 30.23 },
	{ "name": "hairnv21", "parent": "arm2nv8", "length": 28.65, "rotation": 119.96, "x": 63.96, "y": 14.51 },
	{ "name": "hairnv31", "parent": "hairnv21", "length": 18.17, "rotation": -3.86, "x": 28.65 },
	{ "name": "hairnv41", "parent": "hairnv31", "length": 12.01, "rotation": -9.94, "x": 18.17 },
	{ "name": "hairnv5", "parent": "hairnv41", "length": 16.18, "rotation": 25.91, "x": 12.14, "y": 0.28 },
	{ "name": "hairnv6", "parent": "hairnv5", "length": 16.77, "rotation": 29.89, "x": 16.18 },
	{ "name": "hairnv7", "parent": "hairnv6", "length": 17.44, "rotation": -0.67, "x": 16.77 },
	{ "name": "hand2nv2", "parent": "Ctr_handLnv2", "length": 88.75 }
],
"slots": [
	{ "name": "Rectangle 2", "bone": "Jackpot", "attachment": "Rectangle 2" },
	{ "name": "Layer 21", "bone": "Jackpot" },
	{ "name": "clippingJackpot", "bone": "Jackpot", "attachment": "clippingJackpot" },
	{ "name": "FX5", "bone": "FX3", "attachment": "Comp 6/FX3_00000" },
	{ "name": "hair5nv2", "bone": "hair5nv21", "attachment": "hair5nv2" },
	{ "name": "hair4nv2", "bone": "hair4nv2", "attachment": "hair4nv2" },
	{ "name": "hair3nv2", "bone": "hair3nv21", "attachment": "hair3nv2" },
	{ "name": "hand3nv2", "bone": "hand2nv2", "attachment": "hand3nv2" },
	{ "name": "hand2nv2", "bone": "hand2nv2", "attachment": "hand2nv2" },
	{ "name": "bodynv2", "bone": "arm2nv3", "attachment": "bodynv2" },
	{ "name": "armnv2", "bone": "armnv2", "attachment": "armnv2" },
	{ "name": "hair2nv2", "bone": "hair2nv21", "attachment": "hair2nv2" },
	{ "name": "hairnv2", "bone": "hairnv21", "attachment": "hairnv2" },
	{ "name": "Layer 16", "bone": "Jackpot", "attachment": "Layer 16" },
	{ "name": "Jackpot", "bone": "Jackpot3", "attachment": "Jackpot" },
	{ "name": "FX9", "bone": "Fx8", "attachment": "Comp 7/FX5_00000", "blend": "additive" }
],
"skins": {
	"default": {
		"FX5": {
			"Comp 6/FX3_00000": { "width": 157, "height": 149 },
			"Comp 6/FX3_00001": { "width": 157, "height": 149 },
			"Comp 6/FX3_00002": { "width": 157, "height": 149 },
			"Comp 6/FX3_00003": { "width": 157, "height": 149 },
			"Comp 6/FX3_00004": { "width": 157, "height": 149 },
			"Comp 6/FX3_00005": { "width": 157, "height": 149 },
			"Comp 6/FX3_00006": { "width": 157, "height": 149 },
			"Comp 6/FX3_00007": { "width": 157, "height": 149 },
			"Comp 6/FX3_00008": { "width": 157, "height": 149 },
			"Comp 6/FX3_00009": { "width": 157, "height": 149 },
			"Comp 6/FX3_00010": { "width": 157, "height": 149 },
			"Comp 6/FX3_00011": { "width": 157, "height": 149 },
			"Comp 6/FX3_00012": { "width": 157, "height": 149 },
			"Comp 6/FX3_00013": { "width": 157, "height": 149 },
			"Comp 6/FX3_00014": { "width": 157, "height": 149 },
			"Comp 6/FX3_00015": { "width": 157, "height": 149 },
			"Comp 6/FX3_00016": { "width": 157, "height": 149 },
			"Comp 6/FX3_00017": { "width": 157, "height": 149 },
			"Comp 6/FX3_00018": { "width": 157, "height": 149 },
			"Comp 6/FX3_00019": { "width": 157, "height": 149 },
			"Comp 6/FX3_00020": { "width": 157, "height": 149 },
			"Comp 6/FX3_00021": { "width": 157, "height": 149 },
			"Comp 6/FX3_00022": { "width": 157, "height": 149 },
			"Comp 6/FX3_00023": { "width": 157, "height": 149 },
			"Comp 6/FX3_00024": { "width": 157, "height": 149 }
		},
		"FX9": {
			"Comp 7/FX5_00000": { "width": 157, "height": 149 },
			"Comp 7/FX5_00001": { "width": 157, "height": 149 },
			"Comp 7/FX5_00002": { "width": 157, "height": 149 },
			"Comp 7/FX5_00003": { "width": 157, "height": 149 },
			"Comp 7/FX5_00004": { "width": 157, "height": 149 },
			"Comp 7/FX5_00005": { "width": 157, "height": 149 },
			"Comp 7/FX5_00006": { "width": 157, "height": 149 },
			"Comp 7/FX5_00007": { "width": 157, "height": 149 },
			"Comp 7/FX5_00008": { "width": 157, "height": 149 },
			"Comp 7/FX5_00009": { "width": 157, "height": 149 },
			"Comp 7/FX5_00010": { "width": 157, "height": 149 },
			"Comp 7/FX5_00011": { "width": 157, "height": 149 },
			"Comp 7/FX5_00012": { "width": 157, "height": 149 },
			"Comp 7/FX5_00013": { "width": 157, "height": 149 },
			"Comp 7/FX5_00014": { "width": 157, "height": 149 },
			"Comp 7/FX5_00015": { "width": 157, "height": 149 },
			"Comp 7/FX5_00016": { "width": 157, "height": 149 },
			"Comp 7/FX5_00017": { "width": 157, "height": 149 },
			"Comp 7/FX5_00018": { "width": 157, "height": 149 },
			"Comp 7/FX5_00019": { "width": 157, "height": 149 },
			"Comp 7/FX5_00020": { "width": 157, "height": 149 },
			"Comp 7/FX5_00021": { "width": 157, "height": 149 }
		},
		"Jackpot": {
			"Jackpot": { "x": -0.78, "y": -1.71, "width": 172, "height": 49 }
		},
		"Layer 16": {
			"Layer 16": { "x": 7.49, "y": 97.09, "width": 173, "height": 172 }
		},
		"Rectangle 2": {
			"Rectangle 2": { "x": 8.49, "y": 97.09, "width": 157, "height": 164 }
		},
		"armnv2": {
			"armnv2": { "x": 28.83, "y": 0.08, "rotation": 130.19, "width": 103, "height": 131 }
		},
		"bodynv2": {
			"bodynv2": {
				"type": "mesh",
				"uvs": [ 1, 1, 0.85338, 1, 0, 1, 0, 0.46472, 0, 0.39405, 0, 0, 0.40581, 0, 0.68178, 0, 0.82751, 0, 1, 0, 0.44335, 0.06722, 0.39557, 0.089, 0.3187, 0.12309, 0.3187, 0.16381, 0.33324, 0.22253, 0.33961, 0.23845, 0.2838, 0.24339, 0.20628, 0.27095, 0.12256, 0.29993, 0.02953, 0.34022, 0.04504, 0.52052, 0.09775, 0.56575, 0.13031, 0.61946, 0.17512, 0.65945, 0.16271, 0.7061, 0.15651, 0.74638, 0.11775, 0.7909, 0.09915, 0.8326, 0.07124, 0.85521, 0.04643, 0.91246, 0.97157, 0.9421, 0.91886, 0.8898, 0.85529, 0.82973, 0.77312, 0.77602, 0.74832, 0.73857, 0.70646, 0.72867, 0.66615, 0.70252, 0.6646, 0.67567, 0.69889, 0.62247, 0.74385, 0.56099, 0.83709, 0.50575, 0.91278, 0.43091, 0.94069, 0.35388, 0.95155, 0.30939, 0.96705, 0.22016, 0.94534, 0.14521, 0.92519, 0.07171, 0.3779, 0.02578, 0.27713, 0.06111, 0.20891, 0.10988, 0.21976, 0.15299, 0.26782, 0.1544, 0.37618, 0.25069, 0.40904, 0.27787, 0.44068, 0.30505, 0.45042, 0.32225, 0.47554, 0.33282, 0.53804, 0.32447, 0.61456, 0.3044, 0.64393, 0.29396, 0.67192, 0.28009, 0.68409, 0.264, 0.68409, 0.24514, 0.58013, 0.31477, 0.50892, 0.33133, 0.60499, 0.12071, 0.64727, 0.14374, 0.68232, 0.17429, 0.69057, 0.20531, 0.69263, 0.23444, 0.71696, 0.26919, 0.71284, 0.30678, 0.70768, 0.3425, 0.72006, 0.36694, 0.75717, 0.38903, 0.77676, 0.39936, 0.57782, 0.05918, 0.67061, 0.08503, 0.74588, 0.10852, 0.79949, 0.15411, 0.82526, 0.20064, 0.84279, 0.29409, 0.84795, 0.3486, 0.86032, 0.40077, 0.47407, 0.20062, 0.49925, 0.18795, 0.53658, 0.18162, 0.57739, 0.18162, 0.61385, 0.18439, 0.59215, 0.19983, 0.54613, 0.20774, 0.50533, 0.20695, 0.51661, 0.19785, 0.54569, 0.19626, 0.57521, 0.1931, 0.41094, 0.19231, 0.42049, 0.2018, 0.41789, 0.21961, 0.37621, 0.20655, 0.40573, 0.20655, 0.36791, 0.192, 0.37126, 0.20167, 0.38745, 0.19098, 0.3601, 0.17648, 0.39861, 0.18488, 0.40261, 0.24339, 0.42103, 0.25255, 0.43666, 0.25179, 0.37026, 0.21286, 0.36914, 0.22889, 0.37193, 0.24416, 0.63365, 0.20498, 0.60184, 0.21897, 0.57784, 0.23449, 0.55719, 0.26599, 0.55886, 0.29041, 0.55328, 0.30542, 0.41824, 0.27148, 0.43945, 0.26893, 0.46735, 0.26817, 0.48242, 0.26919, 0.5254, 0.27427, 0.52428, 0.2842, 0.49526, 0.29183, 0.47182, 0.29793, 0.44, 0.29565, 0.43163, 0.28318, 0.46065, 0.28267, 0.48745, 0.28242, 0.51535, 0.28038, 0.46636, 0.21458, 0.47351, 0.23189, 0.48177, 0.24519, 0.47737, 0.25096, 0.457, 0.25196, 0.51908, 0.224, 0.51578, 0.24031, 0.51413, 0.25611, 0.63754, 0.23637, 0.61993, 0.26923, 0.60452, 0.29156, 0.15576, 0.56671, 0.23056, 0.56671, 0.2919, 0.55307, 0.31285, 0.51488, 0.30836, 0.48351, 0.33679, 0.44736, 0.30238, 0.41599, 0.16922, 0.44941, 0.08993, 0.46032, 0.23206, 0.44122, 0.1393, 0.49646, 0.20662, 0.4876, 0.26198, 0.50533, 0.27395, 0.53125, 0.19017, 0.54284, 0.12583, 0.53261, 0.18568, 0.51761, 0.09441, 0.50056, 0.36834, 0.44191, 0.41921, 0.42554, 0.52245, 0.42213, 0.60922, 0.42827, 0.66757, 0.45555, 0.70796, 0.4951, 0.7334, 0.53875, 0.693, 0.56944, 0.61521, 0.5858, 0.50898, 0.59399, 0.40874, 0.57898, 0.32196, 0.55443, 0.3863, 0.51079, 0.41472, 0.47873, 0.47158, 0.46305, 0.53441, 0.45759, 0.6182, 0.47532, 0.66159, 0.51283, 0.66458, 0.54693, 0.59127, 0.55648, 0.50449, 0.55102, 0.43268, 0.53466, 0.48654, 0.5142, 0.56434, 0.51488, 0.33422, 0.59924, 0.33422, 0.64766, 0.3447, 0.69676, 0.36265, 0.76087, 0.3836, 0.81611, 0.39856, 0.8543, 0.47785, 0.6497, 0.4988, 0.69403, 0.52274, 0.75268, 0.54667, 0.81065, 0.5766, 0.8427, 0.2265, 0.63061, 0.24146, 0.66334, 0.25493, 0.70903, 0.26391, 0.76018, 0.27288, 0.81679, 0.28036, 0.85634, 0.26989, 0.90529, 0.28635, 0.98099, 0.421, 0.89575, 0.44344, 0.96053, 0.61849, 0.94826, 0.60652, 0.88893, 0.72621, 0.81323, 0.78306, 0.87665, 0.84291, 0.95985, 0.85805, 0.25281, 0.96348, 0.25988, 0.73402, 0.24009, 0.72627, 0.20051, 0.72472, 0.17013, 0.38434, 0.29594, 0.30167, 0.32511, 0.22701, 0.36097, 0.13367, 0.39744, 0.09367, 0.43147, 0.6304, 0.32445, 0.62374, 0.36882, 0.5824, 0.37307, 0.4984, 0.3907, 0.44774, 0.40225, 0.40507, 0.37186, 0.4224, 0.40346, 0.38059, 0.15422, 0.4325, 0.15154, 0.50784, 0.1504, 0.57984, 0.14964, 0.62003, 0.16108, 0.55724, 0.11338, 0.49026, 0.10651, 0.43836, 0.11147, 0.41324, 0.11987, 0.35212, 0.13094, 0.54217, 0.15101 ],
				"triangles": [ 201, 200, 202, 188, 200, 199, 188, 199, 187, 202, 200, 188, 193, 202, 192, 202, 188, 192, 199, 198, 187, 192, 188, 191, 198, 186, 187, 198, 197, 186, 188, 187, 191, 187, 186, 191, 197, 185, 186, 186, 190, 191, 190, 185, 189, 190, 186, 185, 197, 196, 185, 196, 184, 185, 183, 184, 194, 184, 196, 195, 189, 184, 169, 189, 185, 184, 190, 189, 168, 194, 184, 195, 32, 40, 41, 40, 83, 41, 40, 75, 83, 41, 83, 42, 83, 82, 42, 0, 42, 43, 210, 0, 43, 9, 210, 44, 81, 82, 74, 42, 82, 43, 82, 81, 43, 81, 209, 43, 43, 209, 210, 211, 80, 81, 81, 80, 209, 210, 209, 44, 44, 209, 45, 209, 80, 45, 44, 45, 9, 80, 79, 45, 79, 46, 45, 45, 46, 9, 232, 228, 227, 236, 228, 231, 122, 123, 129, 128, 119, 120, 119, 128, 127, 123, 128, 129, 122, 121, 115, 121, 114, 115, 122, 129, 121, 118, 106, 107, 128, 120, 129, 120, 137, 129, 129, 137, 121, 121, 137, 114, 117, 105, 106, 114, 113, 139, 113, 112, 139, 139, 112, 138, 119, 133, 120, 133, 132, 120, 120, 132, 137, 118, 134, 119, 119, 134, 133, 137, 136, 114, 114, 136, 90, 136, 135, 90, 114, 90, 113, 137, 132, 136, 107, 106, 97, 133, 134, 131, 106, 105, 97, 131, 134, 130, 134, 107, 130, 107, 97, 130, 133, 131, 132, 136, 132, 91, 105, 99, 97, 132, 131, 91, 136, 91, 135, 112, 111, 138, 138, 111, 68, 90, 94, 113, 113, 89, 112, 113, 94, 89, 131, 84, 91, 131, 130, 84, 91, 92, 135, 135, 92, 90, 97, 96, 130, 97, 99, 96, 112, 88, 111, 112, 89, 88, 130, 96, 84, 92, 93, 90, 90, 93, 94, 84, 85, 91, 91, 85, 92, 102, 104, 99, 99, 95, 96, 99, 104, 95, 111, 67, 68, 88, 230, 111, 111, 66, 67, 111, 230, 66, 84, 96, 227, 96, 95, 227, 84, 227, 85, 94, 87, 89, 89, 87, 88, 92, 86, 93, 92, 85, 86, 94, 93, 87, 87, 93, 86, 85, 227, 228, 95, 104, 227, 85, 228, 86, 88, 87, 230, 86, 236, 87, 86, 228, 236, 87, 229, 230, 87, 236, 229, 229, 65, 230, 230, 65, 66, 229, 236, 231, 229, 231, 65, 228, 232, 231, 104, 226, 227, 72, 59, 60, 57, 222, 64, 110, 52, 15, 223, 55, 56, 222, 56, 64, 57, 63, 221, 224, 54, 55, 54, 214, 53, 219, 63, 58, 81, 70, 211, 70, 81, 71, 72, 60, 71, 55, 124, 56, 56, 123, 64, 56, 124, 123, 64, 122, 57, 122, 64, 123, 57, 116, 63, 57, 122, 116, 219, 58, 59, 55, 54, 124, 116, 115, 63, 63, 140, 58, 63, 115, 140, 60, 61, 71, 71, 61, 70, 116, 122, 115, 54, 53, 126, 53, 117, 126, 126, 125, 54, 124, 125, 127, 124, 54, 125, 59, 58, 139, 124, 127, 128, 124, 128, 123, 214, 52, 53, 125, 126, 127, 58, 140, 139, 59, 139, 60, 139, 140, 114, 140, 115, 114, 126, 117, 118, 126, 118, 127, 106, 118, 117, 127, 118, 119, 139, 138, 60, 61, 138, 62, 61, 60, 138, 52, 105, 53, 53, 105, 117, 16, 50, 51, 18, 49, 50, 70, 62, 69, 70, 69, 211, 118, 107, 134, 70, 61, 62, 52, 110, 105, 69, 62, 68, 15, 109, 110, 110, 109, 105, 99, 105, 109, 109, 108, 98, 99, 109, 98, 16, 51, 13, 69, 212, 211, 211, 212, 80, 62, 138, 68, 69, 68, 212, 109, 14, 108, 108, 14, 101, 14, 103, 100, 14, 13, 103, 108, 101, 98, 101, 14, 100, 98, 102, 99, 98, 101, 102, 212, 68, 213, 101, 100, 102, 212, 79, 80, 68, 67, 213, 212, 213, 79, 100, 103, 102, 102, 103, 104, 232, 227, 233, 103, 226, 104, 13, 235, 103, 103, 235, 226, 78, 213, 67, 67, 66, 77, 213, 78, 79, 78, 67, 77, 13, 12, 235, 13, 51, 12, 48, 12, 51, 226, 234, 227, 226, 235, 234, 79, 8, 46, 79, 78, 8, 51, 50, 49, 227, 234, 233, 66, 65, 77, 235, 11, 234, 235, 12, 11, 51, 49, 48, 11, 12, 47, 231, 76, 65, 65, 76, 77, 234, 11, 233, 231, 232, 76, 233, 10, 232, 233, 11, 10, 49, 5, 48, 77, 7, 78, 78, 7, 8, 232, 10, 76, 12, 48, 47, 11, 47, 10, 77, 76, 7, 46, 8, 9, 47, 6, 10, 10, 6, 76, 47, 48, 6, 76, 6, 7, 6, 48, 5, 145, 146, 171, 146, 159, 171, 171, 172, 180, 181, 180, 172, 181, 172, 173, 173, 172, 160, 157, 151, 152, 181, 174, 182, 181, 173, 174, 171, 159, 172, 145, 153, 150, 151, 148, 152, 153, 152, 150, 152, 148, 150, 150, 147, 145, 145, 147, 146, 173, 161, 174, 146, 147, 159, 28, 3, 20, 21, 26, 20, 167, 168, 178, 168, 167, 190, 166, 167, 177, 167, 166, 38, 183, 143, 170, 143, 183, 194, 143, 194, 142, 142, 154, 143, 189, 169, 168, 168, 180, 179, 179, 180, 181, 169, 180, 168, 184, 183, 169, 194, 141, 142, 142, 141, 155, 38, 166, 39, 22, 21, 141, 169, 170, 171, 170, 169, 183, 178, 179, 182, 178, 168, 179, 167, 178, 177, 169, 171, 180, 166, 165, 39, 166, 177, 165, 21, 156, 141, 155, 141, 157, 154, 142, 153, 20, 158, 21, 21, 158, 156, 39, 165, 40, 178, 176, 177, 178, 175, 176, 178, 182, 175, 143, 144, 170, 171, 170, 144, 143, 154, 144, 179, 181, 182, 177, 164, 165, 177, 176, 164, 141, 156, 157, 142, 155, 153, 153, 157, 152, 153, 155, 157, 165, 164, 40, 156, 151, 157, 156, 158, 151, 154, 153, 144, 20, 149, 158, 20, 3, 149, 182, 174, 175, 153, 145, 144, 171, 144, 145, 176, 163, 164, 176, 175, 163, 164, 75, 40, 158, 149, 151, 151, 149, 148, 164, 74, 75, 164, 163, 74, 173, 160, 223, 160, 225, 223, 172, 159, 160, 174, 162, 175, 175, 162, 163, 149, 3, 218, 173, 222, 161, 173, 223, 222, 149, 218, 148, 218, 3, 4, 174, 161, 162, 162, 220, 163, 163, 220, 73, 220, 72, 73, 163, 73, 74, 72, 220, 219, 59, 72, 219, 218, 217, 148, 150, 148, 216, 225, 160, 159, 148, 217, 216, 150, 216, 147, 217, 218, 19, 161, 221, 162, 162, 221, 220, 159, 147, 224, 225, 159, 224, 161, 222, 221, 222, 57, 221, 216, 215, 147, 224, 215, 214, 214, 215, 52, 147, 215, 224, 225, 224, 223, 223, 56, 222, 223, 224, 55, 75, 82, 83, 75, 74, 82, 218, 4, 19, 19, 18, 217, 217, 18, 216, 4, 5, 19, 221, 63, 220, 54, 224, 214, 220, 63, 219, 72, 71, 73, 71, 74, 73, 81, 74, 71, 18, 17, 216, 216, 17, 215, 19, 5, 18, 52, 215, 15, 17, 16, 215, 215, 16, 15, 17, 18, 50, 16, 17, 50, 49, 18, 5, 16, 14, 15, 16, 13, 14, 15, 14, 109, 1, 30, 0, 2, 201, 1, 201, 2, 29, 201, 203, 1, 9, 0, 210, 201, 29, 200, 200, 29, 27, 29, 28, 27, 200, 27, 199, 199, 27, 26, 26, 198, 199, 203, 204, 1, 1, 204, 208, 204, 207, 208, 30, 208, 31, 30, 1, 208, 25, 196, 197, 25, 24, 196, 28, 29, 3, 29, 2, 3, 201, 202, 203, 203, 205, 204, 203, 193, 205, 193, 203, 202, 208, 32, 31, 208, 207, 32, 207, 205, 206, 207, 204, 205, 30, 41, 42, 30, 42, 0, 24, 195, 196, 24, 23, 195, 198, 26, 25, 198, 25, 197, 32, 41, 31, 30, 31, 41, 205, 193, 206, 206, 33, 207, 207, 33, 32, 27, 28, 26, 26, 28, 20, 193, 35, 206, 193, 36, 35, 193, 192, 36, 33, 40, 32, 206, 34, 33, 206, 35, 34, 192, 191, 36, 25, 26, 24, 26, 21, 22, 33, 34, 40, 190, 36, 191, 36, 190, 37, 37, 190, 167, 24, 26, 22, 34, 38, 39, 34, 39, 40, 35, 37, 38, 34, 35, 38, 24, 22, 23, 35, 36, 37, 37, 167, 38, 23, 194, 195, 194, 23, 141, 23, 22, 141 ],
				"vertices": [ 1, 2, 63.54, 2.45, 1, 1, 2, 44.63, 2.45, 1, 1, 2, -65.46, 2.45, 1, 1, 4, 44.8, 38.71, 1, 1, 4, 64.59, 35.78, 1, 1, 4, 174.9, 19.47, 1, 1, 11, 85.82, 14.41, 1, 1, 11, 80.61, -20.81, 1, 1, 11, 77.86, -39.41, 1, 1, 11, 74.61, -61.42, 1, 1, 11, 66.3, 12.4, 1, 1, 11, 61.1, 19.4, 1, 1, 11, 53.01, 30.62, 1, 1, 11, 41.61, 32.31, 1, 1, 4, 106.32, -13.84, 1, 1, 4, 101.74, -14, 1, 1, 4, 101.41, -6.67, 1, 1, 4, 95.16, 4.36, 1, 1, 4, 88.62, 16.25, 1, 1, 4, 79.1, 29.78, 1, 1, 4, 28.33, 35.27, 1, 1, 4, 14.67, 30.42, 1, 1, 3, 63.76, 28.49, 1, 1, 3, 51.72, 24.42, 1, 1, 3, 38.9, 27.94, 1, 1, 3, 27.74, 30.4, 1, 1, 3, 16, 37.19, 1, 1, 3, 4.68, 41.29, 1, 1, 3, -1.12, 45.78, 1, 1, 3, -16.68, 51.32, 1, 1, 3, -42.44, -65.51, 1, 1, 3, -26.8, -60.95, 1, 1, 3, -8.79, -55.33, 1, 1, 3, 7.8, -47.06, 1, 1, 3, 18.75, -45.45, 1, 1, 3, 22.31, -40.52, 1, 1, 3, 30.4, -36.45, 1, 1, 3, 37.94, -37.37, 1, 1, 3, 52.19, -43.95, 1, 1, 4, 3.81, -52.23, 1, 2, 15, 76.02, 6.65, 0.368, 29, 29.31, 6.17, 0.632, 2, 15, 53.91, 14.06, 0.368, 29, 7.46, 14.32, 0.632, 2, 14, 63.38, 4.82, 0.56, 15, 31.85, 15.28, 0.44, 2, 14, 51.33, 8.71, 0.56, 15, 19.18, 15.31, 0.44, 2, 14, 26.99, 15.74, 0.608, 15, -6.14, 14.56, 0.392, 1, 14, 5.65, 17.25, 1, 1, 14, -15.25, 18.87, 1, 1, 11, 79.13, 19.04, 1, 1, 11, 71.14, 33.36, 1, 1, 11, 58.78, 44.08, 1, 1, 11, 46.5, 44.48, 1, 1, 11, 45.2, 38.41, 1, 1, 11, 16.2, 28.57, 1, 2, 11, 7.97, 25.5, 0.97936, 12, -9.43, 3.68, 0.02064, 1, 11, -0.24, 22.59, 1, 1, 11, -5.23, 22.06, 1, 1, 11, -8.67, 19.29, 1, 1, 11, -7.51, 10.97, 1, 1, 11, -3.33, 0.37, 1, 1, 11, -0.97, -3.81, 1, 1, 11, 2.39, -7.96, 1, 1, 11, 6.66, -10.18, 1, 1, 11, 11.94, -10.96, 1, 1, 11, -5.59, 5.19, 1, 1, 11, -8.88, 14.97, 1, 2, 11, 48.27, -6.01, 0.37129, 12, 30.87, -27.84, 0.62871, 2, 11, 41.02, -10.45, 0.48619, 12, 23.63, -32.28, 0.51381, 2, 11, 31.81, -13.66, 0.35551, 12, 14.42, -35.49, 0.64449, 2, 11, 22.97, -13.43, 0.42575, 12, 5.58, -35.25, 0.57425, 1, 11, 14.78, -12.49, 1, 1, 11, 4.59, -14.16, 1, 1, 11, -5.86, -12.07, 1, 1, 4, 65.66, -56.66, 1, 1, 4, 58.59, -57.23, 1, 1, 4, 51.7, -61.05, 1, 1, 4, 48.44, -63.12, 1, 1, 11, 66.01, -5.09, 1, 1, 11, 57.02, -15.87, 1, 1, 11, 49.02, -24.5, 1, 2, 11, 35.25, -29.45, 0.74632, 14, 4.35, -1.69, 0.25368, 1, 14, 17.91, -1.07, 1, 2, 14, 44.27, -4.16, 0.56, 15, 16.4, 0.89, 0.44, 2, 14, 59.52, -6.61, 0.56, 15, 31.66, 3.22, 0.44, 2, 15, 46.16, 6.41, 0.368, 29, -0.54, 6.93, 0.632, 2, 11, 28.37, 14, 0.358, 12, 10.97, -7.82, 0.642, 2, 11, 31.44, 10.26, 0.358, 12, 14.05, -11.56, 0.642, 2, 11, 32.51, 5.24, 0.28286, 12, 15.11, -16.59, 0.71714, 2, 11, 31.74, 0.03, 0.04184, 12, 14.34, -21.79, 0.95816, 2, 11, 30.28, -4.51, 0.23305, 12, 12.88, -26.33, 0.76695, 2, 11, 26.36, -1.1, 0.08912, 12, 8.97, -22.92, 0.91088, 2, 11, 25.02, 5.1, 0.26736, 12, 7.62, -16.72, 0.73264, 2, 11, 26.01, 10.28, 0.358, 12, 8.61, -11.55, 0.642, 2, 11, 28.34, 8.46, 0.358, 12, 10.95, -13.37, 0.642, 2, 11, 28.24, 4.68, 0.30544, 12, 10.84, -17.14, 0.69456, 2, 11, 28.57, 0.78, 0.11166, 12, 11.17, -21.04, 0.88834, 2, 11, 31.89, 21.71, 0.39414, 12, 14.49, -0.11, 0.60586, 2, 11, 29.05, 20.89, 0.31934, 12, 11.65, -0.94, 0.68066, 2, 11, 24.11, 21.96, 0.33461, 12, 6.72, 0.13, 0.66539, 2, 11, 28.56, 26.74, 0.97455, 12, 11.16, 4.91, 0.02545, 2, 11, 28, 22.97, 0.40849, 12, 10.6, 1.15, 0.59151, 1, 11, 32.79, 27.19, 1, 1, 11, 30.02, 27.17, 1, 2, 11, 32.7, 24.66, 0.54649, 12, 15.31, 2.83, 0.45351, 1, 11, 37.28, 27.55, 1, 2, 11, 34.2, 22.98, 0.50074, 12, 16.81, 1.16, 0.49926, 2, 11, 17.74, 24.89, 0.12223, 12, 0.35, 3.07, 0.87777, 2, 11, 14.83, 22.92, 0.02724, 12, -2.56, 1.1, 0.97276, 2, 11, 14.75, 20.89, 0.406, 12, -2.65, -0.93, 0.594, 1, 11, 26.9, 27.76, 1, 1, 11, 22.44, 28.56, 1, 1, 11, 18.11, 28.84, 1, 2, 11, 24.14, -6.18, 0.22837, 12, 6.74, -28.01, 0.77163, 2, 11, 20.82, -1.54, 0.20269, 12, 3.43, -23.37, 0.79731, 2, 11, 16.93, 2.16, 0.20307, 12, -0.47, -19.66, 0.79693, 2, 11, 8.5, 6.1, 0.4418, 12, -8.89, -15.72, 0.5582, 2, 11, 1.63, 6.9, 0.59399, 12, -15.76, -14.92, 0.40601, 2, 11, -2.46, 8.23, 0.82421, 12, -19.86, -13.59, 0.17579, 2, 11, 9.59, 24.06, 0.89962, 12, -7.81, 2.24, 0.10038, 2, 11, 9.9, 21.25, 0.75849, 12, -7.5, -0.57, 0.24151, 2, 11, 9.59, 17.66, 0.26242, 12, -7.81, -4.17, 0.73758, 2, 11, 9.02, 15.77, 0.16881, 12, -8.38, -6.05, 0.83119, 2, 11, 6.78, 10.5, 0.076, 12, -10.61, -11.32, 0.924, 2, 11, 4.03, 11.05, 0.3928, 12, -13.37, -10.77, 0.6072, 2, 11, 2.44, 15.07, 0.46775, 12, -14.96, -6.75, 0.53225, 2, 11, 1.17, 18.32, 0.748, 12, -16.23, -3.5, 0.252, 2, 11, 2.41, 22.28, 0.94903, 12, -14.99, 0.46, 0.05097, 2, 11, 6.06, 22.84, 0.87724, 12, -11.34, 1.01, 0.12276, 2, 11, 5.65, 19.11, 0.59173, 12, -11.74, -2.71, 0.40827, 2, 11, 5.22, 15.68, 0.36486, 12, -12.18, -6.14, 0.63514, 2, 11, 5.26, 12.04, 0.34, 12, -12.13, -9.79, 0.66, 2, 11, 24.61, 15.56, 0.358, 12, 7.21, -6.26, 0.642, 2, 11, 19.63, 15.37, 0.406, 12, 2.23, -6.46, 0.594, 2, 11, 15.75, 14.86, 0.38156, 12, -1.65, -6.96, 0.61844, 2, 11, 14.22, 15.67, 0.34326, 12, -3.18, -6.16, 0.65674, 2, 11, 14.32, 18.31, 0.406, 12, -3.08, -3.52, 0.594, 2, 11, 20.98, 9.23, 0.34828, 12, 3.58, -12.6, 0.65172, 2, 11, 16.47, 10.32, 0.3214, 12, -0.92, -11.5, 0.6786, 2, 11, 12.08, 11.19, 0.13279, 12, -5.32, -10.64, 0.86721, 2, 11, 15.28, -5.38, 0.38284, 12, -2.12, -27.2, 0.61716, 2, 11, 6.41, -1.77, 0.80991, 12, -10.99, -23.59, 0.19009, 2, 11, 0.45, 1.12, 0.86186, 12, -16.95, -20.7, 0.13814, 1, 4, 13.31, 23.05, 1, 1, 4, 11.9, 13.51, 1, 2, 4, 14.56, 5.12, 0.8, 10, -17.46, 4.38, 0.2, 2, 4, 24.86, 0.86, 0.64, 10, -7.17, 0.13, 0.36, 2, 4, 33.72, 0.14, 0.448, 10, 1.7, -0.6, 0.552, 2, 4, 43.31, -4.99, 0.324, 10, 11.28, -5.72, 0.676, 2, 4, 52.74, -1.9, 0.56466, 10, 20.72, -2.63, 0.43534, 2, 4, 45.9, 16.48, 0.38066, 10, 13.87, 15.74, 0.61934, 2, 4, 44.34, 27.05, 0.97255, 10, 12.32, 26.31, 0.02745, 2, 4, 47, 8.12, 0.34, 10, 14.98, 7.39, 0.66, 2, 4, 33.29, 22.25, 0.54165, 10, 1.26, 21.51, 0.45835, 2, 4, 34.5, 13.29, 0.34, 10, 2.48, 12.55, 0.66, 2, 4, 28.49, 6.96, 0.66139, 10, -3.53, 6.22, 0.33861, 2, 4, 21.01, 6.5, 0.664, 10, -11.01, 5.77, 0.336, 2, 4, 19.34, 17.67, 0.696, 10, -12.68, 16.94, 0.304, 1, 4, 23.42, 25.46, 1, 2, 4, 26.49, 17.2, 0.56398, 10, -5.53, 16.47, 0.43602, 2, 4, 32.99, 28.14, 0.91162, 10, 0.97, 27.41, 0.08838, 2, 4, 44.24, -9.24, 0.41937, 10, 12.22, -9.98, 0.58063, 2, 4, 47.86, -16.41, 0.70757, 10, 15.84, -17.15, 0.29243, 2, 4, 46.87, -29.73, 0.78644, 10, 14.84, -30.46, 0.21356, 2, 4, 43.51, -40.55, 0.86824, 10, 11.49, -41.28, 0.13176, 2, 4, 34.77, -46.86, 0.86256, 10, 2.75, -47.6, 0.13744, 1, 4, 22.94, -50.38, 1, 1, 4, 10.24, -51.82, 1, 1, 4, 2.41, -45.39, 1, 1, 4, -0.71, -34.79, 1, 1, 4, -0.99, -20.89, 1, 1, 4, 5.1, -8.72, 1, 2, 4, 13.61, 1.34, 0.8, 10, -18.41, 0.6, 0.2, 2, 4, 24.62, -8.68, 0.4721, 10, -7.41, -9.42, 0.5279, 2, 4, 33.05, -13.64, 0.38, 10, 1.03, -14.37, 0.62, 2, 4, 36.37, -21.54, 0.34, 10, 4.35, -22.28, 0.66, 2, 4, 36.71, -29.78, 0.34, 10, 4.69, -30.52, 0.66, 2, 4, 30.17, -39.74, 0.63801, 10, -1.85, -40.48, 0.36199, 2, 4, 18.85, -43.73, 0.84904, 10, -13.17, -44.46, 0.15096, 1, 4, 9.25, -42.7, 1, 2, 4, 7.96, -32.95, 0.8656, 10, -24.07, -33.68, 0.1344, 2, 4, 11.12, -22.1, 0.73432, 10, -20.9, -22.83, 0.26568, 2, 4, 17.06, -13.61, 0.58275, 10, -14.96, -14.35, 0.41725, 2, 4, 21.77, -21.33, 0.34, 10, -10.25, -22.07, 0.66, 2, 4, 20.11, -31.23, 0.62978, 10, -11.91, -31.97, 0.37022, 1, 4, 0.84, 1.63, 1, 2, 3, 52.02, 3.63, 0.448, 6, 105.49, -1.12, 0.552, 2, 3, 38.08, 4.33, 0.448, 6, 115.23, 8.88, 0.552, 2, 3, 19.79, 4.69, 0.448, 6, 127.6, 22.36, 0.552, 2, 3, 3.93, 4.3, 0.448, 6, 137.79, 34.51, 0.552, 2, 3, -7.04, 3.98, 0.448, 6, 144.8, 42.96, 0.552, 2, 3, 48.74, -14.61, 0.448, 6, 93.97, 13.41, 0.552, 2, 3, 35.93, -15.45, 0.448, 6, 101.81, 23.57, 0.552, 2, 3, 19.06, -16.08, 0.448, 6, 112.5, 36.64, 0.552, 2, 3, 2.38, -16.73, 0.448, 6, 123.04, 49.59, 0.552, 2, 3, -7.16, -19.22, 0.448, 6, 127.48, 58.39, 0.552, 2, 3, 58.83, 16.67, 0.448, 6, 110.77, -14.84, 0.552, 2, 3, 49.38, 16.12, 0.448, 6, 116.6, -7.39, 0.552, 2, 3, 36.33, 16.29, 0.448, 6, 125.36, 2.28, 0.552, 2, 3, 21.84, 17.26, 0.448, 6, 135.67, 12.51, 0.552, 2, 3, 5.83, 18.46, 0.448, 6, 147.16, 23.73, 0.552, 2, 3, -5.39, 19.14, 0.448, 6, 155.09, 31.69, 0.552, 2, 3, -18.89, 22.51, 0.448, 6, 166.54, 39.6, 0.552, 1, 2, -28.52, 7.83, 1, 2, 3, -19.07, 2.83, 0.448, 6, 151.9, 52.74, 0.552, 1, 3, -37.63, 2.65, 1, 1, 3, -37.5, -20.2, 1, 2, 3, -20.66, -21.13, 0.448, 6, 134.98, 69.78, 0.552, 1, 3, -1.73, -39.54, 1, 1, 3, -20.56, -44.17, 1, 1, 3, -44.98, -48.36, 1, 2, 14, 33.23, 0.11, 0.56, 15, 4.57, 1.58, 0.44, 2, 14, 37.91, 13.03, 0.56, 15, 5.09, 15.32, 0.44, 1, 11, 12.41, -17.54, 1, 1, 11, 23.64, -18.19, 1, 1, 11, 32.18, -19.25, 1, 1, 4, 84.8, -17.33, 1, 3, 4, 78.19, -5.57, 0.92059, 11, -3.23, 41.16, 0.07816, 12, -20.62, 19.33, 0.00125, 1, 4, 69.56, 5.44, 1, 1, 4, 61.12, 18.86, 1, 1, 4, 52.34, 25.38, 1, 1, 4, 72.17, -47.55, 1, 1, 4, 59.88, -44.86, 1, 1, 4, 59.47, -39.41, 1, 1, 4, 56.12, -27.96, 1, 1, 4, 53.84, -21.02, 1, 1, 4, 63.16, -16.83, 1, 1, 4, 53.98, -17.73, 1, 2, 11, 43.13, 24.01, 0.86344, 12, 25.73, 2.19, 0.13656, 2, 11, 42.89, 17.28, 0.42426, 12, 25.5, -4.55, 0.57574, 2, 11, 41.79, 7.61, 0.31947, 12, 24.4, -14.21, 0.68053, 2, 11, 40.65, -1.61, 0.11797, 12, 23.25, -23.43, 0.88203, 2, 11, 36.68, -6.26, 0.3234, 12, 19.29, -28.08, 0.6766, 2, 11, 51.22, -0.22, 0.63495, 12, 33.83, -22.05, 0.36505, 2, 11, 54.41, 8.04, 0.74091, 12, 37.01, -13.78, 0.25909, 2, 11, 54, 14.87, 0.78508, 12, 36.61, -6.95, 0.21492, 2, 11, 52.12, 18.42, 0.84867, 12, 34.73, -3.4, 0.15133, 2, 11, 50.18, 26.68, 0.94715, 12, 32.78, 4.86, 0.05285, 2, 11, 40.97, 3.26, 0.27699, 12, 23.58, -18.57, 0.72301 ],
				"hull": 10,
				"edges": [ 0, 18, 8, 10, 4, 6, 6, 8, 16, 18, 14, 16, 10, 12, 12, 14, 104, 106, 106, 108, 108, 110, 110, 112, 116, 118, 118, 120, 120, 122, 122, 124, 114, 126, 126, 116, 112, 128, 128, 114, 190, 192, 192, 194, 206, 208, 208, 190, 194, 210, 210, 212, 212, 214, 0, 2, 2, 4 ],
				"width": 129,
				"height": 283
			}
		},
		"clippingJackpot": {
			"clippingJackpot": {
				"type": "clipping",
				"end": "hairnv2",
				"vertexCount": 4,
				"vertices": [ -65.96, 172.64, 84.77, 173.79, 83.87, 15.16, -69.64, 17.57 ],
				"color": "ce3a3aff"
			}
		},
		"hair2nv2": {
			"hair2nv2": {
				"type": "mesh",
				"uvs": [ 0.79432, 0.09896, 0.76866, 0.21569, 0.67332, 0.30908, 0.56699, 0.41706, 0.47532, 0.46667, 0.31399, 0.55422, 0.18199, 0.62718, 0.10866, 0.72057, 0.02433, 0.84606, 0, 1, 0.07566, 1, 0.13432, 0.884, 0.21132, 0.77893, 0.32132, 0.70014, 0.42399, 0.65636, 0.56332, 0.57465, 0.69166, 0.51628, 0.86032, 0.40247, 0.99232, 0.25363, 1, 0.10771, 1, 0, 0.86766, 0, 0.87499, 0.11063, 0.87132, 0.24779, 0.74666, 0.35577, 0.62199, 0.46083, 0.52299, 0.53963, 0.37266, 0.61843, 0.23699, 0.65636, 0.16366, 0.74683, 0.08666, 0.84898 ],
				"triangles": [ 11, 10, 30, 30, 10, 8, 10, 9, 8, 11, 29, 12, 11, 30, 29, 30, 7, 29, 30, 8, 7, 12, 29, 28, 29, 7, 6, 12, 28, 13, 29, 6, 28, 13, 27, 14, 13, 28, 27, 14, 27, 26, 28, 5, 27, 28, 6, 5, 27, 5, 4, 14, 26, 15, 27, 4, 26, 15, 25, 16, 15, 26, 25, 26, 3, 25, 26, 4, 3, 16, 25, 24, 25, 3, 2, 16, 24, 17, 25, 2, 24, 17, 23, 18, 17, 24, 23, 24, 1, 23, 24, 2, 1, 23, 22, 18, 18, 22, 19, 23, 1, 22, 22, 1, 0, 20, 19, 22, 22, 0, 21, 22, 21, 20 ],
				"vertices": [ 1, 17, 0.45, -2.62, 1, 1, 17, 6.1, -1.29, 1, 2, 17, 11.77, -2.9, 0.82838, 18, -0.73, -3.75, 0.17162, 1, 18, 5.77, -2.04, 1, 1, 18, 10.09, -2.26, 1, 1, 19, 4.82, -2.57, 1, 2, 19, 11.09, -2.73, 0.79562, 20, -1.21, -2.5, 0.20438, 1, 20, 4.15, -1.87, 1, 1, 20, 11, -0.6, 1, 1, 20, 17.49, 3.37, 1, 1, 20, 15.64, 5.67, 1, 1, 20, 9.78, 3.91, 1, 2, 19, 14.56, 3.94, 0.01893, 20, 3.88, 3.04, 0.98107, 2, 19, 8.82, 3.37, 0.94204, 20, -1.82, 3.98, 0.05796, 2, 18, 17.3, 3.94, 0.01345, 19, 4.32, 4.01, 0.98655, 2, 18, 10.55, 4.03, 0.92055, 19, -2.43, 3.99, 0.07945, 1, 18, 4.84, 4.77, 1, 2, 17, 13.1, 5.6, 0.88479, 18, -3.78, 4.3, 0.11521, 1, 17, 4.37, 7.46, 1, 1, 17, -2.32, 4.92, 1, 1, 17, -7.17, 2.84, 1, 1, 17, -5.14, -1.9, 1, 1, 17, -0.27, 0.49, 1, 1, 17, 5.97, 3.01, 1, 1, 17, 12.74, 0.63, 1, 1, 18, 5.36, 0.96, 1, 2, 18, 10.77, 1.71, 0.96099, 19, -2.17, 1.68, 0.03901, 1, 19, 4.84, 1.32, 1, 1, 19, 10.2, -0.31, 1, 2, 19, 15.13, 1.58, 6.5E-4, 20, 3.81, 0.6, 0.99935, 1, 20, 9.6, 1.39, 1 ],
				"hull": 22,
				"edges": [ 0, 2, 2, 4, 4, 6, 6, 8, 8, 10, 10, 12, 12, 14, 14, 16, 16, 18, 18, 20, 20, 22, 22, 24, 24, 26, 26, 28, 28, 30, 30, 32, 32, 34, 34, 36, 36, 38, 38, 40, 40, 42, 0, 42 ],
				"width": 39,
				"height": 49
			}
		},
		"hair3nv2": {
			"hair3nv2": {
				"type": "mesh",
				"uvs": [ 0.99217, 0.10048, 0.92095, 0.15372, 0.84379, 0.21723, 0.7686, 0.2686, 0.72903, 0.34052, 0.6954, 0.39469, 0.59845, 0.44887, 0.45402, 0.49276, 0.39863, 0.53106, 0.3828, 0.56837, 0.43028, 0.62535, 0.49162, 0.70007, 0.48172, 0.75985, 0.41841, 0.8299, 0.27992, 0.86632, 0.12559, 0.85605, 0.1157, 0.79254, 0.07415, 0.72715, 0.0326, 0.67672, 0.00886, 0.60854, 0.02865, 0.54129, 0.0702, 0.47735, 0.09394, 0.41571, 0.16714, 0.34099, 0.20869, 0.28962, 0.27398, 0.22423, 0.34125, 0.1738, 0.4105, 0.12523, 0.55295, 0.07012, 0.71519, 0.04023, 0.89325, 0.03276, 1, 0.03743, 0.92886, 0.07573, 0.8062, 0.10001, 0.70331, 0.13364, 0.62813, 0.17753, 0.54899, 0.23918, 0.50349, 0.3083, 0.45402, 0.3634, 0.34989, 0.42703, 0.28065, 0.47933, 0.23119, 0.52697, 0.19953, 0.59608, 0.22723, 0.67921, 0.25493, 0.72591, 0.28856, 0.79223 ],
				"triangles": [ 14, 45, 13, 14, 15, 45, 45, 16, 44, 45, 15, 16, 13, 45, 12, 16, 43, 44, 16, 17, 43, 12, 45, 10, 45, 44, 10, 12, 10, 11, 43, 17, 42, 44, 43, 9, 44, 9, 10, 17, 18, 42, 9, 43, 42, 9, 41, 40, 42, 41, 9, 18, 19, 42, 19, 20, 42, 20, 21, 42, 42, 21, 41, 9, 40, 8, 40, 39, 8, 8, 39, 7, 21, 22, 41, 40, 41, 23, 7, 38, 6, 7, 39, 38, 41, 22, 23, 40, 23, 39, 38, 37, 6, 6, 37, 5, 23, 24, 39, 24, 25, 39, 39, 25, 38, 37, 36, 5, 5, 36, 4, 25, 26, 38, 38, 26, 37, 36, 35, 4, 26, 27, 37, 37, 27, 36, 4, 35, 3, 35, 34, 3, 3, 34, 2, 36, 28, 35, 36, 27, 28, 34, 33, 2, 2, 33, 1, 35, 28, 34, 1, 33, 32, 1, 32, 0, 32, 33, 30, 34, 29, 33, 34, 28, 29, 0, 32, 31, 33, 29, 30, 32, 30, 31 ],
				"vertices": [ 1, 21, -3.96, 8.5, 1, 1, 21, 8.11, 11.37, 1, 2, 21, 21.98, 15.3, 0.94793, 22, -11.82, 19.07, 0.05207, 3, 21, 34.06, 17.65, 0.51049, 22, 0.45, 18.17, 0.48041, 23, -37.44, 24.69, 0.0091, 3, 21, 46.59, 25.21, 0.04856, 22, 14.53, 22.18, 0.83667, 23, -22.89, 26.26, 0.11478, 3, 21, 56.29, 30.66, 9.4E-4, 22, 25.32, 24.89, 0.69002, 23, -11.8, 27.11, 0.30904, 2, 22, 39.08, 22.52, 0.30616, 23, 1.37, 22.45, 0.69384, 3, 22, 53.35, 15.32, 0.00242, 23, 14.21, 12.95, 0.9884, 24, -17.14, 19.77, 0.00918, 2, 23, 23.09, 10.8, 0.82909, 24, -9.66, 14.53, 0.17091, 2, 23, 30.49, 12.03, 0.31232, 24, -2.33, 12.97, 0.68768, 1, 24, 8.95, 17.25, 1, 1, 24, 23.73, 22.78, 1, 1, 24, 35.5, 21.71, 1, 1, 24, 49.23, 15.66, 1, 1, 24, 56.25, 2.69, 1, 1, 24, 54.05, -11.63, 1, 2, 23, 80.58, 4.42, 6.6E-4, 24, 41.53, -12.4, 0.99934, 2, 23, 69.9, -3.75, 0.05631, 24, 28.6, -16.11, 0.94369, 2, 23, 61.97, -10.88, 0.2553, 24, 18.62, -19.85, 0.7447, 2, 23, 50.19, -17.7, 0.71279, 24, 5.16, -21.9, 0.28721, 3, 22, 81.63, -13.94, 0.00248, 23, 37.15, -20.67, 0.98606, 24, -8.06, -19.9, 0.01146, 2, 22, 68.82, -16.99, 0.06379, 23, 24, -21.51, 0.93621, 2, 22, 57.23, -21.24, 0.2972, 23, 11.86, -23.74, 0.7028, 2, 22, 41.09, -22.83, 0.84562, 23, -4.31, -22.58, 0.15438, 2, 22, 30.4, -24.63, 0.99346, 23, -15.14, -22.55, 0.00654, 2, 21, 60.85, -20.75, 0.03734, 22, 16.22, -25.92, 0.96266, 2, 21, 49.43, -23.48, 0.23789, 22, 4.49, -25.56, 0.76211, 2, 21, 38.13, -25.83, 0.58746, 22, -7.02, -24.85, 0.41254, 2, 21, 21.07, -24.33, 0.95051, 22, -23.1, -18.93, 0.04949, 1, 21, 6.17, -18, 1, 1, 21, -6.71, -7.48, 1, 1, 21, -13.16, 0.12, 1, 1, 21, -3.16, 0.89, 1, 1, 21, 8.34, -3.66, 1, 1, 21, 19.82, -5.61, 1, 2, 21, 30.86, -4.31, 0.98578, 22, -8.4, -2.18, 0.01422, 2, 21, 44.61, -0.77, 0.0075, 22, 5.8, -2.38, 0.9925, 2, 22, 19.69, 0.87, 0.99766, 23, -21.41, 4.39, 0.00234, 2, 22, 31.38, 2.41, 0.93376, 23, -9.62, 3.93, 0.06624, 2, 22, 47.09, 0.41, 0.00922, 23, 5.53, -0.69, 0.99078, 2, 22, 59.23, 0.08, 0.00895, 23, 17.44, -3.07, 0.99105, 2, 22, 69.66, 0.87, 0.00154, 23, 27.85, -4.05, 0.99846, 2, 23, 41.62, -1.98, 0.5596, 24, 2.92, -4.14, 0.4404, 2, 23, 56.03, 6.22, 0.00922, 24, 19.33, -1.76, 0.99078, 1, 24, 28.56, 0.7, 1, 1, 24, 41.66, 3.67, 1 ],
				"hull": 32,
				"edges": [ 0, 2, 2, 4, 4, 6, 6, 8, 8, 10, 10, 12, 12, 14, 14, 16, 16, 18, 18, 20, 20, 22, 22, 24, 24, 26, 26, 28, 28, 30, 30, 32, 32, 34, 34, 36, 36, 38, 38, 40, 40, 42, 42, 44, 44, 46, 46, 48, 48, 50, 50, 52, 52, 54, 54, 56, 56, 58, 58, 60, 60, 62, 0, 62 ],
				"width": 93,
				"height": 197
			}
		},
		"hair4nv2": {
			"hair4nv2": {
				"type": "mesh",
				"uvs": [ 0.39447, 0.08556, 0.34883, 0.1842, 0.23628, 0.28803, 0.10242, 0.36072, 0, 0.48878, 0, 0.60472, 0, 0.72413, 0.08417, 0.77431, 0.21194, 0.87122, 0.34579, 0.9491, 0.49181, 1, 0.60741, 1, 0.70947, 1, 0.6608, 0.91179, 0.64559, 0.79238, 0.64559, 0.72143, 0.70643, 0.62106, 0.79465, 0.53107, 0.8707, 0.46185, 0.95588, 0.37013, 0.94675, 0.28014, 0.79769, 0.19438, 0.66688, 0.0992, 0.57866, 0.02478, 0.49044, 0.00402, 0.69356, 0.32417, 0.62055, 0.39858, 0.49582, 0.5076, 0.44715, 0.63739, 0.44715, 0.75161, 0.47453, 0.86409, 0.5212, 0.25148, 0.41777, 0.37435, 0.29304, 0.4678, 0.1957, 0.56644, 0.19569, 0.70534, 0.25516, 0.80512 ],
				"triangles": [ 30, 14, 13, 9, 36, 30, 11, 10, 30, 9, 30, 10, 13, 11, 30, 11, 13, 12, 15, 28, 27, 35, 5, 34, 35, 34, 28, 7, 6, 5, 29, 28, 15, 36, 35, 28, 35, 7, 5, 29, 15, 14, 29, 36, 28, 7, 35, 36, 30, 29, 14, 36, 29, 30, 8, 7, 36, 8, 36, 9, 3, 2, 33, 33, 32, 27, 34, 3, 33, 4, 3, 34, 5, 4, 34, 16, 26, 17, 27, 26, 16, 28, 33, 27, 34, 33, 28, 16, 15, 27, 23, 0, 24, 31, 23, 22, 31, 0, 23, 1, 0, 31, 25, 22, 21, 31, 22, 25, 32, 1, 31, 2, 1, 32, 26, 31, 25, 32, 31, 26, 20, 25, 21, 18, 20, 19, 18, 25, 20, 33, 2, 32, 27, 32, 26, 17, 25, 18, 26, 25, 17 ],
				"vertices": [ 2, 25, 1.15, -29.86, 0.99999, 26, -50.88, -28.79, 1.0E-5, 2, 25, 18.14, -28.67, 0.97226, 26, -33.86, -27.96, 0.02774, 3, 25, 38, -33.21, 0.69176, 26, -14.11, -32.92, 0.30824, 27, -55.38, -12.23, 0, 3, 25, 53.58, -41.35, 0.33118, 26, 1.3, -41.38, 0.64879, 27, -44.51, -26.04, 0.02003, 3, 25, 76.96, -43.68, 0.0697, 26, 24.63, -44.21, 0.73451, 27, -24.15, -37.77, 0.19579, 3, 25, 95.29, -37.45, 0.00552, 26, 43.09, -38.37, 0.46346, 27, -4.88, -39.62, 0.53101, 2, 26, 62.1, -32.36, 0.16574, 27, 14.97, -41.53, 0.83426, 3, 26, 67.68, -22.21, 0.07409, 27, 24.08, -34.37, 0.91815, 28, -26.78, -26.31, 0.00776, 3, 26, 79.45, -5.75, 6.1E-4, 27, 41.35, -23.83, 0.73544, 28, -6.83, -22.94, 0.26395, 2, 27, 55.51, -12.42, 0.10867, 28, 10.55, -17.59, 0.89133, 1, 28, 24.47, -9.16, 1, 1, 28, 29.5, 0.6, 1, 1, 28, 33.94, 9.22, 1, 2, 27, 52.17, 17.96, 0.02503, 28, 18.73, 11.86, 0.97497, 3, 26, 54.47, 29.55, 0.00823, 27, 32.18, 18.43, 0.67497, 28, 0.34, 19.71, 0.3168, 3, 26, 43.17, 25.98, 0.11305, 27, 20.38, 19.56, 0.84344, 28, -10.19, 25.14, 0.04352, 3, 25, 76.29, 26.97, 0.03299, 26, 25.45, 26.44, 0.59261, 27, 4.25, 26.92, 0.3744, 3, 25, 59.36, 30.07, 0.32541, 26, 8.59, 29.89, 0.61643, 27, -9.91, 36.7, 0.05817, 3, 25, 46.09, 33.19, 0.68825, 26, -4.61, 33.3, 0.30698, 27, -20.72, 44.99, 0.00478, 2, 25, 28.99, 35.93, 0.92947, 26, -21.65, 36.39, 0.07053, 2, 25, 15.04, 30.27, 0.99021, 26, -35.72, 31.03, 0.00979, 1, 25, 6.03, 12.26, 1, 1, 25, -5.02, -4.62, 1, 1, 25, -14.09, -16.56, 1, 1, 25, -14.68, -25.61, 1, 2, 25, 29.74, 9.86, 0.99276, 26, -21.46, 10.32, 0.00724, 2, 25, 43.73, 7.29, 0.92511, 26, -7.51, 7.45, 0.07489, 3, 25, 64.78, 1.93, 5.2E-4, 26, 13.42, 1.65, 0.99756, 27, -16.52, 8.81, 0.00192, 2, 26, 35.48, 3.77, 0.09006, 27, 4.61, 2.14, 0.90994, 3, 26, 53.66, 9.53, 1.6E-4, 27, 23.6, 0.32, 0.99919, 28, -14.35, 6.08, 6.6E-4, 1, 28, 3.54, -0.22, 1, 2, 25, 23.51, -9.55, 0.99268, 26, -28.09, -8.96, 0.00732, 2, 25, 46.1, -12.25, 0.7163, 26, -5.56, -12.14, 0.2837, 3, 25, 64.69, -18.45, 0.1213, 26, 12.89, -18.73, 0.85495, 27, -24.98, -9.73, 0.02374, 3, 25, 83.26, -21.91, 0.01258, 26, 31.39, -22.57, 0.64831, 27, -9.46, -20.51, 0.33911, 2, 26, 53.5, -15.58, 0.10897, 27, 13.63, -22.72, 0.89103, 3, 26, 67.69, -5.17, 0.00495, 27, 30.75, -18.69, 0.91839, 28, -14.76, -14.23, 0.07666 ],
				"hull": 25,
				"edges": [ 0, 2, 2, 4, 4, 6, 6, 8, 8, 10, 10, 12, 12, 14, 14, 16, 16, 18, 18, 20, 20, 22, 22, 24, 24, 26, 26, 28, 28, 30, 30, 32, 32, 34, 34, 36, 36, 38, 38, 40, 40, 42, 42, 44, 44, 46, 46, 48, 0, 48 ],
				"width": 95,
				"height": 167
			}
		},
		"hair5nv2": {
			"hair5nv2": {
				"type": "mesh",
				"uvs": [ 0.6362, 0.18332, 0.5852, 0.30243, 0.49454, 0.44319, 0.3642, 0.57313, 0.30187, 0.71172, 0.19987, 0.82867, 0.20554, 0.91529, 0.47187, 0.93478, 0.66454, 0.86332, 0.7212, 0.7637, 0.81187, 0.58829, 0.88554, 0.45618, 0.9422, 0.30676, 0.96487, 0.19631, 0.84587, 0.11835, 0.72687, 0.13568, 0.76087, 0.25695, 0.7382, 0.33491, 0.7382, 0.4302, 0.59087, 0.59045, 0.5002, 0.72039, 0.4322, 0.82867 ],
				"triangles": [ 6, 21, 7, 7, 21, 8, 6, 5, 21, 21, 20, 8, 8, 20, 9, 5, 4, 21, 21, 4, 20, 20, 19, 9, 4, 3, 20, 9, 19, 10, 20, 3, 19, 3, 2, 19, 19, 18, 10, 19, 2, 18, 10, 18, 11, 2, 1, 18, 17, 11, 18, 12, 11, 17, 12, 17, 16, 1, 17, 18, 17, 1, 16, 12, 16, 13, 1, 0, 16, 0, 15, 16, 16, 14, 13, 16, 15, 14 ],
				"vertices": [ 2, 15, 40.07, -8.15, 0.56568, 29, -7.11, -7.41, 0.43432, 2, 29, 11.76, -9.06, 0.99985, 30, -16.1, -11.11, 1.5E-4, 2, 29, 34.21, -12.83, 0.12589, 30, 6.64, -12.11, 0.87411, 2, 30, 28.17, -15.77, 0.61968, 31, -2.33, -15.74, 0.38032, 2, 30, 50.24, -15.17, 3.6E-4, 31, 19.75, -15.52, 0.99964, 1, 31, 38.91, -18.26, 1, 1, 31, 52.23, -15.49, 1, 1, 31, 52.38, 0.78, 1, 1, 31, 39.27, 10.14, 1, 1, 31, 23.28, 10.69, 1, 2, 30, 25.24, 11.03, 0.77608, 31, -4.79, 11.12, 0.22392, 2, 29, 34.48, 10.72, 0.17722, 30, 4.04, 11.3, 0.82278, 2, 15, 57.35, 12.21, 0.30677, 29, 10.83, 12.35, 0.69323, 1, 15, 39.96, 11.68, 1, 1, 15, 28.57, 3.26, 1, 2, 15, 32.04, -3.55, 0.98696, 29, -14.98, -2.55, 0.01304, 2, 15, 50.75, 0.54, 0.11739, 29, 3.85, 0.91, 0.88261, 2, 15, 63.07, 0.52, 0.00192, 29, 16.16, 0.48, 0.99808, 2, 29, 31.08, 1.6, 0.05215, 30, 1.77, 1.83, 0.94785, 2, 30, 28.17, -1.9, 0.99773, 31, -2.09, -1.87, 0.00227, 1, 31, 18.96, -3.57, 1, 1, 31, 36.41, -4.54, 1 ],
				"hull": 16,
				"edges": [ 0, 2, 2, 4, 4, 6, 6, 8, 8, 10, 10, 12, 12, 14, 14, 16, 16, 18, 18, 20, 20, 22, 22, 24, 24, 26, 26, 28, 28, 30, 0, 30 ],
				"width": 60,
				"height": 157
			}
		},
		"hairnv2": {
			"hairnv2": {
				"type": "mesh",
				"uvs": [ 0.96836, 0.19404, 0.88785, 0.22837, 0.79615, 0.28491, 0.68432, 0.34953, 0.56802, 0.39194, 0.48303, 0.43637, 0.40475, 0.49897, 0.33989, 0.56561, 0.31976, 0.64235, 0.31305, 0.72716, 0.28398, 0.84429, 0.23925, 0.8867, 0.14755, 0.94122, 0.07821, 0.92305, 0.1386, 0.84025, 0.18333, 0.77967, 0.17886, 0.68274, 0.19899, 0.59994, 0.24819, 0.49897, 0.31305, 0.42829, 0.38015, 0.38992, 0.45619, 0.35357, 0.52776, 0.30915, 0.61499, 0.26674, 0.68656, 0.20212, 0.74918, 0.1274, 0.82298, 0.0547, 0.87443, 0.01835, 0.93705, 0, 1, 0.01027, 0.99744, 0.12134, 1, 0.15971, 0.95047, 0.08701, 0.84088, 0.15971, 0.73129, 0.23847, 0.64406, 0.30713, 0.55236, 0.3455, 0.46961, 0.3879, 0.41817, 0.43031, 0.3466, 0.46868, 0.29516, 0.53936, 0.26385, 0.61812, 0.23925, 0.70697, 0.22583, 0.814, 0.18109, 0.86044 ],
				"triangles": [ 3, 34, 2, 35, 24, 34, 1, 2, 33, 2, 34, 33, 34, 25, 33, 34, 24, 25, 1, 33, 0, 33, 32, 0, 0, 30, 31, 0, 32, 30, 25, 26, 33, 32, 26, 27, 32, 33, 26, 30, 32, 29, 27, 28, 32, 32, 28, 29, 37, 36, 4, 4, 35, 3, 4, 36, 35, 36, 21, 22, 3, 35, 34, 36, 23, 35, 36, 22, 23, 35, 23, 24, 38, 37, 5, 5, 37, 4, 38, 20, 37, 20, 21, 37, 36, 37, 21, 7, 39, 6, 7, 40, 39, 40, 18, 39, 6, 38, 5, 6, 39, 38, 18, 19, 39, 39, 20, 38, 39, 19, 20, 42, 41, 8, 16, 17, 41, 8, 41, 7, 41, 40, 7, 41, 17, 40, 17, 18, 40, 13, 14, 12, 12, 44, 11, 12, 14, 44, 44, 43, 11, 11, 43, 10, 43, 44, 15, 10, 43, 9, 44, 14, 15, 43, 42, 9, 43, 15, 42, 15, 16, 42, 9, 42, 8, 42, 16, 41 ],
				"vertices": [ 1, 32, 2.18, 10.19, 1, 1, 32, 10.31, 8.58, 1, 2, 33, -8.56, 7.64, 0.00558, 32, 20.63, 8.2, 0.99442, 2, 33, 3.79, 7.64, 0.84781, 32, 32.95, 7.37, 0.15219, 2, 34, -3.82, 4.91, 0.09388, 33, 15.26, 5.5, 0.90612, 3, 35, -3.67, 8.24, 0.25622, 34, 5.23, 6.09, 0.73721, 33, 24.38, 5.09, 0.00658, 3, 36, -5.34, 11.19, 0.00622, 35, 5.98, 7.04, 0.99222, 34, 14.44, 9.23, 0.00156, 2, 36, 2.6, 6.65, 0.59705, 35, 15.12, 7.06, 0.40295, 3, 37, -6.13, 6.33, 0.01418, 36, 10.72, 6.4, 0.98501, 35, 22.28, 10.89, 8.1E-4, 2, 37, 2.54, 7.57, 0.73021, 36, 19.4, 7.54, 0.26979, 1, 37, 14.9, 7.47, 1, 1, 37, 20.05, 4.33, 1, 1, 37, 27.34, -2.81, 1, 1, 37, 26.88, -9.51, 1, 1, 37, 17.35, -5.83, 1, 1, 37, 10.38, -3.08, 1, 2, 37, 0.71, -5.6, 0.57949, 36, 17.41, -5.61, 0.42051, 1, 36, 8.68, -5.48, 1, 2, 36, -2.42, -3.08, 0.25744, 35, 15.61, -3.87, 0.74256, 2, 35, 6.16, -4.17, 0.94776, 34, 19.5, -0.77, 0.05224, 1, 34, 12.22, -2.02, 1, 2, 34, 4.25, -2.74, 0.99728, 33, 21.89, -3.44, 0.00272, 2, 34, -3.65, -4.4, 0.00584, 33, 13.81, -3.71, 0.99416, 2, 33, 4.63, -3.01, 0.99818, 32, 33.06, -3.32, 0.00182, 2, 33, -4.57, -5.03, 0.00153, 32, 23.76, -4.72, 0.99847, 1, 32, 14.5, -7.44, 1, 1, 32, 4.53, -9.39, 1, 1, 32, -1.54, -9.55, 1, 1, 32, -7.35, -7.61, 1, 1, 32, -11.43, -3.28, 1, 1, 32, -4.44, 5.78, 1, 1, 32, -2.28, 9.1, 1, 1, 32, -3.03, 0.34, 1, 1, 32, 9.62, 0.3, 1, 1, 32, 22.64, 0.77, 1, 2, 33, 4.59, 1.95, 0.98764, 32, 33.36, 1.63, 0.01236, 1, 33, 13.9, 0.68, 1, 2, 35, -6.59, 4, 0.01936, 34, 4.46, 1, 0.98064, 2, 35, -0.15, 3.3, 0.80246, 34, 10.56, 3.19, 0.19754, 2, 36, -7.31, 5.27, 5.9E-4, 35, 7.22, 0.92, 0.99941, 2, 36, 0.78, 2.04, 0.5769, 35, 15.84, 2.15, 0.4231, 1, 36, 9.31, 0.81, 1, 1, 37, 1.96, 0.42, 1, 1, 37, 13, 1.53, 1, 1, 37, 18.55, -1.52, 1 ],
				"hull": 32,
				"edges": [ 0, 2, 2, 4, 4, 6, 6, 8, 8, 10, 10, 12, 12, 14, 14, 16, 16, 18, 18, 20, 20, 22, 22, 24, 24, 26, 26, 28, 28, 30, 30, 32, 32, 34, 34, 36, 36, 38, 38, 40, 40, 42, 42, 44, 44, 46, 46, 48, 48, 50, 50, 52, 52, 54, 54, 56, 56, 58, 58, 60, 60, 62, 0, 62 ],
				"width": 93,
				"height": 103
			}
		},
		"hand2nv2": {
			"hand2nv2": { "x": 51.24, "y": 1.36, "rotation": 152.78, "width": 86, "height": 56 }
		},
		"hand3nv2": {
			"hand3nv2": { "x": 22.63, "y": 2.58, "rotation": 152.78, "width": 56, "height": 54 }
		}
	}
},
"animations": {
	"animation": {
		"slots": {
			"FX5": {
				"attachment": [
					{ "time": 0, "name": "Comp 6/FX3_00000" },
					{ "time": 0.0333, "name": "Comp 6/FX3_00001" },
					{ "time": 0.0667, "name": "Comp 6/FX3_00002" },
					{ "time": 0.1, "name": "Comp 6/FX3_00003" },
					{ "time": 0.1333, "name": "Comp 6/FX3_00004" },
					{ "time": 0.1667, "name": "Comp 6/FX3_00005" },
					{ "time": 0.2, "name": "Comp 6/FX3_00006" },
					{ "time": 0.2333, "name": "Comp 6/FX3_00007" },
					{ "time": 0.2667, "name": "Comp 6/FX3_00008" },
					{ "time": 0.3, "name": "Comp 6/FX3_00009" },
					{ "time": 0.3333, "name": "Comp 6/FX3_00010" },
					{ "time": 0.3667, "name": "Comp 6/FX3_00011" },
					{ "time": 0.4, "name": "Comp 6/FX3_00012" },
					{ "time": 0.4333, "name": "Comp 6/FX3_00013" },
					{ "time": 0.4667, "name": "Comp 6/FX3_00014" },
					{ "time": 0.5, "name": "Comp 6/FX3_00015" },
					{ "time": 0.5333, "name": "Comp 6/FX3_00016" },
					{ "time": 0.5667, "name": "Comp 6/FX3_00017" },
					{ "time": 0.6, "name": "Comp 6/FX3_00018" },
					{ "time": 0.6333, "name": "Comp 6/FX3_00019" },
					{ "time": 0.6667, "name": "Comp 6/FX3_00020" },
					{ "time": 0.7, "name": "Comp 6/FX3_00021" },
					{ "time": 0.7333, "name": "Comp 6/FX3_00022" },
					{ "time": 0.7667, "name": "Comp 6/FX3_00023" },
					{ "time": 0.8, "name": "Comp 6/FX3_00024" },
					{ "time": 0.8333, "name": "Comp 6/FX3_00000" },
					{ "time": 0.8667, "name": "Comp 6/FX3_00001" },
					{ "time": 0.9, "name": "Comp 6/FX3_00002" },
					{ "time": 0.9333, "name": "Comp 6/FX3_00003" },
					{ "time": 0.9667, "name": "Comp 6/FX3_00004" },
					{ "time": 1, "name": "Comp 6/FX3_00005" },
					{ "time": 1.0333, "name": "Comp 6/FX3_00006" },
					{ "time": 1.0667, "name": "Comp 6/FX3_00007" },
					{ "time": 1.1, "name": "Comp 6/FX3_00008" },
					{ "time": 1.1333, "name": "Comp 6/FX3_00009" },
					{ "time": 1.1667, "name": "Comp 6/FX3_00010" },
					{ "time": 1.2, "name": "Comp 6/FX3_00011" },
					{ "time": 1.2333, "name": "Comp 6/FX3_00012" },
					{ "time": 1.2667, "name": "Comp 6/FX3_00013" },
					{ "time": 1.3, "name": "Comp 6/FX3_00014" },
					{ "time": 1.3333, "name": "Comp 6/FX3_00015" },
					{ "time": 1.3667, "name": "Comp 6/FX3_00016" },
					{ "time": 1.4, "name": "Comp 6/FX3_00017" },
					{ "time": 1.4333, "name": "Comp 6/FX3_00018" },
					{ "time": 1.4667, "name": "Comp 6/FX3_00019" },
					{ "time": 1.5, "name": "Comp 6/FX3_00020" },
					{ "time": 1.5333, "name": "Comp 6/FX3_00021" },
					{ "time": 1.5667, "name": "Comp 6/FX3_00022" },
					{ "time": 1.6, "name": "Comp 6/FX3_00023" },
					{ "time": 1.6333, "name": "Comp 6/FX3_00024" },
					{ "time": 1.6667, "name": "Comp 6/FX3_00000" },
					{ "time": 1.7, "name": "Comp 6/FX3_00001" },
					{ "time": 1.7333, "name": "Comp 6/FX3_00002" },
					{ "time": 1.7667, "name": "Comp 6/FX3_00003" },
					{ "time": 1.8, "name": "Comp 6/FX3_00004" },
					{ "time": 1.8333, "name": "Comp 6/FX3_00005" },
					{ "time": 1.8667, "name": "Comp 6/FX3_00006" },
					{ "time": 1.9, "name": "Comp 6/FX3_00007" },
					{ "time": 1.9333, "name": "Comp 6/FX3_00008" },
					{ "time": 1.9667, "name": "Comp 6/FX3_00009" },
					{ "time": 2, "name": "Comp 6/FX3_00010" },
					{ "time": 2.0333, "name": "Comp 6/FX3_00023" },
					{ "time": 2.0667, "name": "Comp 6/FX3_00024" }
				]
			},
			"FX9": {
				"attachment": [
					{ "time": 0, "name": "Comp 7/FX5_00000" },
					{ "time": 0.0333, "name": "Comp 7/FX5_00001" },
					{ "time": 0.0667, "name": "Comp 7/FX5_00002" },
					{ "time": 0.1, "name": "Comp 7/FX5_00003" },
					{ "time": 0.1333, "name": "Comp 7/FX5_00004" },
					{ "time": 0.1667, "name": "Comp 7/FX5_00005" },
					{ "time": 0.2, "name": "Comp 7/FX5_00006" },
					{ "time": 0.2333, "name": "Comp 7/FX5_00007" },
					{ "time": 0.2667, "name": "Comp 7/FX5_00008" },
					{ "time": 0.3, "name": "Comp 7/FX5_00009" },
					{ "time": 0.3333, "name": "Comp 7/FX5_00010" },
					{ "time": 0.3667, "name": "Comp 7/FX5_00011" },
					{ "time": 0.4, "name": "Comp 7/FX5_00012" },
					{ "time": 0.4333, "name": "Comp 7/FX5_00013" },
					{ "time": 0.4667, "name": "Comp 7/FX5_00014" },
					{ "time": 0.5, "name": "Comp 7/FX5_00015" },
					{ "time": 0.5333, "name": "Comp 7/FX5_00016" },
					{ "time": 0.5667, "name": "Comp 7/FX5_00017" },
					{ "time": 0.6, "name": "Comp 7/FX5_00018" },
					{ "time": 0.6333, "name": "Comp 7/FX5_00019" },
					{ "time": 0.6667, "name": "Comp 7/FX5_00020" },
					{ "time": 0.7, "name": "Comp 7/FX5_00021" },
					{ "time": 0.7333, "name": null }
				]
			}
		},
		"bones": {
			"hair4nv3": {
				"rotate": [
					{
						"time": 0,
						"angle": 7.7,
						"curve": [ 0.352, 0.65, 0.687, 1 ]
					},
					{
						"time": 0.0667,
						"angle": 7.88,
						"curve": [ 0.25, 0, 0.75, 1 ]
					},
					{
						"time": 1.0667,
						"angle": 0,
						"curve": [ 0.25, 0, 0.75, 1 ]
					},
					{ "time": 2, "angle": 7.7 }
				],
				"translate": [
					{ "time": 0, "x": 0, "y": 0, "curve": "stepped" },
					{ "time": 0.0667, "x": 0, "y": 0, "curve": "stepped" },
					{ "time": 1.0667, "x": 0, "y": 0, "curve": "stepped" },
					{ "time": 2, "x": 0, "y": 0 }
				]
			},
			"arm2nv6": {
				"rotate": [
					{ "time": 0, "angle": 0, "curve": "stepped" },
					{ "time": 0.5, "angle": 0, "curve": "stepped" },
					{ "time": 1.5, "angle": 0, "curve": "stepped" },
					{ "time": 2, "angle": 0 }
				],
				"translate": [
					{
						"time": 0,
						"x": -2.56,
						"y": 6.58,
						"curve": [ 0.375, 0.5, 0.75, 1 ]
					},
					{
						"time": 0.5,
						"x": 0,
						"y": 0,
						"curve": [ 0.25, 0, 0.75, 1 ]
					},
					{
						"time": 1.5,
						"x": -5.12,
						"y": 13.17,
						"curve": [ 0.25, 0, 0.625, 0.5 ]
					},
					{ "time": 2, "x": -2.56, "y": 6.58 }
				]
			},
			"hair4nv4": {
				"rotate": [
					{
						"time": 0,
						"angle": 13.93,
						"curve": [ 0.366, 0.63, 0.703, 1 ]
					},
					{
						"time": 0.1333,
						"angle": 14.97,
						"curve": [ 0.25, 0, 0.75, 1 ]
					},
					{
						"time": 1.1333,
						"angle": 0,
						"curve": [ 0.244, 0, 0.7, 0.79 ]
					},
					{ "time": 2, "angle": 13.93 }
				],
				"translate": [
					{ "time": 0, "x": 0, "y": 0, "curve": "stepped" },
					{ "time": 0.1333, "x": 0, "y": 0, "curve": "stepped" },
					{ "time": 1.1333, "x": 0, "y": 0, "curve": "stepped" },
					{ "time": 2, "x": 0, "y": 0 }
				]
			},
			"Jackpot3": {
				"scale": [
					{
						"time": 0,
						"x": 1.188,
						"y": 1.188,
						"curve": [ 0.25, 0, 0.75, 1 ]
					},
					{
						"time": 0.1667,
						"x": 1,
						"y": 1,
						"curve": [ 0.25, 0, 0.75, 1 ]
					},
					{
						"time": 0.3333,
						"x": 1.188,
						"y": 1.188,
						"curve": [ 0.25, 0, 0.75, 1 ]
					},
					{
						"time": 0.5,
						"x": 1,
						"y": 1,
						"curve": [ 0.25, 0, 0.75, 1 ]
					},
					{
						"time": 0.6667,
						"x": 1.188,
						"y": 1.188,
						"curve": [ 0.25, 0, 0.75, 1 ]
					},
					{
						"time": 0.8333,
						"x": 1,
						"y": 1,
						"curve": [ 0.25, 0, 0.75, 1 ]
					},
					{
						"time": 1,
						"x": 1.188,
						"y": 1.188,
						"curve": [ 0.25, 0, 0.75, 1 ]
					},
					{
						"time": 1.1667,
						"x": 1,
						"y": 1,
						"curve": [ 0.25, 0, 0.75, 1 ]
					},
					{
						"time": 1.3333,
						"x": 1.188,
						"y": 1.188,
						"curve": [ 0.25, 0, 0.75, 1 ]
					},
					{
						"time": 1.5,
						"x": 1,
						"y": 1,
						"curve": [ 0.25, 0, 0.75, 1 ]
					},
					{
						"time": 1.6667,
						"x": 1.188,
						"y": 1.188,
						"curve": [ 0.25, 0, 0.75, 1 ]
					},
					{
						"time": 1.8333,
						"x": 1,
						"y": 1,
						"curve": [ 0.25, 0, 0.75, 1 ]
					},
					{ "time": 2, "x": 1.188, "y": 1.188 }
				]
			},
			"arm2nv4": {
				"rotate": [
					{
						"time": 0,
						"angle": 0,
						"curve": [ 0.25, 0, 0.75, 1 ]
					},
					{
						"time": 1,
						"angle": 3.4,
						"curve": [ 0.25, 0, 0.75, 1 ]
					},
					{ "time": 2, "angle": 0 }
				],
				"translate": [
					{ "time": 0, "x": 0, "y": 0, "curve": "stepped" },
					{ "time": 1, "x": 0, "y": 0, "curve": "stepped" },
					{ "time": 2, "x": 0, "y": 0 }
				]
			},
			"hair5nv21": {
				"rotate": [
					{
						"time": 0,
						"angle": 4.76,
						"curve": [ 0.289, 0.17, 0.755, 1 ]
					},
					{
						"time": 0.9,
						"angle": 0,
						"curve": [ 0.25, 0, 0.75, 1 ]
					},
					{
						"time": 1.9,
						"angle": 4.97,
						"curve": [ 0.305, 0, 0.64, 0.36 ]
					},
					{ "time": 2, "angle": 4.76 }
				],
				"translate": [
					{ "time": 0, "x": 0, "y": 0, "curve": "stepped" },
					{ "time": 0.9, "x": 0, "y": 0, "curve": "stepped" },
					{ "time": 1.9, "x": 0, "y": 0, "curve": "stepped" },
					{ "time": 2, "x": 0, "y": 0 }
				]
			},
			"arm2nv11": {
				"rotate": [
					{
						"time": 0,
						"angle": 3.76,
						"curve": [ 0.345, 0.37, 0.757, 1 ]
					},
					{
						"time": 0.7,
						"angle": 0,
						"curve": [ 0.25, 0, 0.75, 1 ]
					},
					{
						"time": 1.7,
						"angle": 4.97,
						"curve": [ 0.269, 0, 0.618, 0.42 ]
					},
					{ "time": 2, "angle": 3.76 }
				],
				"translate": [
					{ "time": 0, "x": 0, "y": 0, "curve": "stepped" },
					{ "time": 0.7, "x": 0, "y": 0, "curve": "stepped" },
					{ "time": 1.7, "x": 0, "y": 0, "curve": "stepped" },
					{ "time": 2, "x": 0, "y": 0 }
				]
			},
			"hair3nv21": {
				"rotate": [
					{
						"time": 0,
						"angle": -9.12,
						"curve": [ 0.345, 0.37, 0.757, 1 ]
					},
					{
						"time": 0.7,
						"angle": 0,
						"curve": [ 0.25, 0, 0.75, 1 ]
					},
					{
						"time": 1.7,
						"angle": -12.04,
						"curve": [ 0.269, 0, 0.618, 0.42 ]
					},
					{ "time": 2, "angle": -9.12 }
				],
				"translate": [
					{ "time": 0, "x": 0, "y": 0, "curve": "stepped" },
					{ "time": 0.7, "x": 0, "y": 0, "curve": "stepped" },
					{ "time": 1.7, "x": 0, "y": 0, "curve": "stepped" },
					{ "time": 2, "x": 0, "y": 0 }
				]
			},
			"hair2nv21": {
				"rotate": [
					{
						"time": 0,
						"angle": -9.14,
						"curve": [ 0.304, 0.22, 0.643, 0.57 ]
					},
					{
						"time": 0.6,
						"angle": 0,
						"curve": [ 0.25, 0, 0.75, 1 ]
					},
					{
						"time": 1.6,
						"angle": -11.79,
						"curve": [ 0.3, 0, 0.636, 0.36 ]
					},
					{ "time": 2, "angle": -9.14 }
				],
				"translate": [
					{ "time": 0, "x": 0, "y": 0, "curve": "stepped" },
					{ "time": 0.6, "x": 0, "y": 0, "curve": "stepped" },
					{ "time": 1.6, "x": 0, "y": 0, "curve": "stepped" },
					{ "time": 2, "x": 0, "y": 0 }
				]
			},
			"hand2nv2": {
				"rotate": [
					{
						"time": 0,
						"angle": -7.78,
						"curve": [ 0.375, 0.5, 0.75, 1 ]
					},
					{
						"time": 0.5,
						"angle": 0,
						"curve": [ 0.25, 0, 0.75, 1 ]
					},
					{
						"time": 1.5,
						"angle": -15.57,
						"curve": [ 0.25, 0, 0.625, 0.5 ]
					},
					{ "time": 2, "angle": -7.78 }
				],
				"translate": [
					{ "time": 0, "x": 0, "y": 0, "curve": "stepped" },
					{ "time": 0.5, "x": 0, "y": 0, "curve": "stepped" },
					{ "time": 1.5, "x": 0, "y": 0, "curve": "stepped" },
					{ "time": 2, "x": 0, "y": 0 }
				]
			},
			"arm2nv8": {
				"rotate": [
					{
						"time": 0,
						"angle": 2.94,
						"curve": [ 0.375, 0.5, 0.75, 1 ]
					},
					{
						"time": 0.5,
						"angle": 0,
						"curve": [ 0.25, 0, 0.75, 1 ]
					},
					{
						"time": 1.5,
						"angle": 5.89,
						"curve": [ 0.25, 0, 0.625, 0.5 ]
					},
					{ "time": 2, "angle": 2.94 }
				],
				"translate": [
					{ "time": 0, "x": 0, "y": 0, "curve": "stepped" },
					{ "time": 0.5, "x": 0, "y": 0, "curve": "stepped" },
					{ "time": 1.5, "x": 0, "y": 0, "curve": "stepped" },
					{ "time": 2, "x": 0, "y": 0 }
				]
			},
			"hair3nv31": {
				"rotate": [
					{
						"time": 0,
						"angle": -10.47,
						"curve": [ 0.32, 0.29, 0.757, 1 ]
					},
					{
						"time": 0.8,
						"angle": 0,
						"curve": [ 0.25, 0, 0.75, 1 ]
					},
					{
						"time": 1.8,
						"angle": -12.04,
						"curve": [ 0.284, 0, 0.625, 0.38 ]
					},
					{ "time": 2, "angle": -10.47 }
				],
				"translate": [
					{ "time": 0, "x": 0, "y": 0, "curve": "stepped" },
					{ "time": 0.8, "x": 0, "y": 0, "curve": "stepped" },
					{ "time": 1.8, "x": 0, "y": 0, "curve": "stepped" },
					{ "time": 2, "x": 0, "y": 0 }
				]
			},
			"Fx8": {
				"translate": [
					{ "time": 0, "x": 5.63, "y": 0 }
				]
			},
			"hairnv21": {
				"rotate": [
					{
						"time": 0,
						"angle": -4.48,
						"curve": [ 0.363, 0.44, 0.755, 1 ]
					},
					{
						"time": 0.6,
						"angle": 0,
						"curve": [ 0.25, 0, 0.75, 1 ]
					},
					{
						"time": 1.6,
						"angle": -7.09,
						"curve": [ 0.258, 0, 0.619, 0.45 ]
					},
					{ "time": 2, "angle": -4.48 }
				],
				"translate": [
					{ "time": 0, "x": 0, "y": 0, "curve": "stepped" },
					{ "time": 0.6, "x": 0, "y": 0, "curve": "stepped" },
					{ "time": 1.6, "x": 0, "y": 0, "curve": "stepped" },
					{ "time": 2, "x": 0, "y": 0 }
				]
			},
			"armnv2": {
				"rotate": [
					{
						"time": 0,
						"angle": -2.05,
						"curve": [ 0.375, 0.5, 0.75, 1 ]
					},
					{
						"time": 0.5,
						"angle": 0,
						"curve": [ 0.25, 0, 0.75, 1 ]
					},
					{
						"time": 1.5,
						"angle": -4.1,
						"curve": [ 0.25, 0, 0.625, 0.5 ]
					},
					{ "time": 2, "angle": -2.05 }
				],
				"translate": [
					{ "time": 0, "x": 0, "y": 0, "curve": "stepped" },
					{ "time": 0.5, "x": 0, "y": 0, "curve": "stepped" },
					{ "time": 1.5, "x": 0, "y": 0, "curve": "stepped" },
					{ "time": 2, "x": 0, "y": 0 }
				]
			},
			"hairnv5": {
				"rotate": [
					{
						"time": 0,
						"angle": -6.78,
						"curve": [ 0.289, 0.17, 0.755, 1 ]
					},
					{
						"time": 0.9,
						"angle": 0,
						"curve": [ 0.25, 0, 0.75, 1 ]
					},
					{
						"time": 1.9,
						"angle": -7.09,
						"curve": [ 0.305, 0, 0.64, 0.36 ]
					},
					{ "time": 2, "angle": -6.78 }
				],
				"translate": [
					{ "time": 0, "x": 0, "y": 0, "curve": "stepped" },
					{ "time": 0.9, "x": 0, "y": 0, "curve": "stepped" },
					{ "time": 1.9, "x": 0, "y": 0, "curve": "stepped" },
					{ "time": 2, "x": 0, "y": 0 }
				]
			},
			"hair2nv41": {
				"rotate": [
					{
						"time": 0,
						"angle": -10.26,
						"curve": [ 0.32, 0.29, 0.757, 1 ]
					},
					{
						"time": 0.8,
						"angle": 0,
						"curve": [ 0.25, 0, 0.75, 1 ]
					},
					{
						"time": 1.8,
						"angle": -11.79,
						"curve": [ 0.284, 0, 0.625, 0.38 ]
					},
					{ "time": 2, "angle": -10.26 }
				],
				"translate": [
					{ "time": 0, "x": 0, "y": 0, "curve": "stepped" },
					{ "time": 0.8, "x": 0, "y": 0, "curve": "stepped" },
					{ "time": 1.8, "x": 0, "y": 0, "curve": "stepped" },
					{ "time": 2, "x": 0, "y": 0 }
				]
			},
			"arm2nv5": {
				"rotate": [
					{
						"time": 0,
						"angle": 0.33,
						"curve": [ 0.371, 0.62, 0.71, 1 ]
					},
					{
						"time": 0.1667,
						"angle": 0,
						"curve": [ 0.25, 0, 0.75, 1 ]
					},
					{
						"time": 1.1667,
						"angle": 3.4,
						"curve": [ 0.243, 0, 0.689, 0.75 ]
					},
					{ "time": 2, "angle": 0.33 }
				],
				"translate": [
					{ "time": 0, "x": 0, "y": 0, "curve": "stepped" },
					{ "time": 0.1667, "x": 0, "y": 0, "curve": "stepped" },
					{ "time": 1.1667, "x": 0, "y": 0, "curve": "stepped" },
					{ "time": 2, "x": 0, "y": 0 }
				]
			},
			"arm2nv9": {
				"rotate": [
					{ "time": 0, "angle": 0, "curve": "stepped" },
					{ "time": 0.6667, "angle": 0, "curve": "stepped" },
					{ "time": 1.6667, "angle": 0, "curve": "stepped" },
					{ "time": 2, "angle": 0 }
				],
				"translate": [
					{
						"time": 0,
						"x": 0.91,
						"y": 2.36,
						"curve": [ 0.351, 0.4, 0.757, 1 ]
					},
					{
						"time": 0.6667,
						"x": 0,
						"y": 0,
						"curve": [ 0.25, 0, 0.75, 1 ]
					},
					{
						"time": 1.6667,
						"x": 1.27,
						"y": 3.3,
						"curve": [ 0.265, 0, 0.618, 0.43 ]
					},
					{ "time": 2, "x": 0.91, "y": 2.36 }
				]
			},
			"hairnv41": {
				"rotate": [
					{
						"time": 0,
						"angle": -6.16,
						"curve": [ 0.32, 0.29, 0.757, 1 ]
					},
					{
						"time": 0.8,
						"angle": 0,
						"curve": [ 0.25, 0, 0.75, 1 ]
					},
					{
						"time": 1.8,
						"angle": -7.09,
						"curve": [ 0.284, 0, 0.625, 0.38 ]
					},
					{ "time": 2, "angle": -6.16 }
				],
				"translate": [
					{ "time": 0, "x": 0, "y": 0, "curve": "stepped" },
					{ "time": 0.8, "x": 0, "y": 0, "curve": "stepped" },
					{ "time": 1.8, "x": 0, "y": 0, "curve": "stepped" },
					{ "time": 2, "x": 0, "y": 0 }
				]
			},
			"hair4nv2": {
				"rotate": [
					{
						"time": 0,
						"angle": 7.79,
						"curve": [ 0.264, 0.06, 0.752, 1 ]
					},
					{
						"time": 0.9667,
						"angle": 0,
						"curve": [ 0.25, 0, 0.75, 1 ]
					},
					{
						"time": 1.9667,
						"angle": 7.88,
						"curve": [ 0.323, 0, 0.656, 0.34 ]
					},
					{ "time": 2, "angle": 7.79 }
				],
				"translate": [
					{ "time": 0, "x": 0, "y": 0, "curve": "stepped" },
					{ "time": 0.9667, "x": 0, "y": 0, "curve": "stepped" },
					{ "time": 1.9667, "x": 0, "y": 0, "curve": "stepped" },
					{ "time": 2, "x": 0, "y": 0 }
				]
			},
			"hairnv31": {
				"rotate": [
					{
						"time": 0,
						"angle": -5.37,
						"curve": [ 0.345, 0.37, 0.757, 1 ]
					},
					{
						"time": 0.7,
						"angle": 0,
						"curve": [ 0.25, 0, 0.75, 1 ]
					},
					{
						"time": 1.7,
						"angle": -7.09,
						"curve": [ 0.269, 0, 0.618, 0.42 ]
					},
					{ "time": 2, "angle": -5.37 }
				],
				"translate": [
					{ "time": 0, "x": 0, "y": 0, "curve": "stepped" },
					{ "time": 0.7, "x": 0, "y": 0, "curve": "stepped" },
					{ "time": 1.7, "x": 0, "y": 0, "curve": "stepped" },
					{ "time": 2, "x": 0, "y": 0 }
				]
			},
			"hair2nv51": {
				"rotate": [
					{
						"time": 0,
						"angle": 0,
						"curve": [ 0.25, 0, 0.75, 1 ]
					},
					{
						"time": 1,
						"angle": -11.79,
						"curve": [ 0.25, 0, 0.75, 1 ]
					},
					{ "time": 2, "angle": 0 }
				],
				"translate": [
					{ "time": 0, "x": 0, "y": 0, "curve": "stepped" },
					{ "time": 1, "x": 0, "y": 0, "curve": "stepped" },
					{ "time": 2, "x": 0, "y": 0 }
				]
			},
			"hair2nv31": {
				"rotate": [
					{
						"time": 0,
						"angle": -8.94,
						"curve": [ 0.345, 0.37, 0.757, 1 ]
					},
					{
						"time": 0.7,
						"angle": 0,
						"curve": [ 0.25, 0, 0.75, 1 ]
					},
					{
						"time": 1.7,
						"angle": -11.79,
						"curve": [ 0.269, 0, 0.618, 0.42 ]
					},
					{ "time": 2, "angle": -8.94 }
				],
				"translate": [
					{ "time": 0, "x": 0, "y": 0, "curve": "stepped" },
					{ "time": 0.7, "x": 0, "y": 0, "curve": "stepped" },
					{ "time": 1.7, "x": 0, "y": 0, "curve": "stepped" },
					{ "time": 2, "x": 0, "y": 0 }
				]
			},
			"hair4nv5": {
				"rotate": [
					{
						"time": 0,
						"angle": 11.34,
						"curve": [ 0.382, 0.58, 0.731, 1 ]
					},
					{
						"time": 0.3,
						"angle": 14.97,
						"curve": [ 0.25, 0, 0.75, 1 ]
					},
					{
						"time": 1.3,
						"angle": 0,
						"curve": [ 0.243, 0, 0.655, 0.63 ]
					},
					{ "time": 2, "angle": 11.34 }
				],
				"translate": [
					{ "time": 0, "x": 0, "y": 0, "curve": "stepped" },
					{ "time": 0.3, "x": 0, "y": 0, "curve": "stepped" },
					{ "time": 1.3, "x": 0, "y": 0, "curve": "stepped" },
					{ "time": 2, "x": 0, "y": 0 }
				]
			},
			"hairnv6": {
				"rotate": [
					{
						"time": 0,
						"angle": -7,
						"curve": [ 0.264, 0.06, 0.752, 1 ]
					},
					{
						"time": 0.9667,
						"angle": 0,
						"curve": [ 0.25, 0, 0.75, 1 ]
					},
					{
						"time": 1.9667,
						"angle": -7.09,
						"curve": [ 0.323, 0, 0.656, 0.34 ]
					},
					{ "time": 2, "angle": -7 }
				],
				"translate": [
					{ "time": 0, "x": 0, "y": 0, "curve": "stepped" },
					{ "time": 0.9667, "x": 0, "y": 0, "curve": "stepped" },
					{ "time": 1.9667, "x": 0, "y": 0, "curve": "stepped" },
					{ "time": 2, "x": 0, "y": 0 }
				]
			},
			"hair5nv31": {
				"rotate": [
					{
						"time": 0,
						"angle": 4.91,
						"curve": [ 0.264, 0.06, 0.752, 1 ]
					},
					{
						"time": 0.9667,
						"angle": 0,
						"curve": [ 0.25, 0, 0.75, 1 ]
					},
					{
						"time": 1.9667,
						"angle": 4.97,
						"curve": [ 0.323, 0, 0.656, 0.34 ]
					},
					{ "time": 2, "angle": 4.91 }
				],
				"translate": [
					{ "time": 0, "x": 0, "y": 0, "curve": "stepped" },
					{ "time": 0.9667, "x": 0, "y": 0, "curve": "stepped" },
					{ "time": 1.9667, "x": 0, "y": 0, "curve": "stepped" },
					{ "time": 2, "x": 0, "y": 0 }
				]
			},
			"arm2nv10": {
				"rotate": [
					{ "time": 0, "angle": 0, "curve": "stepped" },
					{ "time": 0.6, "angle": 0, "curve": "stepped" },
					{ "time": 1.6, "angle": 0, "curve": "stepped" },
					{ "time": 2, "angle": 0 }
				],
				"translate": [
					{ "time": 0, "x": 0, "y": 0, "curve": "stepped" },
					{ "time": 0.6, "x": 0, "y": 0, "curve": "stepped" },
					{ "time": 1.6, "x": 0, "y": 0, "curve": "stepped" },
					{ "time": 2, "x": 0, "y": 0 }
				]
			},
			"arm2nv12": {
				"rotate": [
					{
						"time": 0,
						"angle": 4.32,
						"curve": [ 0.32, 0.29, 0.757, 1 ]
					},
					{
						"time": 0.8,
						"angle": 0,
						"curve": [ 0.25, 0, 0.75, 1 ]
					},
					{
						"time": 1.8,
						"angle": 4.97,
						"curve": [ 0.284, 0, 0.625, 0.38 ]
					},
					{ "time": 2, "angle": 4.32 }
				],
				"translate": [
					{ "time": 0, "x": 0, "y": 0, "curve": "stepped" },
					{ "time": 0.8, "x": 0, "y": 0, "curve": "stepped" },
					{ "time": 1.8, "x": 0, "y": 0, "curve": "stepped" },
					{ "time": 2, "x": 0, "y": 0 }
				]
			},
			"Ctr_handRnv2": {
				"rotate": [
					{ "time": 0, "angle": 0, "curve": "stepped" },
					{ "time": 0.3333, "angle": 0, "curve": "stepped" },
					{ "time": 1.3333, "angle": 0, "curve": "stepped" },
					{ "time": 2, "angle": 0 }
				],
				"translate": [
					{
						"time": 0,
						"x": 0.45,
						"y": 1.66,
						"curve": [ 0.382, 0.57, 0.735, 1 ]
					},
					{
						"time": 0.3333,
						"x": 0,
						"y": 0,
						"curve": [ 0.25, 0, 0.75, 1 ]
					},
					{
						"time": 1.3333,
						"x": 1.59,
						"y": 5.85,
						"curve": [ 0.243, 0, 0.649, 0.6 ]
					},
					{ "time": 2, "x": 0.45, "y": 1.66 }
				]
			},
			"hair5nv41": {
				"rotate": [
					{
						"time": 0,
						"angle": 4.85,
						"curve": [ 0.352, 0.65, 0.687, 1 ]
					},
					{
						"time": 0.0667,
						"angle": 4.97,
						"curve": [ 0.25, 0, 0.75, 1 ]
					},
					{
						"time": 1.0667,
						"angle": 0,
						"curve": [ 0.25, 0, 0.75, 1 ]
					},
					{ "time": 2, "angle": 4.85 }
				],
				"translate": [
					{ "time": 0, "x": 0, "y": 0, "curve": "stepped" },
					{ "time": 0.0667, "x": 0, "y": 0, "curve": "stepped" },
					{ "time": 1.0667, "x": 0, "y": 0, "curve": "stepped" },
					{ "time": 2, "x": 0, "y": 0 }
				]
			},
			"Ctr_handLnv2": {
				"rotate": [
					{ "time": 0, "angle": 0, "curve": "stepped" },
					{ "time": 0.3333, "angle": 0, "curve": "stepped" },
					{ "time": 1.3333, "angle": 0, "curve": "stepped" },
					{ "time": 2, "angle": 0 }
				],
				"translate": [
					{ "time": 0, "x": 0, "y": 0, "curve": "stepped" },
					{ "time": 0.3333, "x": 0, "y": 0, "curve": "stepped" },
					{ "time": 1.3333, "x": 0, "y": 0, "curve": "stepped" },
					{ "time": 2, "x": 0, "y": 0 }
				]
			},
			"hair3nv5": {
				"rotate": [
					{
						"time": 0,
						"angle": -11.9,
						"curve": [ 0.264, 0.06, 0.752, 1 ]
					},
					{
						"time": 0.9667,
						"angle": 0,
						"curve": [ 0.25, 0, 0.75, 1 ]
					},
					{
						"time": 1.9667,
						"angle": -12.04,
						"curve": [ 0.323, 0, 0.656, 0.34 ]
					},
					{ "time": 2, "angle": -11.9 }
				],
				"translate": [
					{ "time": 0, "x": 0, "y": 0, "curve": "stepped" },
					{ "time": 0.9667, "x": 0, "y": 0, "curve": "stepped" },
					{ "time": 1.9667, "x": 0, "y": 0, "curve": "stepped" },
					{ "time": 2, "x": 0, "y": 0 }
				]
			},
			"arm2nv3": {
				"rotate": [
					{ "time": 0, "angle": 0, "curve": "stepped" },
					{ "time": 1, "angle": 0, "curve": "stepped" },
					{ "time": 2, "angle": 0 }
				],
				"translate": [
					{ "time": 0, "x": 0, "y": 0, "curve": "stepped" },
					{ "time": 1, "x": 0, "y": 0, "curve": "stepped" },
					{ "time": 2, "x": 0, "y": 0 }
				]
			},
			"hairnv7": {
				"rotate": [
					{
						"time": 0,
						"angle": -6.92,
						"curve": [ 0.352, 0.65, 0.687, 1 ]
					},
					{
						"time": 0.0667,
						"angle": -7.09,
						"curve": [ 0.25, 0, 0.75, 1 ]
					},
					{
						"time": 1.0667,
						"angle": 0,
						"curve": [ 0.246, 0, 0.723, 0.88 ]
					},
					{ "time": 2, "angle": -6.92 }
				],
				"translate": [
					{ "time": 0, "x": 0, "y": 0, "curve": "stepped" },
					{ "time": 0.0667, "x": 0, "y": 0, "curve": "stepped" },
					{ "time": 1.0667, "x": 0, "y": 0, "curve": "stepped" },
					{ "time": 2, "x": 0, "y": 0 }
				]
			},
			"hair3nv41": {
				"rotate": [
					{
						"time": 0,
						"angle": -11.53,
						"curve": [ 0.289, 0.17, 0.755, 1 ]
					},
					{
						"time": 0.9,
						"angle": 0,
						"curve": [ 0.25, 0, 0.75, 1 ]
					},
					{
						"time": 1.9,
						"angle": -12.04,
						"curve": [ 0.305, 0, 0.64, 0.36 ]
					},
					{ "time": 2, "angle": -11.53 }
				],
				"translate": [
					{ "time": 0, "x": 0, "y": 0, "curve": "stepped" },
					{ "time": 0.9, "x": 0, "y": 0, "curve": "stepped" },
					{ "time": 1.9, "x": 0, "y": 0, "curve": "stepped" },
					{ "time": 2, "x": 0, "y": 0 }
				]
			}
		}
	},
	"animation2": {
		"slots": {
			"FX5": {
				"attachment": [
					{ "time": 0, "name": "Comp 6/FX3_00000" },
					{ "time": 0.0333, "name": "Comp 6/FX3_00001" },
					{ "time": 0.0667, "name": "Comp 6/FX3_00002" },
					{ "time": 0.1, "name": "Comp 6/FX3_00003" },
					{ "time": 0.1333, "name": "Comp 6/FX3_00004" },
					{ "time": 0.1667, "name": "Comp 6/FX3_00005" },
					{ "time": 0.2, "name": "Comp 6/FX3_00006" },
					{ "time": 0.2333, "name": "Comp 6/FX3_00007" },
					{ "time": 0.2667, "name": "Comp 6/FX3_00008" },
					{ "time": 0.3, "name": "Comp 6/FX3_00009" },
					{ "time": 0.3333, "name": "Comp 6/FX3_00010" },
					{ "time": 0.3667, "name": "Comp 6/FX3_00011" },
					{ "time": 0.4, "name": "Comp 6/FX3_00012" },
					{ "time": 0.4333, "name": "Comp 6/FX3_00013" },
					{ "time": 0.4667, "name": "Comp 6/FX3_00014" },
					{ "time": 0.5, "name": "Comp 6/FX3_00015" },
					{ "time": 0.5333, "name": "Comp 6/FX3_00016" },
					{ "time": 0.5667, "name": "Comp 6/FX3_00017" },
					{ "time": 0.6, "name": "Comp 6/FX3_00018" },
					{ "time": 0.6333, "name": "Comp 6/FX3_00019" },
					{ "time": 0.6667, "name": "Comp 6/FX3_00020" },
					{ "time": 0.7, "name": "Comp 6/FX3_00021" },
					{ "time": 0.7333, "name": "Comp 6/FX3_00022" },
					{ "time": 0.7667, "name": "Comp 6/FX3_00023" },
					{ "time": 0.8, "name": "Comp 6/FX3_00024" },
					{ "time": 0.8333, "name": "Comp 6/FX3_00000" },
					{ "time": 0.8667, "name": "Comp 6/FX3_00001" },
					{ "time": 0.9, "name": "Comp 6/FX3_00002" },
					{ "time": 0.9333, "name": "Comp 6/FX3_00003" },
					{ "time": 0.9667, "name": "Comp 6/FX3_00004" },
					{ "time": 1, "name": "Comp 6/FX3_00005" },
					{ "time": 1.0333, "name": "Comp 6/FX3_00006" },
					{ "time": 1.0667, "name": "Comp 6/FX3_00007" },
					{ "time": 1.1, "name": "Comp 6/FX3_00008" },
					{ "time": 1.1333, "name": "Comp 6/FX3_00009" },
					{ "time": 1.1667, "name": "Comp 6/FX3_00010" },
					{ "time": 1.2, "name": "Comp 6/FX3_00011" },
					{ "time": 1.2333, "name": "Comp 6/FX3_00012" },
					{ "time": 1.2667, "name": "Comp 6/FX3_00013" },
					{ "time": 1.3, "name": "Comp 6/FX3_00014" },
					{ "time": 1.3333, "name": "Comp 6/FX3_00015" },
					{ "time": 1.3667, "name": "Comp 6/FX3_00016" },
					{ "time": 1.4, "name": "Comp 6/FX3_00017" },
					{ "time": 1.4333, "name": "Comp 6/FX3_00018" },
					{ "time": 1.4667, "name": "Comp 6/FX3_00019" },
					{ "time": 1.5, "name": "Comp 6/FX3_00020" },
					{ "time": 1.5333, "name": "Comp 6/FX3_00021" },
					{ "time": 1.5667, "name": "Comp 6/FX3_00022" },
					{ "time": 1.6, "name": "Comp 6/FX3_00023" },
					{ "time": 1.6333, "name": "Comp 6/FX3_00024" },
					{ "time": 1.6667, "name": "Comp 6/FX3_00000" },
					{ "time": 1.7, "name": "Comp 6/FX3_00001" },
					{ "time": 1.7333, "name": "Comp 6/FX3_00002" },
					{ "time": 1.7667, "name": "Comp 6/FX3_00003" },
					{ "time": 1.8, "name": "Comp 6/FX3_00004" },
					{ "time": 1.8333, "name": "Comp 6/FX3_00005" },
					{ "time": 1.8667, "name": "Comp 6/FX3_00006" },
					{ "time": 1.9, "name": "Comp 6/FX3_00007" },
					{ "time": 1.9333, "name": "Comp 6/FX3_00008" },
					{ "time": 1.9667, "name": "Comp 6/FX3_00009" },
					{ "time": 2, "name": "Comp 6/FX3_00010" }
				]
			},
			"FX9": {
				"attachment": [
					{ "time": 0, "name": "Comp 7/FX5_00000" },
					{ "time": 0.0333, "name": "Comp 7/FX5_00001" },
					{ "time": 0.0667, "name": "Comp 7/FX5_00002" },
					{ "time": 0.1, "name": "Comp 7/FX5_00003" },
					{ "time": 0.1333, "name": "Comp 7/FX5_00004" },
					{ "time": 0.1667, "name": "Comp 7/FX5_00005" },
					{ "time": 0.2, "name": "Comp 7/FX5_00006" },
					{ "time": 0.2333, "name": "Comp 7/FX5_00007" },
					{ "time": 0.2667, "name": "Comp 7/FX5_00008" },
					{ "time": 0.3, "name": "Comp 7/FX5_00009" },
					{ "time": 0.3333, "name": "Comp 7/FX5_00010" },
					{ "time": 0.3667, "name": "Comp 7/FX5_00011" },
					{ "time": 0.4, "name": "Comp 7/FX5_00012" },
					{ "time": 0.4333, "name": "Comp 7/FX5_00013" },
					{ "time": 0.4667, "name": "Comp 7/FX5_00014" },
					{ "time": 0.5, "name": "Comp 7/FX5_00015" },
					{ "time": 0.5333, "name": "Comp 7/FX5_00016" },
					{ "time": 0.5667, "name": "Comp 7/FX5_00017" },
					{ "time": 0.6, "name": "Comp 7/FX5_00018" },
					{ "time": 0.6333, "name": "Comp 7/FX5_00019" },
					{ "time": 0.6667, "name": "Comp 7/FX5_00020" },
					{ "time": 0.7, "name": "Comp 7/FX5_00021" },
					{ "time": 0.7333, "name": null }
				]
			}
		},
		"bones": {
			"arm2nv3": {
				"rotate": [
					{ "time": 0, "angle": 0, "curve": "stepped" },
					{ "time": 1, "angle": 0, "curve": "stepped" },
					{ "time": 2, "angle": 0 }
				],
				"translate": [
					{ "time": 0, "x": 0, "y": 0, "curve": "stepped" },
					{ "time": 1, "x": 0, "y": 0, "curve": "stepped" },
					{ "time": 2, "x": 0, "y": 0 }
				]
			},
			"arm2nv4": {
				"rotate": [
					{
						"time": 0,
						"angle": 0,
						"curve": [ 0.25, 0, 0.75, 1 ]
					},
					{
						"time": 1,
						"angle": 3.4,
						"curve": [ 0.25, 0, 0.75, 1 ]
					},
					{ "time": 2, "angle": 0 }
				],
				"translate": [
					{ "time": 0, "x": 0, "y": 0, "curve": "stepped" },
					{ "time": 1, "x": 0, "y": 0, "curve": "stepped" },
					{ "time": 2, "x": 0, "y": 0 }
				]
			},
			"arm2nv5": {
				"rotate": [
					{
						"time": 0,
						"angle": 0.33,
						"curve": [ 0.371, 0.62, 0.71, 1 ]
					},
					{
						"time": 0.1667,
						"angle": 0,
						"curve": [ 0.25, 0, 0.75, 1 ]
					},
					{
						"time": 1.1667,
						"angle": 3.4,
						"curve": [ 0.243, 0, 0.689, 0.75 ]
					},
					{ "time": 2, "angle": 0.33 }
				],
				"translate": [
					{ "time": 0, "x": 0, "y": 0, "curve": "stepped" },
					{ "time": 0.1667, "x": 0, "y": 0, "curve": "stepped" },
					{ "time": 1.1667, "x": 0, "y": 0, "curve": "stepped" },
					{ "time": 2, "x": 0, "y": 0 }
				]
			},
			"arm2nv6": {
				"rotate": [
					{ "time": 0, "angle": 0, "curve": "stepped" },
					{ "time": 0.5, "angle": 0, "curve": "stepped" },
					{ "time": 1.5, "angle": 0, "curve": "stepped" },
					{ "time": 2, "angle": 0 }
				],
				"translate": [
					{
						"time": 0,
						"x": -2.56,
						"y": 6.58,
						"curve": [ 0.375, 0.5, 0.75, 1 ]
					},
					{
						"time": 0.5,
						"x": 0,
						"y": 0,
						"curve": [ 0.25, 0, 0.75, 1 ]
					},
					{
						"time": 1.5,
						"x": -5.12,
						"y": 13.17,
						"curve": [ 0.25, 0, 0.625, 0.5 ]
					},
					{ "time": 2, "x": -2.56, "y": 6.58 }
				]
			},
			"Ctr_handRnv2": {
				"rotate": [
					{ "time": 0, "angle": 0, "curve": "stepped" },
					{ "time": 0.3333, "angle": 0, "curve": "stepped" },
					{ "time": 1.3333, "angle": 0, "curve": "stepped" },
					{ "time": 2, "angle": 0 }
				],
				"translate": [
					{
						"time": 0,
						"x": 0.45,
						"y": 1.66,
						"curve": [ 0.382, 0.57, 0.735, 1 ]
					},
					{
						"time": 0.3333,
						"x": 0,
						"y": 0,
						"curve": [ 0.25, 0, 0.75, 1 ]
					},
					{
						"time": 1.3333,
						"x": 1.59,
						"y": 5.85,
						"curve": [ 0.243, 0, 0.649, 0.6 ]
					},
					{ "time": 2, "x": 0.45, "y": 1.66 }
				]
			},
			"armnv2": {
				"rotate": [
					{
						"time": 0,
						"angle": -2.05,
						"curve": [ 0.375, 0.5, 0.75, 1 ]
					},
					{
						"time": 0.5,
						"angle": 0,
						"curve": [ 0.25, 0, 0.75, 1 ]
					},
					{
						"time": 1.5,
						"angle": -4.1,
						"curve": [ 0.25, 0, 0.625, 0.5 ]
					},
					{ "time": 2, "angle": -2.05 }
				],
				"translate": [
					{ "time": 0, "x": 0, "y": 0, "curve": "stepped" },
					{ "time": 0.5, "x": 0, "y": 0, "curve": "stepped" },
					{ "time": 1.5, "x": 0, "y": 0, "curve": "stepped" },
					{ "time": 2, "x": 0, "y": 0 }
				]
			},
			"Ctr_handLnv2": {
				"rotate": [
					{ "time": 0, "angle": 0, "curve": "stepped" },
					{ "time": 0.3333, "angle": 0, "curve": "stepped" },
					{ "time": 1.3333, "angle": 0, "curve": "stepped" },
					{ "time": 2, "angle": 0 }
				],
				"translate": [
					{ "time": 0, "x": 0, "y": 0, "curve": "stepped" },
					{ "time": 0.3333, "x": 0, "y": 0, "curve": "stepped" },
					{ "time": 1.3333, "x": 0, "y": 0, "curve": "stepped" },
					{ "time": 2, "x": 0, "y": 0 }
				]
			},
			"hand2nv2": {
				"rotate": [
					{
						"time": 0,
						"angle": -7.78,
						"curve": [ 0.375, 0.5, 0.75, 1 ]
					},
					{
						"time": 0.5,
						"angle": 0,
						"curve": [ 0.25, 0, 0.75, 1 ]
					},
					{
						"time": 1.5,
						"angle": -15.57,
						"curve": [ 0.25, 0, 0.625, 0.5 ]
					},
					{ "time": 2, "angle": -7.78 }
				],
				"translate": [
					{ "time": 0, "x": 0, "y": 0, "curve": "stepped" },
					{ "time": 0.5, "x": 0, "y": 0, "curve": "stepped" },
					{ "time": 1.5, "x": 0, "y": 0, "curve": "stepped" },
					{ "time": 2, "x": 0, "y": 0 }
				]
			},
			"arm2nv8": {
				"rotate": [
					{
						"time": 0,
						"angle": 2.94,
						"curve": [ 0.375, 0.5, 0.75, 1 ]
					},
					{
						"time": 0.5,
						"angle": 0,
						"curve": [ 0.25, 0, 0.75, 1 ]
					},
					{
						"time": 1.5,
						"angle": 5.89,
						"curve": [ 0.25, 0, 0.625, 0.5 ]
					},
					{ "time": 2, "angle": 2.94 }
				],
				"translate": [
					{ "time": 0, "x": 0, "y": 0, "curve": "stepped" },
					{ "time": 0.5, "x": 0, "y": 0, "curve": "stepped" },
					{ "time": 1.5, "x": 0, "y": 0, "curve": "stepped" },
					{ "time": 2, "x": 0, "y": 0 }
				]
			},
			"hair2nv21": {
				"rotate": [
					{
						"time": 0,
						"angle": -9.14,
						"curve": [ 0.304, 0.22, 0.643, 0.57 ]
					},
					{
						"time": 0.6,
						"angle": 0,
						"curve": [ 0.25, 0, 0.75, 1 ]
					},
					{
						"time": 1.6,
						"angle": -11.79,
						"curve": [ 0.3, 0, 0.636, 0.36 ]
					},
					{ "time": 2, "angle": -9.14 }
				],
				"translate": [
					{ "time": 0, "x": 0, "y": 0, "curve": "stepped" },
					{ "time": 0.6, "x": 0, "y": 0, "curve": "stepped" },
					{ "time": 1.6, "x": 0, "y": 0, "curve": "stepped" },
					{ "time": 2, "x": 0, "y": 0 }
				]
			},
			"hair2nv31": {
				"rotate": [
					{
						"time": 0,
						"angle": -8.94,
						"curve": [ 0.345, 0.37, 0.757, 1 ]
					},
					{
						"time": 0.7,
						"angle": 0,
						"curve": [ 0.25, 0, 0.75, 1 ]
					},
					{
						"time": 1.7,
						"angle": -11.79,
						"curve": [ 0.269, 0, 0.618, 0.42 ]
					},
					{ "time": 2, "angle": -8.94 }
				],
				"translate": [
					{ "time": 0, "x": 0, "y": 0, "curve": "stepped" },
					{ "time": 0.7, "x": 0, "y": 0, "curve": "stepped" },
					{ "time": 1.7, "x": 0, "y": 0, "curve": "stepped" },
					{ "time": 2, "x": 0, "y": 0 }
				]
			},
			"hair2nv41": {
				"rotate": [
					{
						"time": 0,
						"angle": -10.26,
						"curve": [ 0.32, 0.29, 0.757, 1 ]
					},
					{
						"time": 0.8,
						"angle": 0,
						"curve": [ 0.25, 0, 0.75, 1 ]
					},
					{
						"time": 1.8,
						"angle": -11.79,
						"curve": [ 0.284, 0, 0.625, 0.38 ]
					},
					{ "time": 2, "angle": -10.26 }
				],
				"translate": [
					{ "time": 0, "x": 0, "y": 0, "curve": "stepped" },
					{ "time": 0.8, "x": 0, "y": 0, "curve": "stepped" },
					{ "time": 1.8, "x": 0, "y": 0, "curve": "stepped" },
					{ "time": 2, "x": 0, "y": 0 }
				]
			},
			"hair2nv51": {
				"rotate": [
					{
						"time": 0,
						"angle": 0,
						"curve": [ 0.25, 0, 0.75, 1 ]
					},
					{
						"time": 1,
						"angle": -11.79,
						"curve": [ 0.25, 0, 0.75, 1 ]
					},
					{ "time": 2, "angle": 0 }
				],
				"translate": [
					{ "time": 0, "x": 0, "y": 0, "curve": "stepped" },
					{ "time": 1, "x": 0, "y": 0, "curve": "stepped" },
					{ "time": 2, "x": 0, "y": 0 }
				]
			},
			"hairnv21": {
				"rotate": [
					{
						"time": 0,
						"angle": -4.48,
						"curve": [ 0.363, 0.44, 0.755, 1 ]
					},
					{
						"time": 0.6,
						"angle": 0,
						"curve": [ 0.25, 0, 0.75, 1 ]
					},
					{
						"time": 1.6,
						"angle": -7.09,
						"curve": [ 0.258, 0, 0.619, 0.45 ]
					},
					{ "time": 2, "angle": -4.48 }
				],
				"translate": [
					{ "time": 0, "x": 0, "y": 0, "curve": "stepped" },
					{ "time": 0.6, "x": 0, "y": 0, "curve": "stepped" },
					{ "time": 1.6, "x": 0, "y": 0, "curve": "stepped" },
					{ "time": 2, "x": 0, "y": 0 }
				]
			},
			"hairnv31": {
				"rotate": [
					{
						"time": 0,
						"angle": -5.37,
						"curve": [ 0.345, 0.37, 0.757, 1 ]
					},
					{
						"time": 0.7,
						"angle": 0,
						"curve": [ 0.25, 0, 0.75, 1 ]
					},
					{
						"time": 1.7,
						"angle": -7.09,
						"curve": [ 0.269, 0, 0.618, 0.42 ]
					},
					{ "time": 2, "angle": -5.37 }
				],
				"translate": [
					{ "time": 0, "x": 0, "y": 0, "curve": "stepped" },
					{ "time": 0.7, "x": 0, "y": 0, "curve": "stepped" },
					{ "time": 1.7, "x": 0, "y": 0, "curve": "stepped" },
					{ "time": 2, "x": 0, "y": 0 }
				]
			},
			"hairnv41": {
				"rotate": [
					{
						"time": 0,
						"angle": -6.16,
						"curve": [ 0.32, 0.29, 0.757, 1 ]
					},
					{
						"time": 0.8,
						"angle": 0,
						"curve": [ 0.25, 0, 0.75, 1 ]
					},
					{
						"time": 1.8,
						"angle": -7.09,
						"curve": [ 0.284, 0, 0.625, 0.38 ]
					},
					{ "time": 2, "angle": -6.16 }
				],
				"translate": [
					{ "time": 0, "x": 0, "y": 0, "curve": "stepped" },
					{ "time": 0.8, "x": 0, "y": 0, "curve": "stepped" },
					{ "time": 1.8, "x": 0, "y": 0, "curve": "stepped" },
					{ "time": 2, "x": 0, "y": 0 }
				]
			},
			"hairnv5": {
				"rotate": [
					{
						"time": 0,
						"angle": -6.78,
						"curve": [ 0.289, 0.17, 0.755, 1 ]
					},
					{
						"time": 0.9,
						"angle": 0,
						"curve": [ 0.25, 0, 0.75, 1 ]
					},
					{
						"time": 1.9,
						"angle": -7.09,
						"curve": [ 0.305, 0, 0.64, 0.36 ]
					},
					{ "time": 2, "angle": -6.78 }
				],
				"translate": [
					{ "time": 0, "x": 0, "y": 0, "curve": "stepped" },
					{ "time": 0.9, "x": 0, "y": 0, "curve": "stepped" },
					{ "time": 1.9, "x": 0, "y": 0, "curve": "stepped" },
					{ "time": 2, "x": 0, "y": 0 }
				]
			},
			"hairnv6": {
				"rotate": [
					{
						"time": 0,
						"angle": -7,
						"curve": [ 0.264, 0.06, 0.752, 1 ]
					},
					{
						"time": 0.9667,
						"angle": 0,
						"curve": [ 0.25, 0, 0.75, 1 ]
					},
					{
						"time": 1.9667,
						"angle": -7.09,
						"curve": [ 0.323, 0, 0.656, 0.34 ]
					},
					{ "time": 2, "angle": -7 }
				],
				"translate": [
					{ "time": 0, "x": 0, "y": 0, "curve": "stepped" },
					{ "time": 0.9667, "x": 0, "y": 0, "curve": "stepped" },
					{ "time": 1.9667, "x": 0, "y": 0, "curve": "stepped" },
					{ "time": 2, "x": 0, "y": 0 }
				]
			},
			"hairnv7": {
				"rotate": [
					{
						"time": 0,
						"angle": -6.92,
						"curve": [ 0.352, 0.65, 0.687, 1 ]
					},
					{
						"time": 0.0667,
						"angle": -7.09,
						"curve": [ 0.25, 0, 0.75, 1 ]
					},
					{
						"time": 1.0667,
						"angle": 0,
						"curve": [ 0.246, 0, 0.723, 0.88 ]
					},
					{ "time": 2, "angle": -6.92 }
				],
				"translate": [
					{ "time": 0, "x": 0, "y": 0, "curve": "stepped" },
					{ "time": 0.0667, "x": 0, "y": 0, "curve": "stepped" },
					{ "time": 1.0667, "x": 0, "y": 0, "curve": "stepped" },
					{ "time": 2, "x": 0, "y": 0 }
				]
			},
			"hair3nv21": {
				"rotate": [
					{
						"time": 0,
						"angle": -9.12,
						"curve": [ 0.345, 0.37, 0.757, 1 ]
					},
					{
						"time": 0.7,
						"angle": 0,
						"curve": [ 0.25, 0, 0.75, 1 ]
					},
					{
						"time": 1.7,
						"angle": -12.04,
						"curve": [ 0.269, 0, 0.618, 0.42 ]
					},
					{ "time": 2, "angle": -9.12 }
				],
				"translate": [
					{ "time": 0, "x": 0, "y": 0, "curve": "stepped" },
					{ "time": 0.7, "x": 0, "y": 0, "curve": "stepped" },
					{ "time": 1.7, "x": 0, "y": 0, "curve": "stepped" },
					{ "time": 2, "x": 0, "y": 0 }
				]
			},
			"hair3nv31": {
				"rotate": [
					{
						"time": 0,
						"angle": -10.47,
						"curve": [ 0.32, 0.29, 0.757, 1 ]
					},
					{
						"time": 0.8,
						"angle": 0,
						"curve": [ 0.25, 0, 0.75, 1 ]
					},
					{
						"time": 1.8,
						"angle": -12.04,
						"curve": [ 0.284, 0, 0.625, 0.38 ]
					},
					{ "time": 2, "angle": -10.47 }
				],
				"translate": [
					{ "time": 0, "x": 0, "y": 0, "curve": "stepped" },
					{ "time": 0.8, "x": 0, "y": 0, "curve": "stepped" },
					{ "time": 1.8, "x": 0, "y": 0, "curve": "stepped" },
					{ "time": 2, "x": 0, "y": 0 }
				]
			},
			"hair3nv41": {
				"rotate": [
					{
						"time": 0,
						"angle": -11.53,
						"curve": [ 0.289, 0.17, 0.755, 1 ]
					},
					{
						"time": 0.9,
						"angle": 0,
						"curve": [ 0.25, 0, 0.75, 1 ]
					},
					{
						"time": 1.9,
						"angle": -12.04,
						"curve": [ 0.305, 0, 0.64, 0.36 ]
					},
					{ "time": 2, "angle": -11.53 }
				],
				"translate": [
					{ "time": 0, "x": 0, "y": 0, "curve": "stepped" },
					{ "time": 0.9, "x": 0, "y": 0, "curve": "stepped" },
					{ "time": 1.9, "x": 0, "y": 0, "curve": "stepped" },
					{ "time": 2, "x": 0, "y": 0 }
				]
			},
			"hair3nv5": {
				"rotate": [
					{
						"time": 0,
						"angle": -11.9,
						"curve": [ 0.264, 0.06, 0.752, 1 ]
					},
					{
						"time": 0.9667,
						"angle": 0,
						"curve": [ 0.25, 0, 0.75, 1 ]
					},
					{
						"time": 1.9667,
						"angle": -12.04,
						"curve": [ 0.323, 0, 0.656, 0.34 ]
					},
					{ "time": 2, "angle": -11.9 }
				],
				"translate": [
					{ "time": 0, "x": 0, "y": 0, "curve": "stepped" },
					{ "time": 0.9667, "x": 0, "y": 0, "curve": "stepped" },
					{ "time": 1.9667, "x": 0, "y": 0, "curve": "stepped" },
					{ "time": 2, "x": 0, "y": 0 }
				]
			},
			"hair4nv2": {
				"rotate": [
					{
						"time": 0,
						"angle": 7.79,
						"curve": [ 0.264, 0.06, 0.752, 1 ]
					},
					{
						"time": 0.9667,
						"angle": 0,
						"curve": [ 0.25, 0, 0.75, 1 ]
					},
					{
						"time": 1.9667,
						"angle": 7.88,
						"curve": [ 0.323, 0, 0.656, 0.34 ]
					},
					{ "time": 2, "angle": 7.79 }
				],
				"translate": [
					{ "time": 0, "x": 0, "y": 0, "curve": "stepped" },
					{ "time": 0.9667, "x": 0, "y": 0, "curve": "stepped" },
					{ "time": 1.9667, "x": 0, "y": 0, "curve": "stepped" },
					{ "time": 2, "x": 0, "y": 0 }
				]
			},
			"hair4nv3": {
				"rotate": [
					{
						"time": 0,
						"angle": 7.7,
						"curve": [ 0.352, 0.65, 0.687, 1 ]
					},
					{
						"time": 0.0667,
						"angle": 7.88,
						"curve": [ 0.25, 0, 0.75, 1 ]
					},
					{
						"time": 1.0667,
						"angle": 0,
						"curve": [ 0.25, 0, 0.75, 1 ]
					},
					{ "time": 2, "angle": 7.7 }
				],
				"translate": [
					{ "time": 0, "x": 0, "y": 0, "curve": "stepped" },
					{ "time": 0.0667, "x": 0, "y": 0, "curve": "stepped" },
					{ "time": 1.0667, "x": 0, "y": 0, "curve": "stepped" },
					{ "time": 2, "x": 0, "y": 0 }
				]
			},
			"hair4nv4": {
				"rotate": [
					{
						"time": 0,
						"angle": 13.93,
						"curve": [ 0.366, 0.63, 0.703, 1 ]
					},
					{
						"time": 0.1333,
						"angle": 14.97,
						"curve": [ 0.25, 0, 0.75, 1 ]
					},
					{
						"time": 1.1333,
						"angle": 0,
						"curve": [ 0.244, 0, 0.7, 0.79 ]
					},
					{ "time": 2, "angle": 13.93 }
				],
				"translate": [
					{ "time": 0, "x": 0, "y": 0, "curve": "stepped" },
					{ "time": 0.1333, "x": 0, "y": 0, "curve": "stepped" },
					{ "time": 1.1333, "x": 0, "y": 0, "curve": "stepped" },
					{ "time": 2, "x": 0, "y": 0 }
				]
			},
			"hair4nv5": {
				"rotate": [
					{
						"time": 0,
						"angle": 11.34,
						"curve": [ 0.382, 0.58, 0.731, 1 ]
					},
					{
						"time": 0.3,
						"angle": 14.97,
						"curve": [ 0.25, 0, 0.75, 1 ]
					},
					{
						"time": 1.3,
						"angle": 0,
						"curve": [ 0.243, 0, 0.655, 0.63 ]
					},
					{ "time": 2, "angle": 11.34 }
				],
				"translate": [
					{ "time": 0, "x": 0, "y": 0, "curve": "stepped" },
					{ "time": 0.3, "x": 0, "y": 0, "curve": "stepped" },
					{ "time": 1.3, "x": 0, "y": 0, "curve": "stepped" },
					{ "time": 2, "x": 0, "y": 0 }
				]
			},
			"arm2nv10": {
				"rotate": [
					{ "time": 0, "angle": 0, "curve": "stepped" },
					{ "time": 0.6, "angle": 0, "curve": "stepped" },
					{ "time": 1.6, "angle": 0, "curve": "stepped" },
					{ "time": 2, "angle": 0 }
				],
				"translate": [
					{ "time": 0, "x": 0, "y": 0, "curve": "stepped" },
					{ "time": 0.6, "x": 0, "y": 0, "curve": "stepped" },
					{ "time": 1.6, "x": 0, "y": 0, "curve": "stepped" },
					{ "time": 2, "x": 0, "y": 0 }
				]
			},
			"arm2nv11": {
				"rotate": [
					{
						"time": 0,
						"angle": 3.76,
						"curve": [ 0.345, 0.37, 0.757, 1 ]
					},
					{
						"time": 0.7,
						"angle": 0,
						"curve": [ 0.25, 0, 0.75, 1 ]
					},
					{
						"time": 1.7,
						"angle": 4.97,
						"curve": [ 0.269, 0, 0.618, 0.42 ]
					},
					{ "time": 2, "angle": 3.76 }
				],
				"translate": [
					{ "time": 0, "x": 0, "y": 0, "curve": "stepped" },
					{ "time": 0.7, "x": 0, "y": 0, "curve": "stepped" },
					{ "time": 1.7, "x": 0, "y": 0, "curve": "stepped" },
					{ "time": 2, "x": 0, "y": 0 }
				]
			},
			"arm2nv12": {
				"rotate": [
					{
						"time": 0,
						"angle": 4.32,
						"curve": [ 0.32, 0.29, 0.757, 1 ]
					},
					{
						"time": 0.8,
						"angle": 0,
						"curve": [ 0.25, 0, 0.75, 1 ]
					},
					{
						"time": 1.8,
						"angle": 4.97,
						"curve": [ 0.284, 0, 0.625, 0.38 ]
					},
					{ "time": 2, "angle": 4.32 }
				],
				"translate": [
					{ "time": 0, "x": 0, "y": 0, "curve": "stepped" },
					{ "time": 0.8, "x": 0, "y": 0, "curve": "stepped" },
					{ "time": 1.8, "x": 0, "y": 0, "curve": "stepped" },
					{ "time": 2, "x": 0, "y": 0 }
				]
			},
			"hair5nv21": {
				"rotate": [
					{
						"time": 0,
						"angle": 4.76,
						"curve": [ 0.289, 0.17, 0.755, 1 ]
					},
					{
						"time": 0.9,
						"angle": 0,
						"curve": [ 0.25, 0, 0.75, 1 ]
					},
					{
						"time": 1.9,
						"angle": 4.97,
						"curve": [ 0.305, 0, 0.64, 0.36 ]
					},
					{ "time": 2, "angle": 4.76 }
				],
				"translate": [
					{ "time": 0, "x": 0, "y": 0, "curve": "stepped" },
					{ "time": 0.9, "x": 0, "y": 0, "curve": "stepped" },
					{ "time": 1.9, "x": 0, "y": 0, "curve": "stepped" },
					{ "time": 2, "x": 0, "y": 0 }
				]
			},
			"hair5nv31": {
				"rotate": [
					{
						"time": 0,
						"angle": 4.91,
						"curve": [ 0.264, 0.06, 0.752, 1 ]
					},
					{
						"time": 0.9667,
						"angle": 0,
						"curve": [ 0.25, 0, 0.75, 1 ]
					},
					{
						"time": 1.9667,
						"angle": 4.97,
						"curve": [ 0.323, 0, 0.656, 0.34 ]
					},
					{ "time": 2, "angle": 4.91 }
				],
				"translate": [
					{ "time": 0, "x": 0, "y": 0, "curve": "stepped" },
					{ "time": 0.9667, "x": 0, "y": 0, "curve": "stepped" },
					{ "time": 1.9667, "x": 0, "y": 0, "curve": "stepped" },
					{ "time": 2, "x": 0, "y": 0 }
				]
			},
			"hair5nv41": {
				"rotate": [
					{
						"time": 0,
						"angle": 4.85,
						"curve": [ 0.352, 0.65, 0.687, 1 ]
					},
					{
						"time": 0.0667,
						"angle": 4.97,
						"curve": [ 0.25, 0, 0.75, 1 ]
					},
					{
						"time": 1.0667,
						"angle": 0,
						"curve": [ 0.25, 0, 0.75, 1 ]
					},
					{ "time": 2, "angle": 4.85 }
				],
				"translate": [
					{ "time": 0, "x": 0, "y": 0, "curve": "stepped" },
					{ "time": 0.0667, "x": 0, "y": 0, "curve": "stepped" },
					{ "time": 1.0667, "x": 0, "y": 0, "curve": "stepped" },
					{ "time": 2, "x": 0, "y": 0 }
				]
			},
			"arm2nv9": {
				"rotate": [
					{ "time": 0, "angle": 0, "curve": "stepped" },
					{ "time": 0.6667, "angle": 0, "curve": "stepped" },
					{ "time": 1.6667, "angle": 0, "curve": "stepped" },
					{ "time": 2, "angle": 0 }
				],
				"translate": [
					{
						"time": 0,
						"x": 0.91,
						"y": 2.36,
						"curve": [ 0.351, 0.4, 0.757, 1 ]
					},
					{
						"time": 0.6667,
						"x": 0,
						"y": 0,
						"curve": [ 0.25, 0, 0.75, 1 ]
					},
					{
						"time": 1.6667,
						"x": 1.27,
						"y": 3.3,
						"curve": [ 0.265, 0, 0.618, 0.43 ]
					},
					{ "time": 2, "x": 0.91, "y": 2.36 }
				]
			},
			"Jackpot3": {
				"scale": [
					{
						"time": 0,
						"x": 1.188,
						"y": 1.188,
						"curve": [ 0.25, 0, 0.75, 1 ]
					},
					{
						"time": 0.1667,
						"x": 1,
						"y": 1,
						"curve": [ 0.25, 0, 0.75, 1 ]
					},
					{
						"time": 0.3333,
						"x": 1.188,
						"y": 1.188,
						"curve": [ 0.25, 0, 0.75, 1 ]
					},
					{
						"time": 0.5,
						"x": 1,
						"y": 1,
						"curve": [ 0.25, 0, 0.75, 1 ]
					},
					{
						"time": 0.6667,
						"x": 1.188,
						"y": 1.188,
						"curve": [ 0.25, 0, 0.75, 1 ]
					},
					{
						"time": 0.8333,
						"x": 1,
						"y": 1,
						"curve": [ 0.25, 0, 0.75, 1 ]
					},
					{
						"time": 1,
						"x": 1.188,
						"y": 1.188,
						"curve": [ 0.25, 0, 0.75, 1 ]
					},
					{
						"time": 1.1667,
						"x": 1,
						"y": 1,
						"curve": [ 0.25, 0, 0.75, 1 ]
					},
					{
						"time": 1.3333,
						"x": 1.188,
						"y": 1.188,
						"curve": [ 0.25, 0, 0.75, 1 ]
					},
					{
						"time": 1.5,
						"x": 1,
						"y": 1,
						"curve": [ 0.25, 0, 0.75, 1 ]
					},
					{
						"time": 1.6667,
						"x": 1.188,
						"y": 1.188,
						"curve": [ 0.25, 0, 0.75, 1 ]
					},
					{
						"time": 1.8333,
						"x": 1,
						"y": 1,
						"curve": [ 0.25, 0, 0.75, 1 ]
					},
					{ "time": 2, "x": 1.188, "y": 1.188 }
				]
			},
			"Fx8": {
				"translate": [
					{ "time": 0, "x": 5.63, "y": 0 }
				]
			}
		}
	}
}
}