{
"skeleton": { "hash": "6eOoNtOk0IM2N197zoDBv76zEFc", "spine": "3.6.53", "width": 157.45, "height": 179.82, "images": "./images/" },
"bones": [
	{ "name": "root" },
	{ "name": "iy6", "parent": "root", "x": -0.32, "y": -1.29 },
	{ "name": "iy9", "parent": "iy6", "x": 2.78, "y": 51.18 },
	{ "name": "iy7", "parent": "iy9", "x": -15.66, "y": 22.7, "scaleX": 0.28, "scaleY": 0.28 }
],
"slots": [
	{ "name": "iy6", "bone": "iy9", "attachment": "iy6" },
	{ "name": "spakle", "bone": "iy7", "color": "ffffff00", "attachment": "spakle", "blend": "additive" }
],
"skins": {
	"default": {
		"iy6": {
			"iy6": { "x": 0.35, "y": 0.88, "width": 96, "height": 96 }
		},
		"spakle": {
			"spakle": { "width": 563, "height": 643 }
		}
	}
},
"animations": {
	"animation": {
		"slots": {
			"spakle": {
				"color": [
					{ "time": 0, "color": "fbfbfb00" },
					{ "time": 0.2, "color": "ffffffff" },
					{ "time": 0.3667, "color": "fbfbfb00", "curve": "stepped" },
					{ "time": 0.9333, "color": "fbfbfb00" },
					{ "time": 1.1, "color": "ffffffff" },
					{ "time": 1.3, "color": "fbfbfb00" }
				]
			}
		},
		"bones": {
			"iy9": {
				"rotate": [
					{
						"time": 0,
						"angle": -7.63,
						"curve": [ 0.372, 0.48, 0.752, 1 ]
					},
					{
						"time": 0.2667,
						"angle": 0,
						"curve": [ 0.25, 0, 0.75, 1 ]
					},
					{
						"time": 0.7667,
						"angle": -14.02,
						"curve": [ 0.25, 0, 0.75, 1 ]
					},
					{
						"time": 1.2667,
						"angle": 0,
						"curve": [ 0.25, 0, 0.75, 1 ]
					},
					{
						"time": 1.7667,
						"angle": -14.02,
						"curve": [ 0.252, 0, 0.622, 0.48 ]
					},
					{ "time": 2, "angle": -7.63 }
				],
				"translate": [
					{
						"time": 0,
						"x": 0,
						"y": 0,
						"curve": [ 0.25, 0, 0.75, 1 ]
					},
					{
						"time": 0.5,
						"x": 0,
						"y": 13.89,
						"curve": [ 0.25, 0, 0.75, 1 ]
					},
					{
						"time": 1,
						"x": 0,
						"y": 0,
						"curve": [ 0.25, 0, 0.75, 1 ]
					},
					{
						"time": 1.5,
						"x": 0,
						"y": 13.89,
						"curve": [ 0.25, 0, 0.75, 1 ]
					},
					{ "time": 2, "x": 0, "y": 0 }
				],
				"scale": [
					{ "time": 2, "x": 1, "y": 1 }
				]
			},
			"iy7": {
				"rotate": [
					{ "time": 0, "angle": 0 },
					{ "time": 0.3667, "angle": -86.5 },
					{ "time": 0.9333, "angle": 0 },
					{ "time": 1.3, "angle": -86.5, "curve": "stepped" },
					{ "time": 2, "angle": -86.5 }
				],
				"translate": [
					{ "time": 2, "x": 0, "y": 0 }
				],
				"scale": [
					{ "time": 0, "x": 1, "y": 1 },
					{ "time": 0.3667, "x": 2.33, "y": 2.33 },
					{ "time": 0.9333, "x": 1, "y": 1 },
					{ "time": 1.3, "x": 2.33, "y": 2.33, "curve": "stepped" },
					{ "time": 2, "x": 2.33, "y": 2.33 }
				]
			},
			"iy6": {
				"rotate": [
					{ "time": 2, "angle": 0 }
				],
				"translate": [
					{ "time": 2, "x": 0, "y": 0 }
				],
				"scale": [
					{ "time": 2, "x": 1, "y": 1 }
				]
			},
			"root": {
				"rotate": [
					{ "time": 0, "angle": 0, "curve": "stepped" },
					{ "time": 1, "angle": 0, "curve": "stepped" },
					{ "time": 2, "angle": 0 }
				],
				"translate": [
					{ "time": 0, "x": 0, "y": 0, "curve": "stepped" },
					{ "time": 1, "x": 0, "y": 0, "curve": "stepped" },
					{ "time": 2, "x": 0, "y": 0 }
				]
			}
		}
	}
}
}