{
"skeleton": { "hash": "UqXYasgXBkkigtyQo2lCko0G7aM", "spine": "3.6.53", "width": 118, "height": 82, "images": "./images/" },
"bones": [
	{ "name": "root" },
	{ "name": "aaa", "parent": "root", "x": 1.96, "y": 6.73 },
	{ "name": "aaa3", "parent": "aaa", "x": -2.04, "y": 50.37 },
	{ "name": "fx", "parent": "aaa", "x": -3.85, "y": 50.6 },
	{ "name": "it7 copy", "parent": "aaa", "x": -5.66, "y": 49.19 }
],
"slots": [
	{ "name": "it7 copy", "bone": "it7 copy", "attachment": "it7 copy" },
	{ "name": "aaa", "bone": "aaa3", "attachment": "aaa" },
	{ "name": "fx", "bone": "fx", "blend": "additive" },
	{ "name": "fx2", "bone": "fx", "blend": "additive" }
],
"skins": {
	"default": {
		"aaa": {
			"aaa": { "x": 1.33, "y": -1.16, "width": 118, "height": 82 }
		},
		"fx": {
			"FX/FX1_00000": { "width": 264, "height": 251 },
			"FX/FX1_00001": { "width": 264, "height": 251 },
			"FX/FX1_00002": { "width": 264, "height": 251 },
			"FX/FX1_00003": { "width": 264, "height": 251 },
			"FX/FX1_00004": { "width": 264, "height": 251 },
			"FX/FX1_00005": { "width": 264, "height": 251 },
			"FX/FX1_00006": { "width": 264, "height": 251 },
			"FX/FX1_00007": { "width": 264, "height": 251 },
			"FX/FX1_00008": { "width": 264, "height": 251 },
			"FX/FX1_00009": { "width": 264, "height": 251 }
		},
		"fx2": {
			"FX/FX1_00000": { "width": 264, "height": 251 },
			"FX/FX1_00001": { "width": 264, "height": 251 },
			"FX/FX1_00002": { "width": 264, "height": 251 },
			"FX/FX1_00003": { "width": 264, "height": 251 },
			"FX/FX1_00004": { "width": 264, "height": 251 },
			"FX/FX1_00005": { "width": 264, "height": 251 },
			"FX/FX1_00006": { "width": 264, "height": 251 },
			"FX/FX1_00007": { "width": 264, "height": 251 },
			"FX/FX1_00008": { "width": 264, "height": 251 },
			"FX/FX1_00009": { "width": 264, "height": 251 }
		},
		"it7 copy": {
			"it7 copy": { "x": 5.46, "y": 1.52, "width": 99, "height": 67 }
		}
	}
},
"animations": {
	"animation": {
		"slots": {
			"fx": {
				"color": [
					{ "time": 0.3333, "color": "13ff00ff" }
				],
				"attachment": [
					{ "time": 0.3333, "name": "FX/FX1_00000" },
					{ "time": 0.3667, "name": "FX/FX1_00001" },
					{ "time": 0.4, "name": "FX/FX1_00002" },
					{ "time": 0.4333, "name": "FX/FX1_00003" },
					{ "time": 0.4667, "name": "FX/FX1_00004" },
					{ "time": 0.5, "name": "FX/FX1_00005" },
					{ "time": 0.5333, "name": "FX/FX1_00006" },
					{ "time": 0.5667, "name": "FX/FX1_00007" },
					{ "time": 0.6, "name": "FX/FX1_00008" },
					{ "time": 0.6333, "name": "FX/FX1_00009" },
					{ "time": 0.6667, "name": "FX/FX1_00000" },
					{ "time": 0.7, "name": "FX/FX1_00001" },
					{ "time": 0.7333, "name": "FX/FX1_00002" },
					{ "time": 0.7667, "name": "FX/FX1_00003" },
					{ "time": 0.8, "name": "FX/FX1_00004" },
					{ "time": 0.8333, "name": "FX/FX1_00005" },
					{ "time": 0.8667, "name": "FX/FX1_00006" },
					{ "time": 0.9, "name": "FX/FX1_00007" },
					{ "time": 0.9333, "name": "FX/FX1_00008" },
					{ "time": 0.9667, "name": "FX/FX1_00009" },
					{ "time": 1, "name": "FX/FX1_00000" },
					{ "time": 1.0333, "name": "FX/FX1_00001" },
					{ "time": 1.0667, "name": "FX/FX1_00002" },
					{ "time": 1.1, "name": "FX/FX1_00003" },
					{ "time": 1.1333, "name": "FX/FX1_00004" },
					{ "time": 1.1667, "name": "FX/FX1_00005" },
					{ "time": 1.2, "name": "FX/FX1_00006" },
					{ "time": 1.2333, "name": "FX/FX1_00007" },
					{ "time": 1.2667, "name": "FX/FX1_00008" },
					{ "time": 1.3, "name": "FX/FX1_00009" },
					{ "time": 1.3333, "name": "FX/FX1_00000" },
					{ "time": 1.3667, "name": "FX/FX1_00001" },
					{ "time": 1.4, "name": "FX/FX1_00002" },
					{ "time": 1.4333, "name": "FX/FX1_00003" },
					{ "time": 1.4667, "name": "FX/FX1_00004" },
					{ "time": 1.5, "name": "FX/FX1_00005" },
					{ "time": 1.5333, "name": "FX/FX1_00006" },
					{ "time": 1.5667, "name": "FX/FX1_00007" },
					{ "time": 1.6, "name": "FX/FX1_00008" },
					{ "time": 1.6333, "name": "FX/FX1_00009" },
					{ "time": 1.6667, "name": "FX/FX1_00000" },
					{ "time": 1.7, "name": "FX/FX1_00001" },
					{ "time": 1.7333, "name": "FX/FX1_00002" },
					{ "time": 1.7667, "name": "FX/FX1_00003" },
					{ "time": 1.8, "name": "FX/FX1_00004" },
					{ "time": 1.8333, "name": "FX/FX1_00005" },
					{ "time": 1.8667, "name": "FX/FX1_00006" },
					{ "time": 1.9, "name": "FX/FX1_00007" },
					{ "time": 1.9333, "name": "FX/FX1_00008" },
					{ "time": 1.9667, "name": "FX/FX1_00009" },
					{ "time": 2, "name": null }
				]
			},
			"fx2": {
				"color": [
					{ "time": 0.3333, "color": "dcff00ff" }
				],
				"attachment": [
					{ "time": 0.3333, "name": "FX/FX1_00000" },
					{ "time": 0.3667, "name": "FX/FX1_00001" },
					{ "time": 0.4, "name": "FX/FX1_00002" },
					{ "time": 0.4333, "name": "FX/FX1_00003" },
					{ "time": 0.4667, "name": "FX/FX1_00004" },
					{ "time": 0.5, "name": "FX/FX1_00005" },
					{ "time": 0.5333, "name": "FX/FX1_00006" },
					{ "time": 0.5667, "name": "FX/FX1_00007" },
					{ "time": 0.6, "name": "FX/FX1_00008" },
					{ "time": 0.6333, "name": "FX/FX1_00009" },
					{ "time": 0.6667, "name": "FX/FX1_00000" },
					{ "time": 0.7, "name": "FX/FX1_00001" },
					{ "time": 0.7333, "name": "FX/FX1_00002" },
					{ "time": 0.7667, "name": "FX/FX1_00003" },
					{ "time": 0.8, "name": "FX/FX1_00004" },
					{ "time": 0.8333, "name": "FX/FX1_00005" },
					{ "time": 0.8667, "name": "FX/FX1_00006" },
					{ "time": 0.9, "name": "FX/FX1_00007" },
					{ "time": 0.9333, "name": "FX/FX1_00008" },
					{ "time": 0.9667, "name": "FX/FX1_00009" },
					{ "time": 1, "name": "FX/FX1_00000" },
					{ "time": 1.0333, "name": "FX/FX1_00001" },
					{ "time": 1.0667, "name": "FX/FX1_00002" },
					{ "time": 1.1, "name": "FX/FX1_00003" },
					{ "time": 1.1333, "name": "FX/FX1_00004" },
					{ "time": 1.1667, "name": "FX/FX1_00005" },
					{ "time": 1.2, "name": "FX/FX1_00006" },
					{ "time": 1.2333, "name": "FX/FX1_00007" },
					{ "time": 1.2667, "name": "FX/FX1_00008" },
					{ "time": 1.3, "name": "FX/FX1_00009" },
					{ "time": 1.3333, "name": "FX/FX1_00000" },
					{ "time": 1.3667, "name": "FX/FX1_00001" },
					{ "time": 1.4, "name": "FX/FX1_00002" },
					{ "time": 1.4333, "name": "FX/FX1_00003" },
					{ "time": 1.4667, "name": "FX/FX1_00004" },
					{ "time": 1.5, "name": "FX/FX1_00005" },
					{ "time": 1.5333, "name": "FX/FX1_00006" },
					{ "time": 1.5667, "name": "FX/FX1_00007" },
					{ "time": 1.6, "name": "FX/FX1_00008" },
					{ "time": 1.6333, "name": "FX/FX1_00009" },
					{ "time": 1.6667, "name": "FX/FX1_00000" },
					{ "time": 1.7, "name": "FX/FX1_00001" },
					{ "time": 1.7333, "name": "FX/FX1_00002" },
					{ "time": 1.7667, "name": "FX/FX1_00003" },
					{ "time": 1.8, "name": "FX/FX1_00004" },
					{ "time": 1.8333, "name": "FX/FX1_00005" },
					{ "time": 1.8667, "name": "FX/FX1_00006" },
					{ "time": 1.9, "name": "FX/FX1_00007" },
					{ "time": 1.9333, "name": "FX/FX1_00008" },
					{ "time": 1.9667, "name": "FX/FX1_00009" },
					{ "time": 2, "name": null }
				]
			}
		},
		"bones": {
			"it7 copy": {
				"rotate": [
					{
						"time": 0.3333,
						"angle": 0,
						"curve": [ 0.25, 0, 0.75, 1 ]
					},
					{
						"time": 0.4667,
						"angle": 20.44,
						"curve": [ 0.25, 0, 0.75, 1 ]
					},
					{
						"time": 0.6,
						"angle": 0,
						"curve": [ 0.25, 0, 0.75, 1 ]
					},
					{
						"time": 0.7333,
						"angle": 20.44,
						"curve": [ 0.25, 0, 0.75, 1 ]
					},
					{
						"time": 0.8333,
						"angle": 0,
						"curve": [ 0.25, 0, 0.75, 1 ]
					},
					{
						"time": 0.9667,
						"angle": 20.44,
						"curve": [ 0.25, 0, 0.75, 1 ]
					},
					{
						"time": 1.1,
						"angle": 0,
						"curve": [ 0.25, 0, 0.75, 1 ]
					},
					{
						"time": 1.2333,
						"angle": 20.44,
						"curve": [ 0.25, 0, 0.75, 1 ]
					},
					{
						"time": 1.3667,
						"angle": 0,
						"curve": [ 0.25, 0, 0.75, 1 ]
					},
					{
						"time": 1.5,
						"angle": 20.44,
						"curve": [ 0.25, 0, 0.75, 1 ]
					},
					{
						"time": 1.6,
						"angle": 0,
						"curve": [ 0.25, 0, 0.75, 1 ]
					},
					{
						"time": 1.7333,
						"angle": 20.44,
						"curve": [ 0.25, 0, 0.75, 1 ]
					},
					{
						"time": 1.8667,
						"angle": 0,
						"curve": [ 0.25, 0, 0.75, 1 ]
					},
					{ "time": 2, "angle": 20.44 }
				],
				"translate": [
					{
						"time": 0,
						"x": 65.84,
						"y": 43.07,
						"curve": [ 0.25, 0, 0.093, 1 ]
					},
					{ "time": 0.3333, "x": 0, "y": 0 },
					{ "time": 0.4667, "x": 21.22, "y": 0 },
					{ "time": 0.6, "x": 0, "y": 0, "curve": "stepped" },
					{ "time": 2, "x": 0, "y": 0 }
				],
				"scale": [
					{ "time": 2, "x": 1, "y": 1 }
				]
			},
			"aaa3": {
				"rotate": [
					{
						"time": 0.3333,
						"angle": 0,
						"curve": [ 0.25, 0, 0.75, 1 ]
					},
					{
						"time": 0.4667,
						"angle": -16.85,
						"curve": [ 0.25, 0, 0.75, 1 ]
					},
					{
						"time": 0.6,
						"angle": 0,
						"curve": [ 0.25, 0, 0.75, 1 ]
					},
					{
						"time": 0.7333,
						"angle": -16.85,
						"curve": [ 0.25, 0, 0.75, 1 ]
					},
					{
						"time": 0.8667,
						"angle": 0,
						"curve": [ 0.25, 0, 0.75, 1 ]
					},
					{
						"time": 1,
						"angle": -16.85,
						"curve": [ 0.25, 0, 0.75, 1 ]
					},
					{
						"time": 1.1,
						"angle": 0,
						"curve": [ 0.25, 0, 0.75, 1 ]
					},
					{
						"time": 1.2333,
						"angle": -16.85,
						"curve": [ 0.25, 0, 0.75, 1 ]
					},
					{
						"time": 1.3667,
						"angle": 0,
						"curve": [ 0.25, 0, 0.75, 1 ]
					},
					{
						"time": 1.5,
						"angle": -16.85,
						"curve": [ 0.25, 0, 0.75, 1 ]
					},
					{
						"time": 1.6,
						"angle": 0,
						"curve": [ 0.25, 0, 0.75, 1 ]
					},
					{
						"time": 1.7333,
						"angle": -16.85,
						"curve": [ 0.25, 0, 0.75, 1 ]
					},
					{
						"time": 1.8667,
						"angle": 0,
						"curve": [ 0.25, 0, 0.75, 1 ]
					},
					{ "time": 2, "angle": -16.85 }
				],
				"translate": [
					{
						"time": 0,
						"x": -69.3,
						"y": 47.52,
						"curve": [ 0.25, 0, 0.093, 1 ]
					},
					{ "time": 0.3333, "x": 0, "y": 0 },
					{ "time": 0.4667, "x": -18.12, "y": 0 },
					{ "time": 0.6, "x": 0, "y": 0 },
					{ "time": 0.7333, "x": -18.12, "y": 0 },
					{ "time": 0.8667, "x": 0, "y": 0 },
					{ "time": 1, "x": -18.12, "y": 0 },
					{ "time": 1.1, "x": 0, "y": 0 },
					{ "time": 1.2333, "x": -18.12, "y": 0 },
					{ "time": 1.3667, "x": 0, "y": 0 },
					{ "time": 1.5, "x": -18.12, "y": 0 },
					{ "time": 1.6, "x": 0, "y": 0 },
					{ "time": 1.7333, "x": -18.12, "y": 0 },
					{ "time": 1.8667, "x": 0, "y": 0, "curve": "stepped" },
					{ "time": 2, "x": 0, "y": 0 }
				],
				"scale": [
					{ "time": 2, "x": 1, "y": 1 }
				]
			},
			"fx": {
				"rotate": [
					{ "time": 2, "angle": 0 }
				],
				"translate": [
					{ "time": 2, "x": 0, "y": 0 }
				],
				"scale": [
					{ "time": 2, "x": 1, "y": 1 }
				]
			},
			"aaa": {
				"rotate": [
					{ "time": 2, "angle": 0 }
				],
				"translate": [
					{ "time": 2, "x": 0, "y": 0 }
				],
				"scale": [
					{ "time": 2, "x": 1, "y": 1 }
				]
			},
			"root": {
				"rotate": [
					{ "time": 0, "angle": 0, "curve": "stepped" },
					{ "time": 1, "angle": 0, "curve": "stepped" },
					{ "time": 2, "angle": 0 }
				],
				"translate": [
					{ "time": 0, "x": 0, "y": 0, "curve": "stepped" },
					{ "time": 1, "x": 0, "y": 0, "curve": "stepped" },
					{ "time": 2, "x": 0, "y": 0 }
				]
			}
		}
	}
}
}