{
	'maxWin':100000,
    'maxLost':100000,
    'botList' : [
        {
            'game':'Binh',
            'bot' : [
                "messi_09",
                "congvinh91",
                "0hongocha0",
                "luongsu_c",
                "tinhkhucvang6",
                "mongtinh",
                "nhatkimanh1",
                "khanhphuong88",
                "anhquanidol",
                "motngaymoi",
                "tuanlinhat",
                "atula37",
                "langthinh25",
                "tuyenanhxz",
                "ongcaulaibb",
                "trienlaicb",
                "copxam_yb",
                "toctien_chibi",
                "jack_pot90",
                "leesin67",
				"hongnguyen",
				"naloan55",
				"namdaocong68",
				"vamgiang88",
				"namhip0984",
				"Namngoc1978",
				"Namdo1968",
				"unlocker",
				"ngakute2000",
				"Nanhapy2k",
				"hungngan35",
				"leNgan123",
				"vuvoNgap",
				"manNghe88",
				"hoanghia1001",
				"mapnghia99",
				"tranvannghia44",
				"tranhuubao87",
				"vam2012",
				"ngocvandieu1995"
            ]
        },
        {
            'game':'BaCay',
            'bot' : [
				"Haitrung8896",
				"Hanh77hd4",
				"HanhHa1999",
				"hanhphuc0983",
				"hankupi2134",
				"Haolq4567",
				"Hathang99",
				"hathuthu66",
				"hathu5675",
				"hatrang141",
				"Heilong12349",
				"Helboy11239",
				"heniken1123",
				"henrydinh2124",
				"heoconxauxi11",
				"Herozzz131",
				"Hh8888555",
				"hoanglin1521",
				"Hienhip00102",
				"hiennana125",
				"hoangbi1234",
				"Hoangbinh8288",
				"hoangchivd55",
				"hoanghoan8877",
				"hoangg707"
            ]
        },
        {
            'game':'BaiCao',
            'bot' : [
                "khacbietss",
                "sangtao21",
                "quaikietc50",
                "u50thathu",
                "sontung00",
                "thiennat2",
                "noophuocan2",
                "thanhhit",
                "alitrans",
                "vinashin",
                "sunctites",
                "huongduong9",
                "vinhthu22",
                "huenguyen2",
                "hoaithu98",
                "ok_menly",
                "girl_novolx",
                "gaixinh0tinh",
                "matta_linh",
                "ronaldo_cr",
				"kienmcc",
				"kieulien01",
				"kieulanh",
				"Kiphutan31",
				"kimhoang6969",
				"Kingkingass",
				"Kothecobai",
				"doccobatbai",
				"kute1102",
				"lampro11",
				"lamsun98",
				"laotru017",
				"kieuphong678",
				"lapnghiep881",
				"Lavergas8888",
				"Lebakhoi99",
				"ledoi121",
				"leduddam2",
				"leemina",
				"pohadi",
				
                "tinmoidem",
                "Petertrambach",
                "otandato",
                "haiquandt",
                "badboy",
                "quayno1",
                "moiettoi",
                "truong2006",
                "hai1234",
                "mrduc123",
                "Duchieu",
                "crownhoanle",
                "Hapdan",
                "Samsung321",
                "tantocdo",
                "linhnguyen",
                "hellfire",
                "ngochau1987",
                "Chivas220796",
                "lenhoduc10",
                "xuansa90",
                "khuckhai_ns",
                "diepgay",
                "Vuthanhtam",
                "minhtu91",
                "hht12345",
                "kakaka",
                "ThinhVina",
                "chimtau",
                "vkhien96",
                "lycauhang",
                "linhle",
                "nguyenkhanhly",
                "aha0977s",
                "poiuytre",
                "thaikhanh",
                "Truong150910",
                "Zzzvycnlzzz",
                "Thehoangbn",
                "Anhquan1102",
				
                "loanara",
                "chinhhung21",
                "hoanff33",
                "viphuan1",
                "cailoan96",
                "alungfaw",
                "tinhtuang",
                "alofa22",
                "nghiahung",
                "trungnguyen",
                "nguyenbao",
                "vitieubao",
                "lovanson",
                "dauthivan",
                "tuanngoac99",
                "tuantai12",
                "huycho34",
                "hungmo22",
                "ngocbinh123",
                "duongduong2",
                "hoangphiho98",
                "asits213",
                "cathara",
                "hadtier",
                "huarthe",
                "phuluon27",
                "gakawte",
                "ghaqr6",
                "vbntaai",
                "tuanchi3a",
                "aduxanh2",
                "phisdas3",
                "datsatnhan",
                "vivansang",
                "tongthuy99",
                "kinhkin77",
                "likinpark00",
                "bunglua55",
                "nhatthec",
                "soocloo"
            ]
        },
        {
            'game':'Sam',
            'bot' : [
                "tinmoidem",
                "Petertrambach",
                "otandato",
                "haiquandt",
                "badboy",
                "quayno1",
                "moiettoi",
                "truong2006",
                "hai1234",
                "mrduc123",
                "Duchieu",
                "crownhoanle",
                "Hapdan",
                "Samsung321",
                "tantocdo",
                "linhnguyen",
                "hellfire",
                "ngochau1987",
                "Chivas220796",
                "lenhoduc10",
                "xuansa90",
                "khuckhai_ns",
                "diepgay",
                "Vuthanhtam",
                "minhtu91",
                "hht12345",
                "kakaka",
                "ThinhVina",
                "chimtau",
                "vkhien96",
                "lycauhang",
                "linhle",
                "nguyenkhanhly",
                "aha0977s",
                "poiuytre",
                "thaikhanh",
                "Truong150910",
                "Zzzvycnlzzz",
                "Thehoangbn",
                "Anhquan1102"
            ]
        },
        {
            'game':'Tlmn',
            'bot' : [
                "loanara",
                "chinhhung21",
                "hoanff33",
                "viphuan1",
                "cailoan96",
                "alungfaw",
                "tinhtuang",
                "alofa22",
                "nghiahung",
                "trungnguyen",
                "nguyenbao",
                "vitieubao",
                "lovanson",
                "dauthivan",
                "tuanngoac99",
                "tuantai12",
                "huycho34",
                "hungmo22",
                "ngocbinh123",
                "duongduong2",
                "hoangphiho98",
                "asits213",
                "cathara",
                "hadtier",
                "huarthe",
                "phuluon27",
                "gakawte",
                "ghaqr6",
                "vbntaai",
                "tuanchi3a",
                "aduxanh2",
                "phisdas3",
                "datsatnhan",
                "vivansang",
                "tongthuy99",
                "kinhkin77",
                "likinpark00",
                "bunglua55",
                "nhatthec",
                "soocloo"
            ]
        }
    ]
}