{
    "General": {
        "maxFriendInvitationPerDay": 100,
        "timeResetSupportDaily": "8:00;12:00;19:00",
        "goldSupportNewAccount": 5000,
        "goldLikeFanpage": 0,
        "goldRateApp": 0,
        "spinMachinePeriodInSec": 7200,
        "spinMachineCheckpoints": 5
    },
    "FirstPaying": {
        "SMSBonusRate": {
            "value": 0
        },
        "TelcoBonusGold": {
            "value": 0
        },
        "IAPBonusRate": {
            "value": 0
        }
    },
    "ContinuousLogin": {
        "1": {
            "gold": 0
        },
        "2": {
            "gold": 0
        },
        "3": {
            "gold": 0
        },
        "4": {
            "gold": 0
        },
        "5": {
            "gold": 0
        },
        "6": {
            "gold": 0
        },
        "7": {
            "gold": 0
        }
    },
    "InviteFriend": {
        "1": {
            "nInvited": 10,
            "gold": 0
        },
        "2": {
            "nInvited": 30,
            "gold": 0
        },
        "3": {
            "nInvited": 50,
            "gold": 0
        },
        "4": {
            "nInvited": 100,
            "gold": 0
        }
    },
    "InGameBonus": {
        "1": {
            "time": 120,
            "gold": 0
        },
        "2": {
            "time": 180,
            "gold": 0
        },
        "3": {
            "time": 300,
            "gold": 0
        },
        "4": {
            "time": 480,
            "gold": 0
        },
        "5": {
            "time": 720,
            "gold": 0
        }
    }
}