{

    "PaySMSPack": {
        "PSMS_1": {
            "cost": 10000,
            "gold": 4500,
            "vPoint": 5,
            "isAvailable": 1
        },
        "PSMS_2": {
            "cost": 20000,
            "gold": 9000,
            "vPoint": 10,
            "isAvailable": 1
        },
        "PSMS_3": {
            "cost": 50000,
            "gold": 22500,
            "vPoint": 25,
            "isAvailable": 1
        }
    }
}