{
    "Channel": {
        "2001": {
            "name": "TOUR_TAPSU",
            "levelRequire": 1,
            "round": [
                "TOUR_1"
            ],
            "bracelet": {
                "id": "BRACELET_1",
                "nWinToAcquireInitialization": 5,
                "nWinToAcquireProgression": 1,
                "bonusPrizeRate": 2
            },
            "available": 1,
            "priority": 1
        },
        "2002": {
            "name": "TOUR_TADIEN",
            "levelRequire": 1,
            "round": [
                "TOUR_2"
            ],
            "bracelet": {
                "id": "BRACELET_2",
                "nWinToAcquireInitialization": 5,
                "nWinToAcquireProgression": 1,
                "bonusPrizeRate": 2
            },
            "available": 1,
            "priority": 2
        },
        "2003": {
            "name": "TOUR_TRIEUPHU",
            "levelRequire": 1,
            "round": [
                "TOUR_3"
            ],
            "bracelet": {
                "id": "BRACELET_3",
                "nWinToAcquireInitialization": 5,
                "nWinToAcquireProgression": 1,
                "bonusPrizeRate": 2
            },
            "available": 1,
            "priority": 3
        },
        "2004": {
            "name": "TOUR_TIPHU",
            "levelRequire": 1,
            "round": [
                "TOUR_4"
            ],
            "bracelet": {
                "id": "BRACELET_4",
                "nWinToAcquireInitialization": 5,
                "nWinToAcquireProgression": 1,
                "bonusPrizeRate": 2
            },
            "available": 1,
            "priority": 4
        }
    },
    "TournamentStructure": {
        "TOUR_1": {
            "maxPlayer": 5,
            "maxSpectator": 0,
            "buyTicket": {
                "item": "GOLD",
                "q": 20000
            },
            "buyin": 20000,
            "tipDealer": 100,
            "blindLevel": {
                "init": 100,
                "multiplyRate": 2,
                "minTimeMultiply": 180
            },
            "winningPrize": {
                "1": 40000,
                "2": 0
            }
        },
        "TOUR_2": {
            "maxPlayer": 5,
            "maxSpectator": 0,
            "buyTicket": {
                "item": "GOLD",
                "q": 50000
            },
            "buyin": 50000,
            "tipDealer": 200,
            "blindLevel": {
                "init": 500,
                "multiplyRate": 2,
                "minTimeMultiply": 240
            },
            "winningPrize": {
                "1": 200000,
                "2": 0
            }
        },
        "TOUR_3": {
            "maxPlayer": 5,
            "maxSpectator": 0,
            "buyTicket": {
                "item": "GOLD",
                "q": 100000
            },
            "buyin": 100000,
            "tipDealer": 500,
            "blindLevel": {
                "init": 1000,
                "multiplyRate": 2,
                "minTimeMultiply": 240
            },
            "winningPrize": {
                "1": 400000,
                "2": 0
            }
        },
        "TOUR_4": {
            "maxPlayer": 5,
            "maxSpectator": 0,
            "buyTicket": {
                "item": "GOLD",
                "q": 200000
            },
            "buyin": 200000,
            "tipDealer": 1000,
            "blindLevel": {
                "init": 2000,
                "multiplyRate": 2,
                "minTimeMultiply": 240
            },
            "winningPrize": {
                "1": 800000,
                "2": 0
            }
        },
        "TOUR_5": {
            "maxPlayer": 5,
            "maxSpectator": 0,
            "buyTicket": {
                "item": "GOLD",
                "q": 500000
            },
            "buyin": 500000,
            "tipDealer": 2000,
            "blindLevel": {
                "init": 5000,
                "multiplyRate": 2,
                "minTimeMultiply": 240
            },
            "winningPrize": {
                "1": 2000000,
                "2": 0
            }
        }
    },
    "PlayerPosition": {
        "5": [
            1,
            3,
            5,
            7,
            9
        ],
        "6": [
            1,
            2,
            3,
            5,
            7,
            9
        ],
        "7": [
            1,
            2,
            3,
            4,
            5,
            7,
            9
        ],
        "8": [
            1,
            2,
            3,
            4,
            5,
            6,
            7,
            9
        ],
        "9": [
            1,
            2,
            3,
            4,
            5,
            6,
            7,
            8,
            9
        ]
    }
}