{   
    'vip':{
        'day':1,
        'start':{'h':20,'m':30},
        'endRegister':{'h':21,'m':0},
        'ticket':100000,
        'minPrizePool':10000000,
        'maxPrizePool':10000000000
    },
    'tours':[
        {
            'start':{'h':7,'m':00},
            'endRegister':{'h':8,'m':00},
            'ticket':10000
        },
        {
            'start':{'h':11,'m':00},
            'endRegister':{'h':12,'m':00},
            'ticket':10000
        },
        {
            'start':{'h':15,'m':00},
            'endRegister':{'h':16,'m':00},
            'ticket':10000
        },
        {
            'start':{'h':19,'m':00},
            'endRegister':{'h':20,'m':00},
            'ticket':10000
        },
        {
            'start':{'h':13,'m':00},
            'endRegister':{'h':14,'m':00},
            'ticket':10000
        },        
        {
            'start':{'h':8,'m':00},
            'endRegister':{'h':9,'m':00},
            'ticket':50000
        },
        {
            'start':{'h':14,'m':00},
            'endRegister':{'h':15,'m':00},
            'ticket':50000
        },
        {
            'start':{'h':20,'m':00},
            'endRegister':{'h':21,'m':00},
            'ticket':50000
        },
        {
            'start':{'h':9,'m':00},
            'endRegister':{'h':10,'m':00},
            'ticket':100000
        },
		{
            'start':{'h':16,'m':00},
            'endRegister':{'h':17,'m':00},
            'ticket':100000
        },
        {
            'start':{'h':21,'m':00},
            'endRegister':{'h':22,'m':00},
            'ticket':100000
        },
        {
            'start':{'h':10,'m':00},
            'endRegister':{'h':11,'m':00},
            'ticket':200000
        },
        {
            'start':{'h':18,'m':00},
            'endRegister':{'h':19,'m':00},
            'ticket':200000
        },
        {
            'start':{'h':22,'m':00},
            'endRegister':{'h':23,'m':00},
            'ticket':200000
        }
    ],
    'modes':[
        {
          'id':0,
          'name':'pokertour',
          'levels':[0, 25, 50, 100, 200, 400, 800, 1600, 3200, 6400, 12800,25600,51200,102400,204800,409600,819200,1638400,3276800,6553600,13107200,26214400,52428800,104857600,209715200,419430400,838860800,1677721600,3355443200,6710886400],
          'timeLevelUp':600,
          'chip':10000,
          'comission':0,
          'pool':100,
          'attach':0,
          'outEatenRate':0,
          'outPoolRate':0,
          'timeBreak':0,
          'addon':0,
          'rebuy':4,
          'maxLevelRebuy':7,
          'maxPlayerPerRoom':6
        }      
    ],
    'prizeRates':[ 
        {
            'players':[2,9],
            'prizeCount':1,
            'rate':[0,95]
        },
        {
            'players':[10,15],
            'prizeCount':2,
            'rate':[0,71,24]
        },
        {
            'players':[16,30],
            'prizeCount':3,
            'rate':[0,43,29,23]
        },
        {
            'players':[31,40],
            'prizeCount':4,
            'rate':[0,35,27,18,15]
        },
        {
            'players':[41,50],
            'prizeCount':5,
            'rate':[0,31,24,16,13,11]
        },
        {
            'players':[51,60],
            'prizeCount':6,
            'rate':[0,29,22,15,12,10,7]
        },
        {
            'players':[61,70],
            'prizeCount':7,
            'rate':[0,26,20,14,11,10,8,6]
        },
        {
            'players':[71,80],
            'prizeCount':8,
            'rate':[0,24,19,13,11,10,8,6,4]
        },
        {
            'players':[81,90],
            'prizeCount':9,
            'rate':[0,23,18,13,10,9,8,6,5,3]
        },
        {
            'players':[91,120],
            'prizeCount':12,
            'rate':[0,20.48,15.86,12.46,9.61,8.19,6.62,5.36,4.36,3.73,3.3,3,2.03]
        },
        {
            'players':[121,150],
            'prizeCount':14,
            'rate':[0,20.48,15.86,12.46,9.11,8.19,6.12,5.36,4.36,3.53,2.5,2,1.92,1.57,1.54]
        },
        {
            'players':[151,180],
            'prizeCount':16,
            'rate':[0,19.48,14.86,12.46,9.11,8.19,6.12,5.36,4.36,3.53,2.5,1.93,1.8,1.6,1.5,1.2,1]
        },
        {
            'players':[181,210],
            'prizeCount':19,
            'rate':[0,19.48,14.06,12.46,9.11,8.19,6.12,5.36,4,3.53,1.92,1.55,1.52,1.4,1.3,1.2,1.1,1,0.9,0.8]
        },
        {
            'players':[211,240],
            'prizeCount':22,
            'rate':[0,18.48,14.06,12.46,9.11,8.19,6.12,5.36,4.36,3.53,1.92,1.4,1.1,1,0.94,0.93,0.92,0.91,0.91,0.9,0.8,0.8,0.8]
        },
        {
            'players':[241,270],
            'prizeCount':24,
             'rate':[0,17.08,15.06,12.16,9.11,8.19,6.12,5.36,4.32,3.43,1.5,1.37,1.2,1.1,1,0.9,0.9,0.9,0.8,0.8,0.8,0.8,0.7,0.7,0.7]
        },
        {
            'players':[271,300],
            'prizeCount':26,
            'rate':[0,17.08,15.06,12.16,9.01,8.09,6.02,5.06,4.06,3.53,1.66,1.57,1.2,1.1,1,0.9,0.8,0.8,0.7,0.7,0.7,0.7,0.7,0.6,0.6,0.6,0.6]
        },
        {
            'players':[301,1000],
            'prizeCount':30,
            'rate':[0,17.08,14.56,12.16,9.01,8.09,6.02,5.36,4.06,2.03,1.42,1.22,1.2,1.2,1.09,0.9,0.8,0.8,0.8,0.7,0.7,0.7,0.7,0.6,0.6,0.6,0.6,0.5,0.5,0.5,0.5]
        },
        {
            'players':[1001,50000],
            'prizeCount':40,
            'rate':[0,17.08,14.56,11.16,9.01,8.09,6.02,5.36,4.36,3.53,1.41,1.3,1.27,1.1,1,0.9,0.8,0.7,0.6,0.6,0.6,0.5,0.5,0.4,0.4,0.4,0.4,0.3,0.3,0.3,0.3,0.2,0.2,0.2,0.2,0.2,0.15,0.15,0.15,0.15,0.15]
        }
    ]
}