{
    'botList' : [
        {
            'game':'PokerTour',
            'bot' : [
				"nhietzcacaimom",
				"vietproman0118",
				"sucvat20035",
				"dmt19500",
				"SkyBear93",
				"namhoangvhon",
				"duylinh05v",
				"ten_hay_00b",
				"pewnovy168",
				"ret_gntt",
				"aEpRov0",
				"mvgbeog",
				"RFCHICHIV",
				"iloveuCxxxx",
				"loksocag",
				"mikasaisvmine",
				"NKCPhuongf98",
				"alovef4",
				"andreemonvey",
				"koozvf12",
				"ACE_Dranfk",
				"anhdetv123",
				"anhdonggalll",
				"chukemcdn",
				"anhtuv125878",
				"besvt_tx_vn",
				"NHQHanYivgAn",
				"taicutevg1104",
				"Anhthangvg",
				"casinvhoangvu",
				"Vu_Vivop_9090",
				"manhvbb1102",
				"Nghiem_Havg",
				"hencxry_sky",
				"landervoman",
				"rengarvepro",
				"MayNhinvovo",
				"honganv93",
				"gaovv323",
				"badboy_ntvv",
				"KhailovevvT",
				"BiBaristova",
				"Duongsbiu",
				"hungscho13",
				"beosu1994",
				"BUYganskteam",
				"bibisv102",
				"bimsv2301",
				"BiSescxxx",
				"bim_bimvvo",
				"KillervSmart",
				"Kem_chovf",
				"iblacvok",
				"lamgidayvee",
				"suttdowve",
				"bomchovove",
				"boobvone",
				"haitao1909v",
				"lozi1254nv",
				"codonmotvvoao123",
				"dxvot2001",
				"deutayanve",
				"buivanlov",
				"fweeCFavevo",
				"KennAvbuse",
				"EdenvHal",
				"CanhvNT",
				"Songvthatde",
				"LCNt123",
				"baotbao991",
				"Carricvk175",
				"Minatozakiv98",
				"Nguyen_Vu_vek",
				"BAYbyv223",
				"moonvbuyh",
				"chichvfree123",
				"K3sivtinh",
				"chimtovdau",
				"ThanxBac9911",
				"ChoaizDz",
				"chozchanh120",
				"Minzhanhcbx",
				"chuongzusd",
				"guncs796789",
				"chuz2xstt",
				"Saxcliii",
				"clupzonepie",
				"Nguyen_zTan",
				"cocmyzFC",
				"phongzabcdf",
				"Vitieubaoz17",
				"nanxzteku",
				"nozlove223",
				"tieuzmiu123",
				"congzthanhgamer",
				"congzviphc",
				"congzxinhgaii",
				"thangztran1r",
				"conzmeocon20",
				"coquayz1202",
				"CrepzJO"
            ]
        },
        {
            'game':'BaCay',
            'bot' : [
                "tiencuvo1",
                "Anhtu90vp",
                "Baynga",
                "tammaopro",
                "thanhlua22",
                "asusk9",
                "tomhand99",
                "Thoat_tart",
                "conghoisad",
                "khackhien2",
                "thanhmutl",
                "giupsart",
                "junsan",
                "daumohe",
                "hanxeng99",
                "oivail",
                "thuctinh34",
                "khanhchi34",
                "sinhhocl9",
                "mangsoca"
            ]
        },
        {
            'game':'BaiCao',
            'bot' : [
                "khacbietss",
                "sangtao21",
                "quaikietc50",
                "u50thathu",
                "sontung00",
                "thiennat2",
                "noophuocan2",
                "thanhhit",
                "alitrans",
                "vinashin",
                "sunctites",
                "huongduong9",
                "vinhthu22",
                "huenguyen2",
                "hoaithu98",
                "ok_menly",
                "girl_novolx",
                "gaixinh0tinh",
                "matta_linh",
                "ronaldo_cr"
            ]
        },
        {
            'game':'Poker',
            'bot' : [
                "tinmoidem",
                "Petertrambach",
                "otandato",
                "haiquandt",
                "badboy",
                "quayno1",
                "moiettoi",
                "truong2006",
                "hai1234",
                "mrduc123",
                "Duchieu",
                "crownhoanle",
                "Hapdan",
                "Samsung321",
                "tantocdo",
                "linhnguyen",
                "hellfire",
                "ngochau1987",
                "Chivas220796",
                "lenhoduc10",
                "xuansa90",
                "khuckhai_ns",
                "diepgay",
                "Vuthanhtam",
                "minhtu91",
                "hht12345",
                "kakaka",
                "ThinhVina",
                "chimtau",
                "vkhien96",
                "lycauhang",
                "linhle",
                "nguyenkhanhly",
                "aha0977s",
                "poiuytre",
                "thaikhanh",
                "Truong150910",
                "Zzzvycnlzzz",
                "Thehoangbn",
                "Anhquan1102"
            ]
        },
        {
            'game':'Tlmn',
            'bot' : [
                "loanara",
                "chinhhung21",
                "hoanff33",
                "viphuan1",
                "cailoan96",
                "alungfaw",
                "tinhtuang",
                "alofa22",
                "nghiahung",
                "trungnguyen",
                "nguyenbao",
                "vitieubao",
                "lovanson",
                "dauthivan",
                "tuanngoac99",
                "tuantai12",
                "huycho34",
                "hungmo22",
                "ngocbinh123",
                "duongduong2",
                "hoangphiho98",
                "asits213",
                "cathara",
                "hadtier",
                "huarthe",
                "phuluon27",
                "gakawte",
                "ghaqr6",
                "vbntaai",
                "tuanchi3a",
                "aduxanh2",
                "phisdas3",
                "datsatnhan",
                "vivansang",
                "tongthuy99",
                "kinhkin77",
                "likinpark00",
                "bunglua55",
                "nhatthec",
                "soocloo"
            ]
        }
    ]
}
