{
  'join_room_interval_time':1,
  'big_win':100000,
  'roomList':[ 
    {
        'moneyType':1,
        'moneyBet':500000,
        'requiredMoney':20,
        'outMoney':5,
        'maxUserPerRoom':8,
        'commisionRate':2,
        'rule':0,
		'numberOfInitialRoom':5, 
		'roomName': 'San Bang Tat Ca'
    },
    {
        'moneyType':1,
        'moneyBet':100000,
        'requiredMoney':20,
        'outMoney':5,
        'maxUserPerRoom':8,
        'commisionRate':2,
        'rule':0,
		'numberOfInitialRoom':5, 
		'roomName': 'San Bang Tat Ca'
    },
    {
        'moneyType':1,
        'moneyBet':50000,
        'requiredMoney':20,
        'outMoney':5,
        'maxUserPerRoom':8,
        'commisionRate':2,
        'rule':0,
		'numberOfInitialRoom':5, 
		'roomName': 'San Bang Tat Ca'
    },
    {
        'moneyType':1,
        'moneyBet':10000,
        'requiredMoney':20,
        'outMoney':5,
        'maxUserPerRoom':8,
        'commisionRate':2,
        'rule':0,
		'numberOfInitialRoom':5, 
		'roomName': 'San Bang Tat Ca'
    },
    {
        'moneyType':1,
        'moneyBet':5000,
        'requiredMoney':20,
        'outMoney':5,
        'maxUserPerRoom':8,
        'commisionRate':2,
        'rule':0,
		'numberOfInitialRoom':5, 
		'roomName': 'San Bang Tat Ca'
    },
    {
        'moneyType':1,
        'moneyBet':1000,
        'requiredMoney':20,
        'outMoney':5,
        'maxUserPerRoom':8,
        'commisionRate':2,
        'rule':0,
		'numberOfInitialRoom':5, 
		'roomName': 'San Bang Tat Ca'
    },
    {
        'moneyType':1,
        'moneyBet':10,
        'requiredMoney':20,
        'outMoney':5,
        'maxUserPerRoom':8,
        'commisionRate':2,
        'rule':0,
		'numberOfInitialRoom':5, 
		'roomName': 'San Bang Tat Ca'
    }
  ]
}
