{
	"socketAddresses": [],
	"ipFilter": {
		"addressBlackList": [
			"1.2.3.4"
		],
		"addressWhiteList": [
			"127.0.0.1"
		],
		"maxConnectionsPerAddress": 20
	},
	"systemControllerThreadPoolSize": 3,
	"extensionControllerThreadPoolSize": 5,
	"systemControllerRequestQueueSize": 2000,
	"extensionControllerRequestQueueSize": 2000,
	"schedulerThreadPoolSize": 5,
	"protocolCompressionThreshold": 1024,
	"protocolMode": "BINARY",
	"useBinaryProtocol": true,
	"remoteAdmin": {
		"administrators": [
			{
				"login": "admin",
				"password": "admin"
			}
		],
		"allowedRemoteAddresses": [],
		"adminTcpPort": 8443,
		"useEncryption": false
	},
	"systemThreadPoolSettings": {
		"name": "Sys",
		"coreThreads": 2,
		"backupThreads": 2,
		"maxBackups": 64,
		"queueSizeTriggeringBackup": 100,
		"secondsTriggeringBackup": 50,
		"backupThreadsExpiry": 3600,
		"queueSizeTriggeringBackupExpiry": 60,
		"logActivity": true,
		"queueFullWarningInterval": 300
	},
	"extensionThreadPoolSettings": {
		"name": "Ext",
		"coreThreads": 2,
		"backupThreads": 2,
		"maxBackups": 64,
		"queueSizeTriggeringBackup": 100,
		"secondsTriggeringBackup": 50,
		"backupThreadsExpiry": 3600,
		"queueSizeTriggeringBackupExpiry": 60,
		"logActivity": true,
		"queueFullWarningInterval": 300
	},
	"webSocket": {
		"ssl": false,
		"isActive": true,
		"bindAddress": "0.0.0.0",
		"tcpPort": 8444,
		"validDomains": []
	},
	"httpServer": {
		"ssl": false,
		"isActive": true,
		"httpPort": 8000
	},
	"sessionMaxIdleTime": 300,
	"userMaxIdleTime": 600,
	"ghostHunterEnabled": true
}