text,category
I'm supposed to have a refund but it isn't there,Refund_not_showing_up
My refund is not here yet,Refund_not_showing_up
I've been waiting for a refund to show up and I don't see it on my statement yet.,Refund_not_showing_up
A refund for a recent return has not arrived on my card.,Refund_not_showing_up
Where is my refund? it appears to be missing.,Refund_not_showing_up
What do I need to do for the card activation?,activate_my_card
I have a new card and need to activate it,activate_my_card
How do I turn on my new card?,activate_my_card
It won't let me activate my card.,activate_my_card
My card is not able to be activated how do I get it to work?,activate_my_card
What are age requirements for opening an account?,age_limit
How old can one use your service?,age_limit
"My son has just turned 13, is he old enough for an account?",age_limit
My daughter needs an acount.,age_limit
As my kids get older are they able to get set up with their own accounts?,age_limit
Why isn't my google pay top up working?,apple_pay_or_google_pay
How can I top up with Google play?,apple_pay_or_google_pay
Is there a way to top up using my Apple Watch?,apple_pay_or_google_pay
Google Pay Top up isn't working,apple_pay_or_google_pay
Can I pay for my gas using my Apple watch?,apple_pay_or_google_pay
"
Where can I withdraw money from?",atm_support
Which ATMs accept this bill of fare ?,atm_support
Tell me what ATMs take this card.,atm_support
Tell me what ATMs use this card.,atm_support
Can I use my card to withdraw from my account?,atm_support
auto-top up option can be found where?,automatic_top_up
Can I automatically top-up when traveling?,automatic_top_up
Is there a auto top-up option?,automatic_top_up
Is there a limit to auto top?,automatic_top_up
How low does the balance have to be before the system updates?,automatic_top_up
I completed a transfer that isn't showing up on my account.,balance_not_updated_after_bank_transfer
It is common for an international transfer to take 2 days or longer? I made a transfer from France 2 days ago and I have not seen it yet.,balance_not_updated_after_bank_transfer
"I made a bank transfer from my UK account today, but it's not showing.  Can you check status?",balance_not_updated_after_bank_transfer
what amount of time does it take for a transfer to reflect and be available,balance_not_updated_after_bank_transfer
I've transferred money into my account but the balance is the same,balance_not_updated_after_bank_transfer
My balance doesn't show my deposit.,balance_not_updated_after_cheque_or_cash_deposit
Where is my missing cheque I deposited?,balance_not_updated_after_cheque_or_cash_deposit
I have yet to receive the cash I added to my account this morning.,balance_not_updated_after_cheque_or_cash_deposit
Why hasn't my account updated?,balance_not_updated_after_cheque_or_cash_deposit
I need my account checked because it appears there is a problem. I attempted to update my balance yesterday using cheque but it doesn't seem to have worked.  Should this not be faster than this?,balance_not_updated_after_cheque_or_cash_deposit
My transfer to a beneficiary was rejected.,beneficiary_not_allowed
My beneficiary didn't receive my transfer,beneficiary_not_allowed
I'm trying to purchase crypto via the app. I haven't been able to get it to go through. Am I doing something wrong?,beneficiary_not_allowed
Why is my beneficiary not being allowed to get payment services?,beneficiary_not_allowed
Why was I denied the option to transfer money to a selected beneficiary?,beneficiary_not_allowed
Cancelling a transaction,cancel_transfer
My morning transaction needs to be canceled.,cancel_transfer
I made a mistake this morning when I did a transfer. How do I reverse it?,cancel_transfer
A payment I made is for a wrong amount can you help me correct the mistake.,cancel_transfer
I want to revert this mornings transaction.,cancel_transfer
"I need a new card, my old card is expiring.",card_about_to_expire
How do I get a new expiration date?,card_about_to_expire
Is it possible to get a new card in China?,card_about_to_expire
My card is about to expire.  Where do I get a new one.,card_about_to_expire
What do I do after my card expires?,card_about_to_expire
Where do I pay with my debit or credit card?,card_acceptance
Which establishments will accept my card?,card_acceptance
Where can I use my card to pay?,card_acceptance
Where can my card be used?,card_acceptance
Where is this card accepted?,card_acceptance
What is the expected delivery date of my card?,card_arrival
How can I track my card's delivery?,card_arrival
Is there a reason my new card hasn't arrived?,card_arrival
Why have I not gotten my new card?,card_arrival
I know I'm getting a new card but would like know when I can expect to receive it.,card_arrival
How long does it take for a card to arrive?,card_delivery_estimate
How long will it take to get to the US?,card_delivery_estimate
When can I expect my new card to get here?,card_delivery_estimate
What is the length of time for one of these items to come to the U.S?,card_delivery_estimate
can the delivery be specific to my needs?,card_delivery_estimate
how do i get the card linked,card_linking
How do I link the new card?,card_linking
How do I reactivate a card I thought I lost?,card_linking
"I found my card that I thought I had lost, I need to reactive it, please help.",card_linking
Where do I go to get my new card linked?,card_linking
WHAT IS THE MAIN REASON OF THIS PROBLEM,card_not_working
I am unable to use my card.,card_not_working
The card that I have isn't working. This is the physical card.,card_not_working
I can't use my card because it is not working.,card_not_working
"I don't know what's wrong with my card, but it has not worked at multiple places today.",card_not_working
Please explain the extra fee when I paid with the card.,card_payment_fee_charged
I was charged an extra fee for a card payment. I was unaware of these fees beforehand.,card_payment_fee_charged
Why was the price higher when I paid with my card?,card_payment_fee_charged
I have a fee and I don't know why,card_payment_fee_charged
I paid with card and was charged a fee that shouldn't be there!,card_payment_fee_charged
I'm worried that my card has been compromised because I see a payment that I didn't make.,card_payment_not_recognised
Someone else accessed my account and made a payment.,card_payment_not_recognised
"I just saw some charges on my card from the past days that I dont recognize, I need to freeze the card asap! Will I be able to get my money back?",card_payment_not_recognised
I have a card payment that I don't recognize. What should I do?,card_payment_not_recognised
I think that there is a payment on my card that I did not authorize.  I don't recognize the name attached to the transaction.,card_payment_not_recognised
It looks like the exchange rates on my card payment are wrong,card_payment_wrong_exchange_rate
something is wrong with my exchange rate charge,card_payment_wrong_exchange_rate
I bought an item and the exchange rate was wrong.,card_payment_wrong_exchange_rate
Your exchange rate was off.  I was charged extra on my payment that I made last Saturday.,card_payment_wrong_exchange_rate
The exchange rate was incorrect for this item I bought.,card_payment_wrong_exchange_rate
My card is stuck in the ATM?,card_swallowed
"My card is stuck inside the ATM, what am I supposed to do?",card_swallowed
An ATM machine didn't give me back my card.,card_swallowed
I didn't get my card back from the ATM.,card_swallowed
The ATM sucked my card in.,card_swallowed
Why did they take more money out then I withdrawed?,cash_withdrawal_charge
"Why are you charging for cash withdrawals? I went to withdraw some money earlier today after getting my groceries, and it appears there is a fee that wasn't there before",cash_withdrawal_charge
Is there an extra fee for using an ATM?,cash_withdrawal_charge
Why am I being charged for withdrawing cash but haven't in the past?,cash_withdrawal_charge
Do cash withdrawals cost anything?,cash_withdrawal_charge
The app says I made a cash withdrawal that I didn't make,cash_withdrawal_not_recognised
"Please help me, its urgent. Someone has withdrawn money from my account as few hours before my wallet has been. Now i want to stop withdrawal of more money.",cash_withdrawal_not_recognised
How do I report a cash withdrawal that wasn't me?,cash_withdrawal_not_recognised
"A WD was just made on my account, but it was not me and I still have my card.  What to do?",cash_withdrawal_not_recognised
Somebody made a withdrawal from my account for 500. I have my card so how can this be? Does somebody have a duplicate card or something? Help please.,cash_withdrawal_not_recognised
Do you know how to change my card PIN?,change_pin
Can I change my PIN?,change_pin
Can you tell me what I need to do to have my pin changed?,change_pin
Can I change my PIN on my phone?,change_pin
Do I need to speak to a representative to change my pin?,change_pin
I noticed my card was used in a small town that I have never been to. Can you stop the card from being used more?,compromised_card
I believe that someone is using my card without my knowledge!,compromised_card
How do I report possible fraudulent activity on my account?,compromised_card
My card must have used my card as there are some transactions that I haven't done myself..,compromised_card
Someone has been using my card. There are unfamiliar transactions on there. Can you freeze the card to keep this from happening?,compromised_card
I've tried using my contactless in several locations today and it's not working anywhere. It seemed fine before. How do I get it to work again?,contactless_not_working
Help me to set up contactless payments.,contactless_not_working
How can I fix my contactless?,contactless_not_working
Any charges applicable for new card?,contactless_not_working
"I was trying to use contactless earlier, but it didn't work.",contactless_not_working
You provide support in what countries?,country_support
You operate in which countries?,country_support
Can I get a card that works in other countries like Africa and Indonesia?,country_support
Is this card available to United States Residents?,country_support
Which countries do you support?,country_support
Can you tell me why my card payment did not work?,declined_card_payment
I had a card payment that was declined.  Why?,declined_card_payment
Can you tell me why my card keeps getting declined every time I try to use it?,declined_card_payment
Why is it saying my card payment is declined when I made it?,declined_card_payment
Why do you keep declining my payment?I tried several times with this card and it is just not working.,declined_card_payment
I could not get the ATM to work,declined_cash_withdrawal
I think I am having an issue with withdraws on my card. It was declined on the way to work this morning. This hasn't happened in the past.,declined_cash_withdrawal
I tried to withdraw cash from the ATM machine and it did not work. Can you tell me why?,declined_cash_withdrawal
The ATM machines keep declining my card and I don't know why. I thought I had money in my account. Why is this happening?,declined_cash_withdrawal
Is there something wrong with the ATM? It would not let me pull cash out of my account.,declined_cash_withdrawal
"Transfer unable to be completed, states 'declined'",declined_transfer
Why was one of my transfers declined?,declined_transfer
What would be a reason my transfer got declined?,declined_transfer
I have a transfer that was declined.,declined_transfer
Can you tell me why my transfer declined?,declined_transfer
I need to cancel a transaction on my debit card.,direct_debit_payment_not_recognised
I need a refund on a direct debit that shows in the app because I did not make it.,direct_debit_payment_not_recognised
My statement shows a strange direct debit.,direct_debit_payment_not_recognised
"I just noticed that I supposedly made a payment to a seller a while back. The problem is, I don't recognize the seller. There must be a way to see who it is or track the payment. Can you do that, because I don't remember this transaction?",direct_debit_payment_not_recognised
There is a payment showing on my app that I didn't do. Will you please cancel this payment and refund my money ?,direct_debit_payment_not_recognised
How many transactions can I make on my disposable card?,disposable_card_limits
Am I limited on the amount of disposable cards I can possess?,disposable_card_limits
What are the disposable virtual card limits?,disposable_card_limits
"I need multiple cards per day, and they all have to be disposable.",disposable_card_limits
Is there a limit to the number of disposable cards per day?,disposable_card_limits
How to edit personal details?,edit_personal_details
I've just moved and I need to change my details,edit_personal_details
Please tell me where I can update my details since I moved.,edit_personal_details
My address is incorrect on my file.,edit_personal_details
need my details changed,edit_personal_details
What is the fee for a foreign currency exchange?,exchange_charge
Will I have to pay extra to exchange money?,exchange_charge
What is the rate for exchange fees?,exchange_charge
"When exchanging currencies, is there an extra fee?",exchange_charge
Can you tell me what the exchange fee is?,exchange_charge
How will I know what the exchange rate is?,exchange_rate
How do you decide what your exchange rates are?,exchange_rate
How do you calculate exchange rates?,exchange_rate
i need to know about exchange rates,exchange_rate
What is the exchange looking like?,exchange_rate
I need Australian dollars instead of UK currency.,exchange_via_app
Can i add a new currency to my account?,exchange_via_app
How do I exchange currencies using the app?,exchange_via_app
"I do not need GBP, I need AUD, how do I convert it?",exchange_via_app
Can I exchange currencies with the app?,exchange_via_app
My statement shows an extra fee - what is it?,extra_charge_on_statement
It appears I have a fee in my statement.,extra_charge_on_statement
Can you tell me about why the account I have was charged an extra 1$,extra_charge_on_statement
Why is there a 1 euro fee on my statement?,extra_charge_on_statement
I got billed an extra pound!,extra_charge_on_statement
My transfer didn't work! Help!,failed_transfer
Did  my transfer fail?,failed_transfer
Can you please assist me in completing a transfer? I'm trying and I keep getting an error. I'm trying to purchase a flat and pay the initial mortgage payment. All I keep getting is an error. Can you find out what's happening here?,failed_transfer
"My transfer failed, why?",failed_transfer
I tried to transfer money but it didn't go through,failed_transfer
Is it okay to hold money in multiple currencies?,fiat_currency_support
What are eligible holding and exchange currencies?,fiat_currency_support
What currencies can my account be in?,fiat_currency_support
What currencies do you support?,fiat_currency_support
What fiat currencies are supported?,fiat_currency_support
Please can i get a disposable virtual card as well?,get_disposable_virtual_card
How do I get a disposable virtual card as well?,get_disposable_virtual_card
Where do I get a disposable card,get_disposable_virtual_card
Can you tell me about these disposable virtual cards?,get_disposable_virtual_card
What are the disposable cards used for?,get_disposable_virtual_card
How do I set up my card PIN?,get_physical_card
Where is my PIN?,get_physical_card
I cannot find my PIN.,get_physical_card
I am yet to receive my pin.,get_physical_card
Where is the PIN number found?,get_physical_card
Are extra cards free?,getting_spare_card
Can I order a second card?,getting_spare_card
My daughter would like a card from my account?  Can I do this?,getting_spare_card
Can I get spare cards?,getting_spare_card
Can I have a duplicate second card?,getting_spare_card
Why have I not yet received my virtual card?,getting_virtual_card
Where do I order a virtual card?,getting_virtual_card
Why have I not received a virtual card yet?,getting_virtual_card
What do I have to do to get my virtual card?,getting_virtual_card
How can I go about ordering a virtual card?,getting_virtual_card
Can you help me retrieve my card?,lost_or_stolen_card
What should I do?  My card has been stolen!,lost_or_stolen_card
I lost my wallet and all my cards were in it.,lost_or_stolen_card
My card was stolen,lost_or_stolen_card
Who can I speak with regarding a lost card?,lost_or_stolen_card
I can't use the app because I got mugged yesterday and they took everything. Please help.,lost_or_stolen_phone
I lost my phone.  What do I do to block someone else from using my account?,lost_or_stolen_phone
"I cannot find my phone, what should I do?",lost_or_stolen_phone
"my phone was taken yesterday, what should I do about my account?",lost_or_stolen_phone
I left my phone somewhere and can't use the app.,lost_or_stolen_phone
Is there a fee to get an actual card?,order_physical_card
Do I have to pay for a physical card?,order_physical_card
Is payment required to get a card of my own?,order_physical_card
"I need to get a card, how do I do that?",order_physical_card
What is the cost for physical cards?,order_physical_card
What is my password?,passcode_forgotten
I need a new login code,passcode_forgotten
I forgot my password to get into the app!,passcode_forgotten
"I can't remember my app code, can you reset it?",passcode_forgotten
Can someone help with my passcode?,passcode_forgotten
My card payment says pending and it hasn't changed,pending_card_payment
I have a payment that is still pending,pending_card_payment
I made a payment but it's still pending,pending_card_payment
Why is my card payment pending?,pending_card_payment
I need to find out why my pending payment hasn't gone through.,pending_card_payment
Why would a cash withdrawal still be pending?,pending_cash_withdrawal
"Hello, I have a pending transaction in my account due to an ATM machine that wasn't working. In any case if the transaction goes through, after how long can I get my money back?",pending_cash_withdrawal
"Hello, I'm having trouble with my card, I don't understand what's happening, I tried using the ATM machine earlier but it wasn't working but seems like the transactions is still in progress, can you cancel it for me?",pending_cash_withdrawal
"Hae there, I have a transaction that is in progress despite the fact that the ATM was not working, what do I do to avoid being charged?",pending_cash_withdrawal
I'm expecting to see a cash withdrawal but I'm still waiting.,pending_cash_withdrawal
My top is still pending.,pending_top_up
What is the reason my top-up is still pending?,pending_top_up
why is top up pending,pending_top_up
I'm a new customer and tried topping up today for the first time. It's still pending and doesn't seem to be working. I need to get this fixed.,pending_top_up
Why has my top up not gone through yet?,pending_top_up
Can you tell me why my transfer is pending still?,pending_transfer
"Why is my transfer appearing as ""pending""?",pending_transfer
Could you please help me figure out why the seller has not received their money after I sent it.,pending_transfer
"Hello. How long does it usually take to transfer money to another country? I've made sure all the information is correct, but the transfer still says that it's ""pending.""",pending_transfer
The transfer was accepted but now it's stuck on pending. When will it go through?,pending_transfer
Can you unblock my blocked pin?,pin_blocked
I forgot my pin and am blocked now. Can I reset it somewhere?,pin_blocked
What do I do if my PIN was blocked?,pin_blocked
"My pin needs unblocking, unblock it please?",pin_blocked
When I was drunk I got my card stuck in your machine because i mis-typed my PIN. What do I need to do to get it restored?,pin_blocked
How do I transfer funds if I am paid in GBP?,receiving_money
I would like to know how my friend would be able to send me money,receiving_money
i want to get my salary deposited as pesos?,receiving_money
How can my boss pay me directly to the card?,receiving_money
can my husband open an account and transfer money,receiving_money
tell me how to get a refund for something I bought.,request_refund
I need to cancel a purchase?,request_refund
It has been forever ago that I made an order online. The product simply is not coming. Just give me back my money because I'm not paying these people.,request_refund
How do I get a refund for an item I bought?,request_refund
I need my purchase cancelled.,request_refund
What happens if my card payment is cancelled?,reverted_card_payment?
What is the reason for my card payment to be reverted?,reverted_card_payment?
I just got refunded for my purchase over two weeks ago,reverted_card_payment?
I think my card payment has been refunded,reverted_card_payment?
"Ive been trying to use my card for two weeks now to purchase somethings online but nothing is going through. It keeps returning my payment to my account. There shouldn't be anything wrong with my account, is it the card?",reverted_card_payment?
how can i add money from my amex card,supported_cards_and_currencies
Which cards and currencies are supported?,supported_cards_and_currencies
What forms of payment do you accept?,supported_cards_and_currencies
Will my other US credit card be accepted?,supported_cards_and_currencies
What cards do you accept to top up my account?,supported_cards_and_currencies
"I'm not happy, I want to close my account.",terminate_account
"The service here is horrible, I want to delete my account.",terminate_account
I need to close my account.  Your company is terrible!,terminate_account
I am very dissatisfied with the services that you are providing.  I want to cancel my account.,terminate_account
"I no longer want this account, what should I do?",terminate_account
I want to do a swift transfer,top_up_by_bank_transfer_charge
Is a SWIFT transfer acceptable?,top_up_by_bank_transfer_charge
Do I get charged if I am receiving money?,top_up_by_bank_transfer_charge
What kind of fee is there to top-up my account?,top_up_by_bank_transfer_charge
Is there a top up fee for transfer?,top_up_by_bank_transfer_charge
Are there any fees if I want to add money using an international card?,top_up_by_card_charge
How much does top up fees cost?,top_up_by_card_charge
Where can i top my card for free?,top_up_by_card_charge
Will I be charged a fee for topping up using a European card?,top_up_by_card_charge
Do I have to pay extra if I use an international card to top up my account?,top_up_by_card_charge
I want to top up by cheque,top_up_by_cash_or_cheque
Where can I find top up by cash deposit?,top_up_by_cash_or_cheque
Is there somewhere I can send a check to add to my account?,top_up_by_cash_or_cheque
Can I top up my balance with a cheque?,top_up_by_cash_or_cheque
Can I cash deposit to top up my account,top_up_by_cash_or_cheque
why is my top up failing,top_up_failed
The top-up did not go through.,top_up_failed
I was trying to top-up and my credit card was declined. Can you tell me why?,top_up_failed
"Hello, there was an error while attempting top-up with my card this morning. I was able to use the card two days ago with no issues. Could you please assist?",top_up_failed
I really need to top-up my card today urgently but my card keeps getting declined!! Can you please resolve this problem or try an alternative,top_up_failed
Is there a limit on how much I can top up?,top_up_limits
Is the top-up amount unlimited?,top_up_limits
Is there a maximum for top-ups?,top_up_limits
What's the top-up limit?,top_up_limits
Can I set my own top-up limit?,top_up_limits
What should I do?  I topped off but the app reversed  it.,top_up_reverted
What happened to the money that I deposited?,top_up_reverted
"My money is gone. I had topped up recently and saw it was there and went through, but now it's disappeared, what's going on?",top_up_reverted
I thought crypto top up with something you offer. This is not working. The money has been deducted from my account. Can you find out what's going on?,top_up_reverted
I put some money in my account the other day but now its gone? Why is this?,top_up_reverted
My top up is not showing up in my wallet!,topping_up_by_card
i can not see my top up,topping_up_by_card
Is it possible to top up by card?,topping_up_by_card
Am I the only one who can top-up my account?,topping_up_by_card
Is it possible to transfer money to my credit card?,topping_up_by_card
there were two of the same charge to my account,transaction_charged_twice
I have two of the same charges on my account!,transaction_charged_twice
Transaction showing up many times.,transaction_charged_twice
I was charged twice for an in-store purchase that I thought was declined.  My App says that it's still pending for one of the payments. Please make sure one of the charges is removed.,transaction_charged_twice
"Hi, I was at a restaurant later the week and when I went to look at my account I noticed that I got charged twice. I would like to get my money back from one of those transactions.",transaction_charged_twice
Why am I seeing a transfer fee on my bank statement?,transfer_fee_charged
I use my card internationally to manage payments and I just noticed that you are adding additional fees.  Why?  I am a good customer and this has me thinking about leaving.,transfer_fee_charged
"I see a transfer fee, but to my understand, that should have been free, what happened?",transfer_fee_charged
Why is there a fee for my transfer?,transfer_fee_charged
I need to know how much it costs to transfer funds.,transfer_fee_charged
How do I transfer money into my account?,transfer_into_account
How do I transfer cash my into my account?,transfer_into_account
Where can I find out how to transfer money into my account.,transfer_into_account
How can I add money to my account from another account I have?,transfer_into_account
I want to transfer a sum of money from another bank account I have into this one,transfer_into_account
Why can't the person I sent the money transfer to see it?,transfer_not_received_by_recipient
Why is my friend not getting a transaction arrival yet?,transfer_not_received_by_recipient
When will I get my money? It's been too long.,transfer_not_received_by_recipient
What do I do if I completed a money transfer but the recipient hasn't received it?,transfer_not_received_by_recipient
"I sent money to someone but they haven't gotten it, what's going on?",transfer_not_received_by_recipient
How long is the transfer?,transfer_timing
What is the estimated time on an urgent transfer from China?,transfer_timing
When will the money from a transfer be made available on my account?,transfer_timing
How long does it take transfers from Europe to complete?,transfer_timing
How long will I have to wait for my money to be in my account?,transfer_timing
"If you are waiting for verification, it can take 10 minutes to 60 minutes to get results.You will hear from us once we have it.  Please make sure your images are clear and photos of documents are readable. you have to be at least 18 years old and live withing the Economic Area of Europe or in Switzerland in order to open an account.",unable_to_verify_identity
I have trouble proving my identity.,unable_to_verify_identity
"My identity isn't being accepted, what should I do?",unable_to_verify_identity
What do I need to bring for identification?,unable_to_verify_identity
I am having trouble verifying my id.,unable_to_verify_identity
What do I need for the verification check?,verify_my_identity
How can I prove who I am?,verify_my_identity
How can I prove I am me?,verify_my_identity
How do i change my identity?,verify_my_identity
What is needed for the identity verification?,verify_my_identity
Where did my money come from?,verify_source_of_funds
Can I see the source of my available money?,verify_source_of_funds
How can I look at where my available cash is coming from?,verify_source_of_funds
Is there a way for me to check my balance?,verify_source_of_funds
How can I receive verification for the source of my funds?,verify_source_of_funds
I need to find the top up verification code,verify_top_up
Tell me how to verify a top up.,verify_top_up
this verifying the top up is annoying,verify_top_up
Where is the top-up verification code located?,verify_top_up
Where do i verify a top-up card?,verify_top_up
I tried paying with my disposable virtual card earlier but it was rejected. What can I do to fix this?,virtual_card_not_working
I can't make purchases with my virtual card.,virtual_card_not_working
My virtual car is not working.,virtual_card_not_working
I have a disposable card but it does not work?,virtual_card_not_working
Can I use my virtual card for recurring monthly payments?,virtual_card_not_working
Visa or Mastercard?,visa_or_mastercard
is it ok if i use both visa and mastercard,visa_or_mastercard
Do I have an option between Visa and MasterCard?,visa_or_mastercard
Is it possible to get both Mastercard and Visa card from you?,visa_or_mastercard
Please give me a Mastercard instead.,visa_or_mastercard
why and how soon do I have to have proof of identity to you?,why_verify_identity
what are the reasons I have to proof my identity to you?,why_verify_identity
"I'm waiting for the ID verification to go through still, so is it too soon to use my account?",why_verify_identity
Why do you have an identity check?,why_verify_identity
Why check my identity?,why_verify_identity
I only got $20 of the $100 that I attempted to withdraw.,wrong_amount_of_cash_received
"Hey I am standing in front of an ATM here, it only gave me 10 pounds even though I wanted to withdraw 30! Seems like the app has 30 pounds, what do I do??",wrong_amount_of_cash_received
"I think something went wrong, I didn't get the right amount.",wrong_amount_of_cash_received
The ATM didn't give me the amount I asked for,wrong_amount_of_cash_received
"I am at the ATM and tried to withdraw 30 pounds and it only gave me 10 pounds, what do I do?",wrong_amount_of_cash_received
"I tried using a foreign currency at an ATM, but the ATM provided me an incorrect rate. Why is that?",wrong_exchange_rate_for_cash_withdrawal
When I got cash I believe that the exchange rate was wrong,wrong_exchange_rate_for_cash_withdrawal
what is the correct exchange rate for getting cash,wrong_exchange_rate_for_cash_withdrawal
I didn't receive the correct exchange rate when I got cash.,wrong_exchange_rate_for_cash_withdrawal
Can I make a withdraw in my home currency at an ATM? I'm on vacation and am a bit worried because I don't have cash with me. Is it possible to withdraw here without any additional costs or fees?,wrong_exchange_rate_for_cash_withdrawal
