{
  "event": "Chương trình",
  "history_order": "Lịch sử đơn hàng",
  "follow_order": "Theo dõi đơn hàng",
  "detail_order": "Chi tiết đơn hàng",
  "follow_order_waiting": "Chờ xác nhận",
  "follow_order_shipping": "Đang giao",
  "lang": "Tiếng việt",
  "search": "Tìm kiếm",
  "today": "Hôm nay có gì?",
  "more": "Xem thêm",
  "category": "Nhãn hàng",
  "hotProduct": "Sản phẩm HOT",
  "notification": "Thông báo",
  "confirm": "Xác nhận",
  "product_added": "Sản phẩm được được thêm vào giỏ hàng. Vui lòng kiểm tra lại",
  "comming_soon": "Tính năng đang được cập nhật",
  "sort_by": "Sắp xếp theo",
  "product": "Sản phẩm",
  "gift_count": "Hàng tặng",

  "request_phone": "Vui lòng nhập số điện thoại",
  "phone_number": "Số điện thoại",
  "login": "Đăng nhập",
  "support_phone": "Gọi chăm sóc khách hàng",
  "OTP_sent": "Mã xác nhận đã được gửi tới số điện thoại đăng ký.",
  "OTP_enter": "Vui lòng điền Mã xác nhận vào dòng bên dưới",
  "OTP": "Mã xác nhận",
  "not_receive_OTP": "Không nhận được Mã xác nhận",
  "title_register": "Thông tin đăng ký",
  "text_name": "Họ & Tên *",
  "text_input_name": "Nhập tên của bạn",
  "text_phone": "Số Điện Thoại *",
  "text_input_phone": "Nhập số điện thoại của bạn",
  "text_shop_name": "Tên Cửa Hàng *",
  "text_input_shop_name": "Nhập tên cửa hàng của bạn",
  "text_address": "Địa chỉ *",
  "text_input_address": "Nhập địa chỉ của bạn",
  "title_note": "Lưu ý",
  "note_OTP": "Bạn sẽ nhận được mã ký tự qua tin nhắn bao gồm 4 ký tự.",
  "please_confirm_register": "Vui lòng điền vào ô xác nhận để hoàn tất đăng ký.",
  "text_law1": "Tôi đồng ý với",
  "terms_of_use": "Điều Khoản Sử Dụng",
  "text_law2": "và",
  "privacy_policy": "Chính Sách Bảo Mật",
  "text_law3": "của",
  "name_bussiness": "Vinh Hoàng Bussiness",
  "register": "Đăng ký",
  "text_city": "Tỉnh thành *",
  "text_dictricts": "Quận/ Huyện *",
  "text_wards": "Phường/ Xã *",
  "congratulations": "CHÚC MỪNG",
  "text_register_success1": "Bạn đã đăng ký thành công tài khoản",
  "text_register_success2": "Thông tin mua hàng của bạn sẽ được \n lưu lại để phục vụ cho các \n lần mua hàng sau",
  "start": "Bắt đầu",
  "contact_price": "Liên hệ lấy giá sỉ",
  "add_to_cart": "Thêm vào giỏ hàng",
  "description": "Mô tả",
  "uses": "Hướng dẫn sử dụng:",
  "element": "Thành phần:",
  "storage_condition": "Bảo quản:",
  "collapse": "Thu gọn",
  "seemore": "Xem thêm",
  "total": "Tổng cộng",
  "provisional": "Tạm tính",
  "discount": "Chiết khấu",
  "into_money": "Thành tiền:",
  "after_discount": "Sau chiết khấu:",
  "input_note": "Nhập ghi chú",
  "info_user": "Thông tin người nhận",
  "info_order": "Thông tin đơn hàng",
  "payment": "Phương thức thanh toán",
  "cash_payment": "Thanh toán tiền mặt",
  "transfer_payments": "Thanh toán chuyển khoản",
  "text_order_success1": "Đơn hàng của bạn được gửi thành công",
  "text_order_success2": "Mã đơn hàng: ",
  "text_order_success3": "Chúng tôi sẽ cập nhật cho bạn về tình trạng đơn hàng sớm nhất.",
  "order_success": "Đặt hàng thành công",
  "home": "Trang chủ",
  "unit_price": "Đơn giá",
  "tong_tien": "Tổng tiền:",
  "number": "Số lượng ",
  "you_like": "Bạn có thể thích",

  "order_code": "Mã đơn hàng",
  "delivery_info": "Thông tin nhận hàng",
  "order_info": "Thông tin đơn hàng",
  "receiver": "Người nhận",
  "address": "Địa chỉ",
  "phone": "Số điện thoại",
  "note": "Ghi chú",
  "total_money": "Tổng tiền",
  "quantity": "Số lượng",
  "saleoff": "Khuyễn mãi",
  "total_pay": "Tổng thanh toán",
  "cancel_order": "Hủy đơn hàng",
  "re_login": "Đăng nhập lại",
  "logout": "Đăng xuất"
}
