\BOOKMARK [2][]{Outline0.1}{Matrix}{}% 1
\BOOKMARK [2][]{Outline0.2}{Vector space}{}% 2
\BOOKMARK [2][]{Outline0.3}{Linear transform}{}% 3
\BOOKMARK [2][]{Outline0.4}{Eigenvalue and eigenvector}{}% 4
