<<<<<<< Updated upstream
\contentsline {chapter}{Notation}{ix}
\contentsline {chapter}{\numberline {1}Figures}{1}
\contentsline {section}{\numberline {1.1}What is it}{1}
\contentsline {section}{\numberline {1.2}Why we need to write it?}{2}
\contentsline {section}{\numberline {1.3}How to write it?}{2}
\contentsline {chapter}{\numberline {2}Tables}{3}
\contentsline {section}{\numberline {2.1}What is it}{3}
\contentsline {section}{\numberline {2.2}Why we need to write it?}{3}
\contentsline {section}{\numberline {2.3}How to write it?}{3}
\contentsline {chapter}{\numberline {3}Footnotes}{5}
\contentsline {section}{\numberline {3.1}What is It?}{5}
\contentsline {chapter}{\numberline {4}Equation}{7}
\contentsline {section}{\numberline {4.1}What is it and How to write it?}{7}
\contentsline {chapter}{\numberline {5}Algorithm}{9}
\contentsline {chapter}{\numberline {6}Related work}{11}
\contentsline {chapter}{\numberline {7}Conclusion}{13}
=======
\contentsline {chapter}{\numberline {1}Figures}{3}% 
\contentsline {section}{\numberline {1.1}What is it}{3}% 
\contentsline {section}{\numberline {1.2}Why we need to write it?}{4}% 
\contentsline {section}{\numberline {1.3}How to write it?}{4}% 
\contentsline {chapter}{\numberline {2}Tables}{5}% 
\contentsline {section}{\numberline {2.1}What is it}{5}% 
\contentsline {section}{\numberline {2.2}Why we need to write it?}{5}% 
\contentsline {section}{\numberline {2.3}How to write it?}{5}% 
\contentsline {chapter}{\numberline {3}Footnotes}{7}% 
\contentsline {section}{\numberline {3.1}What is It?}{7}% 
\contentsline {chapter}{\numberline {4}Equation}{9}% 
\contentsline {section}{\numberline {4.1}What is it and How to write it?}{9}% 
\contentsline {chapter}{\numberline {5}Algorithm}{11}% 
\contentsline {chapter}{\numberline {6}Related work}{13}% 
\contentsline {chapter}{\numberline {7}Conclusion}{15}% 
>>>>>>> Stashed changes
