\relax 
\providecommand \oddpage@label [2]{}
<<<<<<< Updated upstream
\@writefile{toc}{\contentsline {chapter}{Notation}{ix}}
\@writefile{lof}{\addvspace {10\p@ }}
\@writefile{lot}{\addvspace {10\p@ }}
\@writefile{loa}{\addvspace {10\p@ }}
\@writefile{lot}{\contentsline {table}{\numberline {1}{\ignorespaces List of notation}}{ix}}
\newlabel{table:1}{{1}{ix}}
=======
\providecommand\@newglossary[4]{}
\@newglossary{main}{glg}{gls}{glo}
\@newglossary{acronym}{alg}{acr}{acn}
\providecommand\@glsorder[1]{}
\providecommand\@istfilename[1]{}
\@istfilename{main.ist}
\@glsorder{word}
>>>>>>> Stashed changes
\@input{./Chapter/chapter01.aux}
\@input{./Chapter/chapter02.aux}
\@input{./Chapter/chapter03.aux}
\@input{./Chapter/chapter04.aux}
\@input{./Chapter/chapter05.aux}
\@input{./Chapter/chapter06.aux}
\@input{./Chapter/chapter07.aux}
\citation{AHPW15}
\citation{BGN05}
\citation{ChenPhong11}
\bibdata{References}
\bibcite{AHPW15}{1}
\bibcite{BGN05}{2}
\bibcite{ChenPhong11}{3}
\bibstyle{ieeetr}
