\relax 
\providecommand\hyper@newdestlabel[2]{}
\providecommand\HyperFirstAtBeginDocument{\AtBeginDocument}
\HyperFirstAtBeginDocument{\ifx\hyper@anchor\@undefined
\global\let\oldcontentsline\contentsline
\gdef\contentsline#1#2#3#4{\oldcontentsline{#1}{#2}{#3}}
\global\let\oldnewlabel\newlabel
\gdef\newlabel#1#2{\newlabelxx{#1}#2}
\gdef\newlabelxx#1#2#3#4#5#6{\oldnewlabel{#1}{{#2}{#3}}}
\AtEndDocument{\ifx\hyper@anchor\@undefined
\let\contentsline\oldcontentsline
\let\newlabel\oldnewlabel
\fi}
\fi}
\global\let\hyper@last\relax 
\gdef\HyperFirstAtBeginDocument#1{#1}
\providecommand\HyField@AuxAddToFields[1]{}
\providecommand\HyField@AuxAddToCoFields[2]{}
\bibdata{thesis}
\providecommand \oddpage@label [2]{}
\@writefile{toc}{\contentsline {chapter}{\numberline {1}Introduction}{1}{chapter.1}\protected@file@percent }
\@writefile{lof}{\addvspace {10\p@ }}
\@writefile{lot}{\addvspace {10\p@ }}
\@writefile{loa}{\addvspace {10\p@ }}
\bibcite{languages}{{1}{}{{}}{{}}}
\bibcite{hutchins07}{{2}{}{{}}{{}}}
\bibcite{weaver49}{{3}{}{{}}{{}}}
\bibcite{hutchins2000early}{{4}{}{{}}{{}}}
\bibcite{ibm701}{{5}{}{{}}{{}}}
\bibcite{brants07}{{6}{}{{}}{{}}}
\bibcite{solvemt}{{7}{}{{}}{{}}}
\bibcite{winograd_mt16}{{8}{}{{}}{{}}}
\bibcite{Brown:1993:MSM}{{9}{}{{}}{{}}}
\bibcite{Jurafsky:2009}{{10}{}{{}}{{}}}
\bibcite{katz87}{{11}{}{{}}{{}}}
\bibcite{Marcu:2002}{{12}{}{{}}{{}}}
\bibcite{Koehn:2003:SMT}{{13}{}{{}}{{}}}
\bibcite{gnmt16}{{14}{}{{}}{{}}}
\bibcite{systran16}{{15}{}{{}}{{}}}
\bibcite{och03}{{16}{}{{}}{{}}}
\bibcite{och04}{{17}{}{{}}{{}}}
\bibcite{liang06alignment}{{18}{}{{}}{{}}}
\bibcite{berger96}{{19}{}{{}}{{}}}
\bibcite{och02}{{20}{}{{}}{{}}}
\bibcite{Papineni02bleu}{{21}{}{{}}{{}}}
\bibcite{och03mert}{{22}{}{{}}{{}}}
\bibcite{wu97}{{23}{}{{}}{{}}}
\bibcite{yamada01}{{24}{}{{}}{{}}}
\bibcite{chiang05}{{25}{}{{}}{{}}}
\bibcite{koehn10smt}{{26}{}{{}}{{}}}
\bibcite{galley08}{{27}{}{{}}{{}}}
\bibcite{chiang09}{{28}{}{{}}{{}}}
\bibcite{green13}{{29}{}{{}}{{}}}
\bibcite{kal13}{{30}{}{{}}{{}}}
\bibcite{sutskever14}{{31}{}{{}}{{}}}
\bibcite{cho14}{{32}{}{{}}{{}}}
\bibcite{koehn2007moses}{{33}{}{{}}{{}}}
\bibcite{chiang07hiero}{{34}{}{{}}{{}}}
\bibcite{dyer10cdec}{{35}{}{{}}{{}}}
\bibcite{cer10phrasal}{{36}{}{{}}{{}}}
\bibcite{allen87}{{37}{}{{}}{{}}}
\bibcite{chrisman91}{{38}{}{{}}{{}}}
\bibcite{luong15}{{39}{}{{}}{{}}}
\bibcite{luong15attn}{{40}{}{{}}{{}}}
\bibcite{luong15iwslt}{{41}{}{{}}{{}}}
\bibcite{luong16}{{42}{}{{}}{{}}}
\bibcite{luong16iclr}{{43}{}{{}}{{}}}
\bibcite{see16}{{44}{}{{}}{{}}}
\bibcite{bog15}{{45}{}{{}}{{}}}
\bibcite{iwslt15}{{46}{}{{}}{{}}}
\bibcite{luong13}{{47}{}{{}}{{}}}
\bibcite{li15}{{48}{}{{}}{{}}}
\bibcite{mobiledevices}{{49}{}{{}}{{}}}
\bibstyle{ieeetr}
\providecommand\NAT@force@numbers{}\NAT@force@numbers
