\begin{thebibliography}{1}

\bibitem{AHPW15}
Y.~Aono, T.~Hayashi, L.~T. Phong, and L.~Wang, ``{Fast and Secure Linear
  Regression and Biometric Authentication with Security Update},'' {\em IACR
  Cryptology ePrint Archive}, vol.~2015, p.~692, 2015.

\bibitem{BGN05}
D.~Boneh, E.~Goh, and K.~Nissim, ``Evaluating 2-dnf formulas on ciphertexts,''
  in {\em Theory of Cryptography, Second Theory of Cryptography Conference,
  {TCC} 2005, Cambridge, MA, USA, February 10-12, 2005, Proceedings},
  pp.~325--341, 2005.

\bibitem{ChenPhong11}
Y.~Chen and P.~Q. Nguyen, ``Bkz 2.0: Better lattice security estimates,'' in
  {\em Advances in Cryptology -- ASIACRYPT 2011} (D.~H. Lee and X.~Wang, eds.),
  (Berlin, Heidelberg), pp.~1--20, Springer Berlin Heidelberg, 2011.

\end{thebibliography}
