\relax 
<<<<<<< Updated upstream
\@writefile{toc}{\contentsline {chapter}{\numberline {1}Figures}{1}}
\@writefile{lof}{\addvspace {10\p@ }}
\@writefile{lot}{\addvspace {10\p@ }}
\@writefile{loa}{\addvspace {10\p@ }}
\@writefile{toc}{\contentsline {section}{\numberline {1.1}What is it}{1}}
\@writefile{lof}{\contentsline {figure}{\numberline {1.1}{\ignorespaces Example of a parametric plot ($\qopname  \relax o{sin}(x), \qopname  \relax o{cos}(x), x$)}}{1}}
\newlabel{fig:mesh1}{{1.1}{1}}
\@writefile{lof}{\contentsline {figure}{\numberline {1.2}{\ignorespaces Example of a parametric plot ($\qopname  \relax o{sin}(x), \qopname  \relax o{cos}(x), x$)}}{2}}
\@writefile{lof}{\contentsline {figure}{\numberline {1.3}{\ignorespaces Example of a parametric plot ($\qopname  \relax o{sin}(x), \qopname  \relax o{cos}(x), x$)}}{2}}
\@writefile{toc}{\contentsline {section}{\numberline {1.2}Why we need to write it?}{2}}
\@writefile{toc}{\contentsline {section}{\numberline {1.3}How to write it?}{2}}
=======
\@writefile{toc}{\contentsline {chapter}{\numberline {1}Figures}{3}\protected@file@percent }
\@writefile{lof}{\addvspace {10\p@ }}
\@writefile{lot}{\addvspace {10\p@ }}
\@writefile{loa}{\addvspace {10\p@ }}
\@writefile{toc}{\contentsline {section}{\numberline {1.1}What is it}{3}\protected@file@percent }
\@writefile{lof}{\contentsline {figure}{\numberline {1.1}{\ignorespaces Example of a parametric plot ($\qopname  \relax o{sin}(x), \qopname  \relax o{cos}(x), x$)}}{3}\protected@file@percent }
\newlabel{fig:mesh1}{{1.1}{3}}
\@writefile{lof}{\contentsline {figure}{\numberline {1.2}{\ignorespaces Example of a parametric plot ($\qopname  \relax o{sin}(x), \qopname  \relax o{cos}(x), x$)}}{4}\protected@file@percent }
\@writefile{lof}{\contentsline {figure}{\numberline {1.3}{\ignorespaces Example of a parametric plot ($\qopname  \relax o{sin}(x), \qopname  \relax o{cos}(x), x$)}}{4}\protected@file@percent }
\@writefile{toc}{\contentsline {section}{\numberline {1.2}Why we need to write it?}{4}\protected@file@percent }
\@writefile{toc}{\contentsline {section}{\numberline {1.3}How to write it?}{4}\protected@file@percent }
>>>>>>> Stashed changes
\@setckpt{./Chapter/chapter01}{
\setcounter{page}{5}
\setcounter{equation}{0}
\setcounter{enumi}{0}
\setcounter{enumii}{0}
\setcounter{enumiii}{0}
\setcounter{enumiv}{0}
\setcounter{footnote}{0}
\setcounter{mpfootnote}{0}
\setcounter{part}{0}
\setcounter{chapter}{1}
\setcounter{section}{3}
\setcounter{subsection}{0}
\setcounter{subsubsection}{0}
\setcounter{paragraph}{0}
\setcounter{subparagraph}{0}
\setcounter{figure}{3}
\setcounter{table}{0}
\setcounter{parentequation}{0}
\setcounter{AlgoLine}{0}
\setcounter{algocfline}{0}
\setcounter{algocfproc}{0}
\setcounter{algocf}{0}
\setcounter{su@anzahl}{0}
\setcounter{LT@tables}{0}
\setcounter{LT@chunks}{0}
}
