\relax 
<<<<<<< Updated upstream
\@writefile{toc}{\contentsline {chapter}{\numberline {2}Tables}{3}}
\@writefile{lof}{\addvspace {10\p@ }}
\@writefile{lot}{\addvspace {10\p@ }}
\@writefile{loa}{\addvspace {10\p@ }}
\@writefile{toc}{\contentsline {section}{\numberline {2.1}What is it}{3}}
\@writefile{lot}{\contentsline {table}{\numberline {2.1}{\ignorespaces Table to test captions and labels}}{3}}
\newlabel{table:1}{{2.1}{3}}
\@writefile{toc}{\contentsline {section}{\numberline {2.2}Why we need to write it?}{3}}
\@writefile{toc}{\contentsline {section}{\numberline {2.3}How to write it?}{3}}
=======
\@writefile{toc}{\contentsline {chapter}{\numberline {2}Tables}{5}\protected@file@percent }
\@writefile{lof}{\addvspace {10\p@ }}
\@writefile{lot}{\addvspace {10\p@ }}
\@writefile{loa}{\addvspace {10\p@ }}
\@writefile{toc}{\contentsline {section}{\numberline {2.1}What is it}{5}\protected@file@percent }
\@writefile{lot}{\contentsline {table}{\numberline {2.1}{\ignorespaces Table to test captions and labels}}{5}\protected@file@percent }
\newlabel{table:1}{{2.1}{5}}
\@writefile{toc}{\contentsline {section}{\numberline {2.2}Why we need to write it?}{5}\protected@file@percent }
\@writefile{toc}{\contentsline {section}{\numberline {2.3}How to write it?}{5}\protected@file@percent }
>>>>>>> Stashed changes
\@setckpt{./Chapter/chapter02}{
\setcounter{page}{6}
\setcounter{equation}{0}
\setcounter{enumi}{0}
\setcounter{enumii}{0}
\setcounter{enumiii}{0}
\setcounter{enumiv}{0}
\setcounter{footnote}{0}
\setcounter{mpfootnote}{0}
\setcounter{part}{0}
\setcounter{chapter}{2}
\setcounter{section}{3}
\setcounter{subsection}{0}
\setcounter{subsubsection}{0}
\setcounter{paragraph}{0}
\setcounter{subparagraph}{0}
\setcounter{figure}{0}
\setcounter{table}{1}
\setcounter{parentequation}{0}
\setcounter{AlgoLine}{0}
\setcounter{algocfline}{0}
\setcounter{algocfproc}{0}
\setcounter{algocf}{0}
\setcounter{su@anzahl}{0}
\setcounter{LT@tables}{0}
\setcounter{LT@chunks}{0}
}
