\relax 
<<<<<<< Updated upstream
\@writefile{toc}{\contentsline {chapter}{\numberline {5}Algorithm}{9}}
\@writefile{lof}{\addvspace {10\p@ }}
\@writefile{lot}{\addvspace {10\p@ }}
\@writefile{loa}{\addvspace {10\p@ }}
\@writefile{loa}{\contentsline {algocf}{\numberline {1}{\ignorespaces How to write algorithms}}{9}}
\@writefile{loa}{\contentsline {algocf}{\numberline {2}{\ignorespaces Undefined algorithm}}{9}}
=======
\@writefile{toc}{\contentsline {chapter}{\numberline {5}Algorithm}{11}\protected@file@percent }
\@writefile{lof}{\addvspace {10\p@ }}
\@writefile{lot}{\addvspace {10\p@ }}
\@writefile{loa}{\addvspace {10\p@ }}
\@writefile{loa}{\contentsline {algocf}{\numberline {1}{\ignorespaces How to write algorithms}}{11}\protected@file@percent }
\@writefile{loa}{\contentsline {algocf}{\numberline {2}{\ignorespaces Undefined algorithm}}{11}\protected@file@percent }
>>>>>>> Stashed changes
\@setckpt{./Chapter/chapter05}{
\setcounter{page}{12}
\setcounter{equation}{0}
\setcounter{enumi}{0}
\setcounter{enumii}{0}
\setcounter{enumiii}{0}
\setcounter{enumiv}{0}
\setcounter{footnote}{0}
\setcounter{mpfootnote}{0}
\setcounter{part}{0}
\setcounter{chapter}{5}
\setcounter{section}{0}
\setcounter{subsection}{0}
\setcounter{subsubsection}{0}
\setcounter{paragraph}{0}
\setcounter{subparagraph}{0}
\setcounter{figure}{0}
\setcounter{table}{0}
\setcounter{parentequation}{0}
\setcounter{AlgoLine}{2}
\setcounter{algocfline}{2}
\setcounter{algocfproc}{2}
\setcounter{algocf}{2}
\setcounter{su@anzahl}{0}
\setcounter{LT@tables}{0}
\setcounter{LT@chunks}{0}
}
