\headcommand {\slideentry {0}{0}{1}{1/1}{}{0}}
\headcommand {\beamer@framepages {1}{1}}
\headcommand {\slideentry {0}{0}{2}{2/2}{}{0}}
\headcommand {\beamer@framepages {2}{2}}
\headcommand {\slideentry {0}{0}{3}{3/3}{}{0}}
\headcommand {\beamer@framepages {3}{3}}
\headcommand {\beamer@sectionpages {1}{3}}
\headcommand {\beamer@subsectionpages {1}{3}}
\headcommand {\sectionentry {1}{Introduction}{4}{Introduction}{0}}
\headcommand {\slideentry {1}{0}{1}{4/4}{}{0}}
\headcommand {\beamer@framepages {4}{4}}
\headcommand {\beamer@subsectionpages {4}{4}}
\headcommand {\beamer@subsectionentry {0}{1}{1}{5}{History of Java}}
\headcommand {\slideentry {1}{1}{1}{5/5}{History of Java}{0}}
\headcommand {\beamer@framepages {5}{5}}
\headcommand {\beamer@subsectionpages {5}{5}}
\headcommand {\beamer@subsectionentry {0}{1}{2}{6}{What is Java}}
\headcommand {\slideentry {1}{2}{1}{6/6}{What is Java}{0}}
\headcommand {\beamer@framepages {6}{6}}
\headcommand {\beamer@subsectionpages {6}{6}}
\headcommand {\beamer@subsectionentry {0}{1}{3}{7}{Java Editions}}
\headcommand {\slideentry {1}{3}{1}{7/7}{Java Editions}{0}}
\headcommand {\beamer@framepages {7}{7}}
\headcommand {\beamer@subsectionpages {7}{7}}
\headcommand {\beamer@subsectionentry {0}{1}{4}{8}{Java Platform}}
\headcommand {\slideentry {1}{4}{1}{8/8}{Java Platform}{0}}
\headcommand {\beamer@framepages {8}{8}}
\headcommand {\beamer@subsectionpages {8}{8}}
\headcommand {\beamer@subsectionentry {0}{1}{5}{9}{Java Development}}
\headcommand {\slideentry {1}{5}{1}{9/9}{Java Development}{0}}
\headcommand {\beamer@framepages {9}{9}}
\headcommand {\slideentry {1}{5}{2}{10/10}{Java Development}{0}}
\headcommand {\beamer@framepages {10}{10}}
\headcommand {\slideentry {1}{5}{3}{11/11}{Java Development}{0}}
\headcommand {\beamer@framepages {11}{11}}
\headcommand {\slideentry {1}{5}{4}{12/12}{Java Development}{0}}
\headcommand {\beamer@framepages {12}{12}}
\headcommand {\slideentry {1}{5}{5}{13/13}{Java Development}{0}}
\headcommand {\beamer@framepages {13}{13}}
\headcommand {\beamer@partpages {1}{13}}
\headcommand {\beamer@subsectionpages {9}{13}}
\headcommand {\beamer@sectionpages {4}{13}}
\headcommand {\beamer@documentpages {13}}
\headcommand {\gdef \inserttotalframenumber {13}}
