\beamer@sectionintoc {1}{Matrix}{3}{0}{1}
\beamer@sectionintoc {2}{Vector space}{5}{0}{2}
\beamer@sectionintoc {3}{Linear transform}{7}{0}{3}
\beamer@sectionintoc {4}{Eigenvalue and eigenvector}{9}{0}{4}
