\relax 
<<<<<<< Updated upstream
\@writefile{toc}{\contentsline {chapter}{\numberline {4}Equation}{7}}
\@writefile{lof}{\addvspace {10\p@ }}
\@writefile{lot}{\addvspace {10\p@ }}
\@writefile{loa}{\addvspace {10\p@ }}
\@writefile{toc}{\contentsline {section}{\numberline {4.1}What is it and How to write it?}{7}}
\newlabel{eq1}{{4.2}{7}}
\newlabel{eu_eqn}{{4.3}{7}}
=======
\@writefile{toc}{\contentsline {chapter}{\numberline {4}Equation}{9}\protected@file@percent }
\@writefile{lof}{\addvspace {10\p@ }}
\@writefile{lot}{\addvspace {10\p@ }}
\@writefile{loa}{\addvspace {10\p@ }}
\@writefile{toc}{\contentsline {section}{\numberline {4.1}What is it and How to write it?}{9}\protected@file@percent }
\newlabel{eq1}{{4.2}{9}}
\newlabel{eu_eqn}{{4.3}{9}}
>>>>>>> Stashed changes
\@setckpt{./Chapter/chapter04}{
\setcounter{page}{11}
\setcounter{equation}{3}
\setcounter{enumi}{0}
\setcounter{enumii}{0}
\setcounter{enumiii}{0}
\setcounter{enumiv}{0}
\setcounter{footnote}{0}
\setcounter{mpfootnote}{0}
\setcounter{part}{0}
\setcounter{chapter}{4}
\setcounter{section}{1}
\setcounter{subsection}{0}
\setcounter{subsubsection}{0}
\setcounter{paragraph}{0}
\setcounter{subparagraph}{0}
\setcounter{figure}{0}
\setcounter{table}{0}
\setcounter{parentequation}{0}
\setcounter{AlgoLine}{0}
\setcounter{algocfline}{0}
\setcounter{algocfproc}{0}
\setcounter{algocf}{0}
\setcounter{su@anzahl}{0}
\setcounter{LT@tables}{0}
\setcounter{LT@chunks}{0}
}
