\beamer@endinputifotherversion {3.36pt}
\beamer@sectionintoc {1}{Matrix}{3}{0}{1}
\beamer@sectionintoc {2}{Vector space}{4}{0}{2}
\beamer@sectionintoc {3}{Linear transform}{5}{0}{3}
\beamer@sectionintoc {4}{Eigenvalue and eigenvector}{6}{0}{4}
