\relax 
\citation{patterson:risc}
\citation{rad83}
\@writefile{toc}{\contentsline {chapter}{\numberline {1}Introduction}{13}}
\@writefile{lof}{\addvspace {10\p@ }}
\@writefile{lot}{\addvspace {10\p@ }}
\@writefile{toc}{\contentsline {section}{\numberline {1.1}Hello world}{13}}
\@writefile{toc}{\contentsline {section}{\numberline {1.2}Hello, world}{13}}
\citation{ellis:bulldog}
\citation{pet87}
\citation{coutant:precision-compilers}
\citation{gib86}
\@writefile{toc}{\contentsline {section}{\numberline {1.3}Motivations for micro-optimization}{14}}
\@writefile{toc}{\contentsline {section}{\numberline {1.4}Description of micro-optimization}{14}}
\newlabel{ch1:opts}{{1.4}{14}}
\citation{thornton:cdc6600}
\@writefile{toc}{\contentsline {subsection}{\numberline {1.4.1}Post Multiply Normalization}{15}}
\@writefile{toc}{\contentsline {subsection}{\numberline {1.4.2}Block Exponent}{15}}
\@writefile{toc}{\contentsline {section}{\numberline {1.5}Integer optimizations}{16}}
\@writefile{toc}{\contentsline {subsection}{\numberline {1.5.1}Conversion to fixed point}{16}}
\@writefile{toc}{\contentsline {subsection}{\numberline {1.5.2}Small Constant Multiplications}{17}}
\citation{magenheimer:precision}
\citation{byte:i860}
\citation{ellis:bulldog}
\citation{colwell:vliw}
\@writefile{toc}{\contentsline {section}{\numberline {1.6}Other optimizations}{18}}
\@writefile{toc}{\contentsline {subsection}{\numberline {1.6.1}Low-level parallelism}{18}}
\citation{gib86}
\@writefile{toc}{\contentsline {subsection}{\numberline {1.6.2}Pipeline optimizations}{19}}
\@setckpt{chap1}{
\setcounter{page}{20}
\setcounter{equation}{0}
\setcounter{enumi}{6}
\setcounter{enumii}{0}
\setcounter{enumiii}{0}
\setcounter{enumiv}{0}
\setcounter{footnote}{6}
\setcounter{mpfootnote}{0}
\setcounter{part}{0}
\setcounter{chapter}{1}
\setcounter{section}{6}
\setcounter{subsection}{2}
\setcounter{subsubsection}{0}
\setcounter{paragraph}{0}
\setcounter{subparagraph}{0}
\setcounter{figure}{0}
\setcounter{table}{0}
\setcounter{savepage}{3}
}
