\beamer@sectionintoc {1}{More Details}{4}{0}{1}
\beamer@subsectionintoc {1}{1}{Arrays}{5}{0}{1}
\beamer@subsectionintoc {1}{2}{Command Line Arguments}{6}{0}{1}
\beamer@subsectionintoc {1}{3}{For-Each}{7}{0}{1}
\beamer@subsectionintoc {1}{4}{Scanner}{8}{0}{1}
\beamer@subsectionintoc {1}{5}{Static}{9}{0}{1}
\beamer@subsectionintoc {1}{6}{Nested and Inner Classes}{10}{0}{1}
