<svg width="24" height="24" viewBox="0 0 24 24" fill="none" xmlns="http://www.w3.org/2000/svg">
<path d="M12.0129 0.638428L17.5432 9.99823L19.1108 9.26616C19.1976 8.81798 19.2436 8.35522 19.2436 7.88174C19.2436 3.88557 16.0075 0.645381 12.0129 0.638428Z" fill="#077CCC"/>
<path d="M12.0129 0.638451C12.0086 0.638451 12.0044 0.638306 12.0001 0.638306C7.99963 0.638306 4.75659 3.88135 4.75659 7.88182C4.75659 8.35534 4.80256 8.81806 4.88929 9.26623L12.0002 12.5869L17.5433 9.99826C17.7067 9.32872 17.7949 8.61814 17.7949 7.88177C17.7948 3.88666 15.2074 0.647191 12.0129 0.638451Z" fill="#09A1E5"/>
<path d="M19.1107 9.26624H16.7563V23.3617C20.7569 23.3617 23.9999 20.1186 23.9999 16.1182C23.9999 12.9419 21.9554 10.2434 19.1107 9.26624Z" fill="#FF3187"/>
<path d="M19.067 9.47388L12 12.1636V21.5809C13.2725 22.6899 14.936 23.3616 16.7565 23.3616C19.9569 23.3616 22.5514 20.1186 22.5514 16.1181C22.5514 13.1443 21.1175 10.5895 19.067 9.47388Z" fill="#FF5178"/>
<path d="M16.7566 8.87463L19.067 9.47381C19.0825 9.4049 19.0974 9.3358 19.1109 9.26612C18.3727 9.0126 17.5808 8.87463 16.7566 8.87463Z" fill="#622876"/>
<path d="M16.7565 8.87463C14.936 8.87463 13.2726 9.54639 12 10.6553L14.3543 14.7337C16.7089 13.9248 18.5145 11.9362 19.0669 9.47386C18.359 9.0887 17.5778 8.87463 16.7565 8.87463Z" fill="#962B7C"/>
<path d="M7.24512 23.3616C9.06501 23.3612 10.7279 22.6895 12.0001 21.581V20.256L7.24512 23.3616Z" fill="#FFB24A"/>
<path d="M12 20.256V12.1636L4.88919 9.26624C2.04454 10.2435 0 12.942 0 16.1182C0 20.1186 3.24299 23.3616 7.24346 23.3616C9.21397 23.361 10.9531 22.1326 12 20.256Z" fill="#FFD23B"/>
<path d="M11.9999 10.6553C10.7274 9.54639 9.06388 8.87463 7.24341 8.87463L11.9999 12.131V10.6553Z" fill="#49B296"/>
<path d="M7.24348 8.87463C6.41927 8.87463 5.62737 9.0126 4.88916 9.26622C5.38432 11.8243 7.22503 13.9022 9.64565 14.7337L11.4713 11.1652C10.4141 9.75563 8.91121 8.87468 7.24348 8.87463Z" fill="#89C247"/>
<path d="M14.3542 14.7336C13.9127 14.8853 13.4518 14.9953 12.9765 15.0594L11.4714 21.0709C11.639 21.2496 11.8152 21.4199 11.9999 21.5808C13.5237 20.2529 14.4869 18.298 14.4869 16.118C14.4869 15.6445 14.441 15.1818 14.3542 14.7336Z" fill="#FF7169"/>
<path d="M12.9765 15.0595C12.6571 15.1027 12.3312 15.1253 12 15.1253C11.1757 15.1253 10.3838 14.9873 9.64569 14.7338C9.55891 15.1819 9.51294 15.6447 9.51294 16.1182C9.51294 18.0339 10.2569 19.7757 11.4715 21.071C12.4431 19.7756 13.0383 18.0339 13.0383 16.1182C13.0383 15.7585 13.017 15.4051 12.9765 15.0595Z" fill="#FF9259"/>
<path d="M12.0001 10.6554C11.8154 10.8163 11.6389 10.9866 11.4714 11.1652L12.9766 15.0595C13.4519 14.9953 13.9128 14.8854 14.3543 14.7338C14.0417 13.1187 13.1929 11.6949 12.0001 10.6554Z" fill="#2D2570"/>
<path d="M9.64575 14.7338C10.3839 14.9874 11.1758 15.1253 12 15.1253C12.3312 15.1253 12.6571 15.1027 12.9766 15.0596C12.8014 13.5642 12.2607 12.2175 11.4714 11.1653C10.5572 12.1404 9.90995 13.3688 9.64575 14.7338Z" fill="#2D3E53"/>
</svg>
