<svg width="20" height="20" viewBox="0 0 20 20" fill="none" xmlns="http://www.w3.org/2000/svg">
<path d="M9.74528 12.589C9.74303 12.589 9.74078 12.589 9.73853 12.589C9.32453 12.5852 8.99153 12.2466 8.99528 11.8322L8.99866 11.4572C8.99866 11.4358 8.99978 11.4141 9.00203 11.3927C9.10591 10.3018 9.83003 9.63321 10.4124 9.09584C10.6097 8.91359 10.7964 8.74146 10.9554 8.56184C11.1493 8.34321 11.4305 7.89546 11.1347 7.35509C10.7938 6.73109 9.96128 6.55446 9.31441 6.70259C8.63866 6.85709 8.38966 7.43421 8.30116 7.76421C8.19391 8.16434 7.78253 8.40171 7.38241 8.29484C6.98228 8.18759 6.74491 7.77621 6.85178 7.37609C7.15066 6.25971 7.92616 5.48159 8.97916 5.24046C10.3963 4.91684 11.8235 5.48946 12.4502 6.63509C12.9718 7.58909 12.8289 8.70846 12.077 9.55671C11.8682 9.79221 11.645 9.99846 11.429 10.1976C10.8909 10.6945 10.5545 11.0267 10.4975 11.5063L10.4945 11.845C10.4915 12.2578 10.1563 12.589 9.74528 12.589Z" fill="#001DA7"/>
<path d="M9.74487 14.8375C9.54987 14.8375 9.35487 14.7587 9.21612 14.62C9.07362 14.4812 8.99487 14.2862 8.99487 14.0875C8.99487 13.8925 9.07362 13.6975 9.21612 13.5587C9.49362 13.2812 9.99612 13.2812 10.2736 13.5587C10.4161 13.6975 10.4949 13.8925 10.4949 14.0875C10.4949 14.2862 10.4161 14.4775 10.2774 14.62C10.1349 14.7587 9.94362 14.8375 9.74487 14.8375Z" fill="#001DA7"/>
<path d="M9.97108 19.7489C9.11795 19.7489 8.27233 19.6379 7.45745 19.4185C3.94595 18.4739 1.19645 15.565 0.452829 12.0074C-0.305046 8.38299 1.0937 4.57299 4.01683 2.30086C5.70658 0.987239 7.8377 0.263489 10.018 0.263489C11.5273 0.263489 13.0262 0.614489 14.353 1.27786C17.6293 2.91699 19.7462 6.34149 19.7462 10.0026C19.7462 12.9899 18.3366 15.8691 15.9756 17.7044C14.2798 19.0229 12.1472 19.7489 9.97108 19.7489ZM10.0183 1.76349C8.16995 1.76349 6.36545 2.37474 4.93783 3.48511C2.46395 5.40811 1.2797 8.63274 1.92133 11.7002C2.55058 14.7096 4.8767 17.1707 7.84745 17.9699C8.5352 18.1547 9.24995 18.2489 9.97108 18.2489H9.97145C11.8157 18.2489 13.621 17.635 15.0553 16.5201C17.0537 14.9669 18.2466 12.5305 18.2466 10.0026C18.2466 6.90474 16.4552 4.00674 13.6825 2.61961C12.5627 2.05974 11.296 1.76349 10.0183 1.76349Z" fill="#001DA7"/>
</svg>
