{
  "$schema": "https://docs.renovatebot.com/renovate-schema.json",
  "branchPrefix": "renovate-",
  "customManagers": [
    {
      "customType": "regex",
      "fileMatch": [
        ".gitlab-ci.yml",
        "Dockerfile"
      ],
      "matchStrings": [
        "ENV WEBTREES_VERSION=(?<currentValue>[0-9-.]*?)\n",
        "WEBTREES_VERSION: (?<currentValue>[0-9-.]*?)\n"
      ],
      "depNameTemplate": "fisharebest/webtrees",
      "packageNameTemplate": "fisharebest/webtrees",
      "datasourceTemplate": "github-tags",
      "registryUrlTemplate": "https://github.com",
      "versioningTemplate": "semver"
    }
  ],
  "packageRules": [
    {
      "matchDatasources": [
        "github-tags"
      ],
      "matchPackagePatterns": [
        "fisharebest/webtrees"
      ],
      "matchUpdateTypes": [
        "patch",
        "pin",
        "digest",
        "lockFileMaintenance",
        "rollback",
        "bump"
      ],
      "automerge": true,
      "ignoreTests": true,
      "automergeType": "pr"
    },
    {
      "matchDatasources": [
        "docker"
      ],
      "matchUpdateTypes": [
        "minor",
        "patch",
        "pin",
        "digest",
        "lockFileMaintenance",
        "rollback",
        "bump"
      ],
      "automerge": true,
      "ignoreTests": true,
      "automergeType": "pr"
    }
  ]
}
