{
  "$schema": "https://docs.renovatebot.com/renovate-schema.json",
  "branchPrefix": "renovate-",
  "customManagers": [
    {
      "customType": "regex",
      "fileMatch": [
        "main.py"
      ],
      "matchStrings": [
        "PULUMI_KUBERNETES_VERSION=\"(?<currentValue>.*)\"\n"
      ],
      "depNameTemplate": "pulumi-kubernetes",
      "packageNameTemplate": "pulumi-kubernetes",
      "datasourceTemplate": "pypi"
    }
  ]
}
