{
  "0": {
    "[]": 353
  },
  "1": {
    "[birth_gt]": 92,
    "[birth_lt]": 80,
    "[birth_year]": 100,
    "[city_any]": 90,
    "[city_eq]": 80,
    "[city_null]": 89,
    "[country_eq]": 227,
    "[country_null]": 190,
    "[email_domain]": 43,
    "[email_gt]": 50,
    "[email_lt]": 57,
    "[fname_any]": 19,
    "[fname_null]": 35,
    "[interests_any]": 169,
    "[interests_contains]": 169,
    "[likes_contains]": 187,
    "[phone_code]": 22,
    "[phone_null]": 31,
    "[premium_now]": 118,
    "[premium_null]": 88,
    "[sex_eq]": 688,
    "[sname_null]": 25,
    "[sname_starts]": 42,
    "[status_eq]": 167,
    "[status_neq]": 153
  },
  "2": {
    "[birth_gt city_any]": 7,
    "[birth_gt city_eq]": 11,
    "[birth_gt city_null]": 10,
    "[birth_gt country_eq]": 40,
    "[birth_gt country_null]": 22,
    "[birth_gt likes_contains]": 55,
    "[birth_gt premium_now]": 33,
    "[birth_gt premium_null]": 37,
    "[birth_gt sex_eq]": 145,
    "[birth_gt status_eq]": 61,
    "[birth_gt status_neq]": 62,
    "[birth_lt city_any]": 8,
    "[birth_lt city_eq]": 14,
    "[birth_lt city_null]": 12,
    "[birth_lt country_eq]": 27,
    "[birth_lt country_null]": 30,
    "[birth_lt likes_contains]": 59,
    "[birth_lt premium_now]": 26,
    "[birth_lt premium_null]": 36,
    "[birth_lt sex_eq]": 150,
    "[birth_lt status_eq]": 49,
    "[birth_lt status_neq]": 63,
    "[birth_year city_any]": 15,
    "[birth_year city_eq]": 16,
    "[birth_year city_null]": 9,
    "[birth_year country_eq]": 33,
    "[birth_year country_null]": 18,
    "[birth_year likes_contains]": 64,
    "[birth_year premium_now]": 38,
    "[birth_year premium_null]": 35,
    "[birth_year sex_eq]": 133,
    "[birth_year status_eq]": 52,
    "[birth_year status_neq]": 62,
    "[city_any email_domain]": 21,
    "[city_any email_gt]": 26,
    "[city_any email_lt]": 31,
    "[city_any fname_any]": 10,
    "[city_any fname_null]": 16,
    "[city_any interests_any]": 23,
    "[city_any interests_contains]": 19,
    "[city_any phone_code]": 7,
    "[city_any phone_null]": 12,
    "[city_any sex_eq]": 197,
    "[city_any sname_null]": 15,
    "[city_any sname_starts]": 14,
    "[city_any status_eq]": 16,
    "[city_any status_neq]": 12,
    "[city_eq email_domain]": 25,
    "[city_eq email_gt]": 41,
    "[city_eq email_lt]": 37,
    "[city_eq fname_any]": 12,
    "[city_eq fname_null]": 15,
    "[city_eq interests_any]": 19,
    "[city_eq interests_contains]": 15,
    "[city_eq phone_code]": 13,
    "[city_eq phone_null]": 16,
    "[city_eq sex_eq]": 201,
    "[city_eq sname_null]": 15,
    "[city_eq sname_starts]": 13,
    "[city_eq status_eq]": 21,
    "[city_eq status_neq]": 13,
    "[city_null email_domain]": 29,
    "[city_null email_gt]": 27,
    "[city_null email_lt]": 21,
    "[city_null fname_any]": 11,
    "[city_null fname_null]": 15,
    "[city_null interests_any]": 20,
    "[city_null interests_contains]": 22,
    "[city_null phone_code]": 8,
    "[city_null phone_null]": 8,
    "[city_null sex_eq]": 194,
    "[city_null sname_null]": 18,
    "[city_null sname_starts]": 16,
    "[city_null status_eq]": 15,
    "[city_null status_neq]": 21,
    "[country_eq email_domain]": 76,
    "[country_eq email_gt]": 75,
    "[country_eq email_lt]": 78,
    "[country_eq fname_any]": 30,
    "[country_eq fname_null]": 37,
    "[country_eq interests_any]": 70,
    "[country_eq interests_contains]": 54,
    "[country_eq phone_code]": 33,
    "[country_eq phone_null]": 26,
    "[country_eq sex_eq]": 482,
    "[country_eq sname_null]": 51,
    "[country_eq sname_starts]": 35,
    "[country_eq status_eq]": 45,
    "[country_eq status_neq]": 36,
    "[country_null email_domain]": 57,
    "[country_null email_gt]": 69,
    "[country_null email_lt]": 62,
    "[country_null fname_any]": 35,
    "[country_null fname_null]": 33,
    "[country_null interests_any]": 48,
    "[country_null interests_contains]": 41,
    "[country_null phone_code]": 31,
    "[country_null phone_null]": 27,
    "[country_null sex_eq]": 472,
    "[country_null sname_null]": 37,
    "[country_null sname_starts]": 43,
    "[country_null status_eq]": 37,
    "[country_null status_neq]": 30,
    "[email_domain sex_eq]": 122,
    "[email_gt sex_eq]": 145,
    "[email_lt sex_eq]": 146,
    "[fname_any sex_eq]": 64,
    "[fname_null sex_eq]": 64,
    "[interests_any likes_contains]": 120,
    "[interests_any premium_now]": 68,
    "[interests_any premium_null]": 65,
    "[interests_any sex_eq]": 278,
    "[interests_any status_eq]": 108,
    "[interests_any status_neq]": 110,
    "[interests_contains likes_contains]": 130,
    "[interests_contains premium_now]": 74,
    "[interests_contains premium_null]": 78,
    "[interests_contains sex_eq]": 285,
    "[interests_contains status_eq]": 97,
    "[interests_contains status_neq]": 97,
    "[likes_contains premium_now]": 93,
    "[likes_contains premium_null]": 117,
    "[likes_contains status_eq]": 126,
    "[likes_contains status_neq]": 129,
    "[phone_code sex_eq]": 47,
    "[phone_null sex_eq]": 55,
    "[premium_now sex_eq]": 146,
    "[premium_null sex_eq]": 116,
    "[sex_eq sname_null]": 66,
    "[sex_eq sname_starts]": 77,
    "[sex_eq status_eq]": 252,
    "[sex_eq status_neq]": 269
  },
  "3": {
    "[birth_gt city_any sex_eq]": 25,
    "[birth_gt city_any status_eq]": 7,
    "[birth_gt city_any status_neq]": 5,
    "[birth_gt city_eq sex_eq]": 25,
    "[birth_gt city_eq status_eq]": 6,
    "[birth_gt city_eq status_neq]": 6,
    "[birth_gt city_null sex_eq]": 37,
    "[birth_gt city_null status_eq]": 1,
    "[birth_gt city_null status_neq]": 2,
    "[birth_gt country_eq sex_eq]": 67,
    "[birth_gt country_eq status_eq]": 13,
    "[birth_gt country_eq status_neq]": 10,
    "[birth_gt country_null sex_eq]": 55,
    "[birth_gt country_null status_eq]": 12,
    "[birth_gt country_null status_neq]": 12,
    "[birth_gt likes_contains premium_now]": 34,
    "[birth_gt likes_contains premium_null]": 28,
    "[birth_gt likes_contains status_eq]": 41,
    "[birth_gt likes_contains status_neq]": 42,
    "[birth_gt premium_now sex_eq]": 41,
    "[birth_gt premium_null sex_eq]": 46,
    "[birth_gt sex_eq status_eq]": 81,
    "[birth_gt sex_eq status_neq]": 75,
    "[birth_lt city_any sex_eq]": 20,
    "[birth_lt city_any status_eq]": 4,
    "[birth_lt city_any status_neq]": 4,
    "[birth_lt city_eq sex_eq]": 32,
    "[birth_lt city_eq status_eq]": 6,
    "[birth_lt city_eq status_neq]": 5,
    "[birth_lt city_null sex_eq]": 23,
    "[birth_lt city_null status_eq]": 10,
    "[birth_lt city_null status_neq]": 8,
    "[birth_lt country_eq sex_eq]": 69,
    "[birth_lt country_eq status_eq]": 21,
    "[birth_lt country_eq status_neq]": 16,
    "[birth_lt country_null sex_eq]": 57,
    "[birth_lt country_null status_eq]": 11,
    "[birth_lt country_null status_neq]": 17,
    "[birth_lt likes_contains premium_now]": 38,
    "[birth_lt likes_contains premium_null]": 26,
    "[birth_lt likes_contains status_eq]": 44,
    "[birth_lt likes_contains status_neq]": 39,
    "[birth_lt premium_now sex_eq]": 56,
    "[birth_lt premium_null sex_eq]": 36,
    "[birth_lt sex_eq status_eq]": 80,
    "[birth_lt sex_eq status_neq]": 80,
    "[birth_year city_any sex_eq]": 25,
    "[birth_year city_any status_eq]": 2,
    "[birth_year city_any status_neq]": 5,
    "[birth_year city_eq sex_eq]": 21,
    "[birth_year city_eq status_eq]": 6,
    "[birth_year city_eq status_neq]": 7,
    "[birth_year city_null sex_eq]": 21,
    "[birth_year city_null status_eq]": 6,
    "[birth_year city_null status_neq]": 7,
    "[birth_year country_eq sex_eq]": 61,
    "[birth_year country_eq status_eq]": 11,
    "[birth_year country_eq status_neq]": 8,
    "[birth_year country_null sex_eq]": 70,
    "[birth_year country_null status_eq]": 14,
    "[birth_year country_null status_neq]": 14,
    "[birth_year likes_contains premium_now]": 36,
    "[birth_year likes_contains premium_null]": 27,
    "[birth_year likes_contains status_eq]": 41,
    "[birth_year likes_contains status_neq]": 38,
    "[birth_year premium_now sex_eq]": 32,
    "[birth_year premium_null sex_eq]": 41,
    "[birth_year sex_eq status_eq]": 97,
    "[birth_year sex_eq status_neq]": 72,
    "[city_any email_domain sex_eq]": 83,
    "[city_any email_gt sex_eq]": 82,
    "[city_any email_lt sex_eq]": 51,
    "[city_any fname_any sex_eq]": 37,
    "[city_any fname_null sex_eq]": 34,
    "[city_any interests_any sex_eq]": 41,
    "[city_any interests_any status_eq]": 11,
    "[city_any interests_any status_neq]": 10,
    "[city_any interests_contains sex_eq]": 70,
    "[city_any interests_contains status_eq]": 11,
    "[city_any interests_contains status_neq]": 14,
    "[city_any phone_code sex_eq]": 18,
    "[city_any phone_null sex_eq]": 29,
    "[city_any sex_eq sname_null]": 44,
    "[city_any sex_eq sname_starts]": 35,
    "[city_any sex_eq status_eq]": 38,
    "[city_any sex_eq status_neq]": 46,
    "[city_eq email_domain sex_eq]": 61,
    "[city_eq email_gt sex_eq]": 67,
    "[city_eq email_lt sex_eq]": 73,
    "[city_eq fname_any sex_eq]": 42,
    "[city_eq fname_null sex_eq]": 49,
    "[city_eq interests_any sex_eq]": 60,
    "[city_eq interests_any status_eq]": 16,
    "[city_eq interests_any status_neq]": 16,
    "[city_eq interests_contains sex_eq]": 67,
    "[city_eq interests_contains status_eq]": 12,
    "[city_eq interests_contains status_neq]": 12,
    "[city_eq phone_code sex_eq]": 22,
    "[city_eq phone_null sex_eq]": 33,
    "[city_eq sex_eq sname_null]": 39,
    "[city_eq sex_eq sname_starts]": 41,
    "[city_eq sex_eq status_eq]": 40,
    "[city_eq sex_eq status_neq]": 36,
    "[city_null email_domain sex_eq]": 73,
    "[city_null email_gt sex_eq]": 62,
    "[city_null email_lt sex_eq]": 67,
    "[city_null fname_any sex_eq]": 33,
    "[city_null fname_null sex_eq]": 36,
    "[city_null interests_any sex_eq]": 48,
    "[city_null interests_any status_eq]": 12,
    "[city_null interests_any status_neq]": 11,
    "[city_null interests_contains sex_eq]": 54,
    "[city_null interests_contains status_eq]": 19,
    "[city_null interests_contains status_neq]": 13,
    "[city_null phone_code sex_eq]": 27,
    "[city_null phone_null sex_eq]": 33,
    "[city_null sex_eq sname_null]": 34,
    "[city_null sex_eq sname_starts]": 40,
    "[city_null sex_eq status_eq]": 33,
    "[city_null sex_eq status_neq]": 32,
    "[country_eq email_domain sex_eq]": 162,
    "[country_eq email_gt sex_eq]": 184,
    "[country_eq email_lt sex_eq]": 139,
    "[country_eq fname_any sex_eq]": 101,
    "[country_eq fname_null sex_eq]": 89,
    "[country_eq interests_any sex_eq]": 136,
    "[country_eq interests_any status_eq]": 23,
    "[country_eq interests_any status_neq]": 30,
    "[country_eq interests_contains sex_eq]": 123,
    "[country_eq interests_contains status_eq]": 26,
    "[country_eq interests_contains status_neq]": 21,
    "[country_eq phone_code sex_eq]": 69,
    "[country_eq phone_null sex_eq]": 62,
    "[country_eq sex_eq sname_null]": 79,
    "[country_eq sex_eq sname_starts]": 78,
    "[country_eq sex_eq status_eq]": 94,
    "[country_eq sex_eq status_neq]": 104,
    "[country_null email_domain sex_eq]": 172,
    "[country_null email_gt sex_eq]": 165,
    "[country_null email_lt sex_eq]": 179,
    "[country_null fname_any sex_eq]": 88,
    "[country_null fname_null sex_eq]": 75,
    "[country_null interests_any sex_eq]": 144,
    "[country_null interests_any status_eq]": 21,
    "[country_null interests_any status_neq]": 30,
    "[country_null interests_contains sex_eq]": 140,
    "[country_null interests_contains status_eq]": 31,
    "[country_null interests_contains status_neq]": 34,
    "[country_null phone_code sex_eq]": 68,
    "[country_null phone_null sex_eq]": 65,
    "[country_null sex_eq sname_null]": 82,
    "[country_null sex_eq sname_starts]": 77,
    "[country_null sex_eq status_eq]": 108,
    "[country_null sex_eq status_neq]": 95,
    "[interests_any likes_contains premium_now]": 63,
    "[interests_any likes_contains premium_null]": 75,
    "[interests_any likes_contains status_eq]": 85,
    "[interests_any likes_contains status_neq]": 84,
    "[interests_any premium_now sex_eq]": 85,
    "[interests_any premium_null sex_eq]": 85,
    "[interests_any sex_eq status_eq]": 189,
    "[interests_any sex_eq status_neq]": 185,
    "[interests_contains likes_contains premium_now]": 48,
    "[interests_contains likes_contains premium_null]": 60,
    "[interests_contains likes_contains status_eq]": 106,
    "[interests_contains likes_contains status_neq]": 102,
    "[interests_contains premium_now sex_eq]": 84,
    "[interests_contains premium_null sex_eq]": 80,
    "[interests_contains sex_eq status_eq]": 178,
    "[interests_contains sex_eq status_neq]": 186
  },
  "4": {
    "[birth_gt city_any sex_eq status_eq]": 13,
    "[birth_gt city_any sex_eq status_neq]": 14,
    "[birth_gt city_eq sex_eq status_eq]": 10,
    "[birth_gt city_eq sex_eq status_neq]": 17,
    "[birth_gt city_null sex_eq status_eq]": 17,
    "[birth_gt city_null sex_eq status_neq]": 6,
    "[birth_gt country_eq sex_eq status_eq]": 27,
    "[birth_gt country_eq sex_eq status_neq]": 32,
    "[birth_gt country_null sex_eq status_eq]": 37,
    "[birth_gt country_null sex_eq status_neq]": 39,
    "[birth_lt city_any sex_eq status_eq]": 14,
    "[birth_lt city_any sex_eq status_neq]": 12,
    "[birth_lt city_eq sex_eq status_eq]": 7,
    "[birth_lt city_eq sex_eq status_neq]": 8,
    "[birth_lt city_null sex_eq status_eq]": 12,
    "[birth_lt city_null sex_eq status_neq]": 10,
    "[birth_lt country_eq sex_eq status_eq]": 32,
    "[birth_lt country_eq sex_eq status_neq]": 30,
    "[birth_lt country_null sex_eq status_eq]": 20,
    "[birth_lt country_null sex_eq status_neq]": 31,
    "[birth_year city_any sex_eq status_eq]": 6,
    "[birth_year city_any sex_eq status_neq]": 9,
    "[birth_year city_eq sex_eq status_eq]": 12,
    "[birth_year city_eq sex_eq status_neq]": 15,
    "[birth_year city_null sex_eq status_eq]": 18,
    "[birth_year city_null sex_eq status_neq]": 8,
    "[birth_year country_eq sex_eq status_eq]": 31,
    "[birth_year country_eq sex_eq status_neq]": 33,
    "[birth_year country_null sex_eq status_eq]": 25,
    "[birth_year country_null sex_eq status_neq]": 26,
    "[city_any interests_any sex_eq status_eq]": 30,
    "[city_any interests_any sex_eq status_neq]": 24,
    "[city_any interests_contains sex_eq status_eq]": 33,
    "[city_any interests_contains sex_eq status_neq]": 30,
    "[city_eq interests_any sex_eq status_eq]": 24,
    "[city_eq interests_any sex_eq status_neq]": 28,
    "[city_eq interests_contains sex_eq status_eq]": 20,
    "[city_eq interests_contains sex_eq status_neq]": 23,
    "[city_null interests_any sex_eq status_eq]": 28,
    "[city_null interests_any sex_eq status_neq]": 21,
    "[city_null interests_contains sex_eq status_eq]": 27,
    "[city_null interests_contains sex_eq status_neq]": 34,
    "[country_eq interests_any sex_eq status_eq]": 62,
    "[country_eq interests_any sex_eq status_neq]": 63,
    "[country_eq interests_contains sex_eq status_eq]": 72,
    "[country_eq interests_contains sex_eq status_neq]": 56,
    "[country_null interests_any sex_eq status_eq]": 69,
    "[country_null interests_any sex_eq status_neq]": 62,
    "[country_null interests_contains sex_eq status_eq]": 61,
    "[country_null interests_contains sex_eq status_neq]": 72
  }
}
