[gd_scene load_steps=3 format=2]

[ext_resource path="res://Scripts/InventoryBar.cs" type="Script" id=1]
[ext_resource path="res://Sprites/bric_wall.png" type="Texture" id=2]

[node name="InventoryBar" type="Control"]
anchor_left = 0.5
anchor_top = 1.0
anchor_right = 0.5
anchor_bottom = 1.0
script = ExtResource( 1 )

[node name="TextureRect" type="TextureRect" parent="."]
anchor_left = 0.5
anchor_top = 1.0
anchor_right = 0.5
anchor_bottom = 1.0
margin_left = -200.0
margin_top = -60.0
margin_right = 170.0
margin_bottom = -10.0
grow_horizontal = 2
grow_vertical = 0
texture = ExtResource( 2 )
expand = true
stretch_mode = 7

[node name="ItemHolder" type="HBoxContainer" parent="TextureRect"]
anchor_right = 1.0
anchor_bottom = 1.0
margin_left = 10.0
margin_top = 5.0
margin_right = -10.0
margin_bottom = -5.0
